gump-general mailing list archives

Site index · List index
Message view « Date » · « Thread »
Top « Date » · « Thread »
From g...@vmgump.apache.org
Subject BATCH: All dressed up, with nowhere to go...
Date Tue, 27 Oct 2009 05:38:51 GMT
Dear Gumpmeisters,
            
The following 36 notifys should have been sent

*********************************************************** G U M P
[GUMP@vmgump]: Module hudson success, but with warnings.
[GUMP@vmgump]: Project nant (in module nant) failed
[GUMP@vmgump]: Project bsf-api (in module jakarta-bsf3) failed
[GUMP@vmgump]: Project gsbase (in module gsbase) failed
[GUMP@vmgump]: Project gsbase-test (in module gsbase) failed
[GUMP@vmgump]: Module apr-util success, but with warnings.
[GUMP@vmgump]: Project commons-collections (in module commons-collections-3.x) failed
[GUMP@vmgump]: Module jdom success, but with warnings.
[GUMP@vmgump]: Project commons-lang-2.x-test (in module commons-lang-2.x) failed
[GUMP@vmgump]: Project jmock2 (in module jmock2) failed
[GUMP@vmgump]: Project apr-iconv-configure (in module apr-iconv) failed
[GUMP@vmgump]: Project derby (in module db-derby) failed
[GUMP@vmgump]: Project dotnet-antlib-test (in module ant-antlibs) failed
[GUMP@vmgump]: Project jython (in module jython) failed
[GUMP@vmgump]: Project jaxen-test (in module jaxen) failed
[GUMP@vmgump]: Project logging-log4cxx-configure (in module logging-log4cxx) failed
[GUMP@vmgump]: Module tomcat-jasper_tc6 success, but with warnings.
[GUMP@vmgump]: Project emma (in module emma) failed
[GUMP@vmgump]: Project slf4j-test (in module slf4j) failed
[GUMP@vmgump]: Project jetty-test (in module jetty) failed
[GUMP@vmgump]: Project xstream (in module xstream) failed
[GUMP@vmgump]: Project commons-jci (in module apache-commons) failed
[GUMP@vmgump]: Project groovy (in module groovy) failed
[GUMP@vmgump]: Project castor-xml-test (in module castor) failed
[GUMP@vmgump]: Project httpcomponents-core-tests (in module httpcomponents) failed
[GUMP@vmgump]: Project mina-test (in module mina) failed
[GUMP@vmgump]: Project ws-axis2 (in module ws-axis2) failed
[GUMP@vmgump]: Project castor-core-test (in module castor) failed
[GUMP@vmgump]: Project ws-commons-axiom-test (in module ws-axis2-commons) failed
[GUMP@vmgump]: Project castor-test (in module castor) failed
[GUMP@vmgump]: Project tapestry (in module tapestry) failed
[GUMP@vmgump]: Project cocoon (in module cocoon) failed
[GUMP@vmgump]: Project kerberos-common (in module kerberos-shared) failed
[GUMP@vmgump]: Project ldap-protocol (in module ldap-protocol) failed
[GUMP@vmgump]: Project apacheds-shared-test (in module apacheds) failed
[GUMP@vmgump]: Project maven-directory-plugin (in module apacheds) failed
*********************************************************** G U M P
[GUMP@vmgump]: Module hudson success, but with warnings.
To whom it may engage...
        
This is an automated request, but not an unsolicited one. For 
more information please visit http://gump.apache.org/nagged.html, 
and/or contact the folk at general@gump.apache.org.

Module hudson contains errors.
The current state of this module is 'Success'.

Full details are available at:
    http://vmgump.apache.org/gump/public/hudson/index.html

That said, some information snippets are provided here.

The following annotations (debug/informational/warning/error messages) were provided:
 -ERROR- *** Failed to update from source control.Stale contents ***



The following work was performed:
http://vmgump.apache.org/gump/public/hudson/gump_work/update_hudson.html
Work Name: update_hudson (Type: Update)
Work ended in a state of : Failed
Elapsed: 
Command Line: svn --quiet update --non-interactive --username guest --password guest hudson 
[Working Directory: /srv/gump/public/workspace/cvs]
---------------------------------------------
svn: Working copy 'hudson' locked
svn: run 'svn cleanup' to remove locks (type 'svn help cleanup' for details)
---------------------------------------------

To subscribe to this information via syndicated feeds:
- RSS: http://vmgump.apache.org/gump/public/hudson/rss.xml
- Atom: http://vmgump.apache.org/gump/public/hudson/atom.xml

============================== Gump Tracking Only ===
Produced by Gump version 2.3.
Gump Run 07000027102009, vmgump:vmgump-public:07000027102009
Gump E-mail Identifier (unique within run) #1.

*********************************************************** G U M P
[GUMP@vmgump]: Project nant (in module nant) failed
To whom it may engage...
        
This is an automated request, but not an unsolicited one. For 
more information please visit http://gump.apache.org/nagged.html, 
and/or contact the folk at general@gump.apache.org.

Project nant has an issue affecting its community integration.
This issue affects 1 projects,
 and has been outstanding for 98 runs.
The current state of this project is 'Failed', with reason 'Build Failed'.
For reference only, the following projects are affected by this:
    - nant :  NAnt is a free .NET build tool. In theory it is kind of like...


Full details are available at:
    http://vmgump.apache.org/gump/public/nant/nant/index.html

That said, some information snippets are provided here.

The following annotations (debug/informational/warning/error messages) were provided:
 -INFO- Failed with reason build failed



The following work was performed:
http://vmgump.apache.org/gump/public/nant/nant/gump_work/build_nant_nant.html
Work Name: build_nant_nant (Type: Build)
Work ended in a state of : Failed
Elapsed: 3 secs
Command Line: make 
[Working Directory: /srv/gump/public/workspace/nant]
---------------------------------------------
mkdir -p bootstrap
cp -R lib/ bootstrap/lib
# Mono loads log4net before privatebinpath is set-up, so we need this in the same directory
# as NAnt.exe
cp lib/common/neutral/log4net.dll bootstrap
cp src/NAnt.Console/App.config bootstrap/NAnt.exe.config
mcs -target:exe -define:MONO -out:bootstrap/NAnt.exe -r:bootstrap/log4net.dll \
		-recurse:src/NAnt.Console/*.cs src/CommonAssemblyInfo.cs
resgen  src/NAnt.Core/Resources/Strings.resx bootstrap/NAnt.Core.Resources.Strings.resources
make: resgen: Command not found
make: *** [bootstrap/NAnt.Core.dll] Error 127
---------------------------------------------

To subscribe to this information via syndicated feeds:
- RSS: http://vmgump.apache.org/gump/public/nant/nant/rss.xml
- Atom: http://vmgump.apache.org/gump/public/nant/nant/atom.xml

============================== Gump Tracking Only ===
Produced by Gump version 2.3.
Gump Run 07000027102009, vmgump:vmgump-public:07000027102009
Gump E-mail Identifier (unique within run) #2.

*********************************************************** G U M P
[GUMP@vmgump]: Project bsf-api (in module jakarta-bsf3) failed
To whom it may engage...
        
This is an automated request, but not an unsolicited one. For 
more information please visit http://gump.apache.org/nagged.html, 
and/or contact the folk at general@gump.apache.org.

Project bsf-api has an issue affecting its community integration.
This issue affects 1 projects,
 and has been outstanding for 48 runs.
The current state of this project is 'Failed', with reason 'Build Failed'.
For reference only, the following projects are affected by this:
    - bsf-api :  Bean Scripting Framework


Full details are available at:
    http://vmgump.apache.org/gump/public/jakarta-bsf3/bsf-api/index.html

That said, some information snippets are provided here.

The following annotations (debug/informational/warning/error messages) were provided:
 -DEBUG- (Gump generated) Maven2 Settings in: /srv/gump/public/workspace/jakarta-bsf3/bsf-api/gump_mvn_settings.xml
 -INFO- Failed with reason build failed
 -DEBUG- Maven POM in: /srv/gump/public/workspace/jakarta-bsf3/bsf-api/pom.xml
 -DEBUG- Extracted fallback artifacts from Gump Repository



The following work was performed:
http://vmgump.apache.org/gump/public/jakarta-bsf3/bsf-api/gump_work/build_jakarta-bsf3_bsf-api.html
Work Name: build_jakarta-bsf3_bsf-api (Type: Build)
Work ended in a state of : Failed
Elapsed: 1 min 6 secs
Command Line: mvn --batch-mode --settings /srv/gump/public/workspace/jakarta-bsf3/bsf-api/gump_mvn_settings.xml package 
[Working Directory: /srv/gump/public/workspace/jakarta-bsf3/bsf-api]
CLASSPATH: /usr/lib/jvm/java-6-sun/lib/tools.jar:/srv/gump/public/workspace/commons-lang-2.x/target/commons-lang-2.4.jar:/srv/gump/public/workspace/junit/dist/junit-27102009.jar
---------------------------------------------
Downloading: http://localhost:8192/maven2/org/apache/maven/surefire/surefire-providers/2.4.3/surefire-providers-2.4.3.pom
Downloading: http://localhost:8192/maven2/org/apache/maven/surefire/surefire-junit/2.4.3/surefire-junit-2.4.3.jar
Downloading: http://localhost:8192/maven2/junit/junit/3.8.1/junit-3.8.1.jar
233K downloaded
[INFO] Surefire report directory: /srv/gump/public/workspace/jakarta-bsf3/bsf-api/target/surefire-reports

-------------------------------------------------------
 T E S T S
-------------------------------------------------------
Running org.apache.bsf.ScriptEngineManagerTest
Tests run: 11, Failures: 0, Errors: 4, Skipped: 0, Time elapsed: 0.127 sec <<< FAILURE!
Running org.apache.bsf.SimpleBindingsTest
Tests run: 3, Failures: 0, Errors: 1, Skipped: 0, Time elapsed: 0.01 sec <<< FAILURE!
Running org.apache.bsf.ScriptExceptionTest
Tests run: 4, Failures: 0, Errors: 2, Skipped: 0, Time elapsed: 0.01 sec <<< FAILURE!
Running org.apache.bsf.SimpleScriptContextTest
Tests run: 5, Failures: 0, Errors: 1, Skipped: 0, Time elapsed: 0.011 sec <<< FAILURE!
Running org.apache.bsf.AbstractScriptEngineTest
Tests run: 7, Failures: 0, Errors: 3, Skipped: 0, Time elapsed: 0.022 sec <<< FAILURE!

Results :

Tests in error: 
  testGetPut(org.apache.bsf.ScriptEngineManagerTest)
  testRegisterEngineExtension(org.apache.bsf.ScriptEngineManagerTest)
  testRegisterEngineName(org.apache.bsf.ScriptEngineManagerTest)
  testRegisterEngineMimeType(org.apache.bsf.ScriptEngineManagerTest)
  testValid(org.apache.bsf.SimpleBindingsTest)
  testException1(org.apache.bsf.ScriptExceptionTest)
  testException2(org.apache.bsf.ScriptExceptionTest)
  testBindings(org.apache.bsf.SimpleScriptContextTest)
  testGetBindings(org.apache.bsf.AbstractScriptEngineTest)
  testgetScriptContext(org.apache.bsf.AbstractScriptEngineTest)
  testPutGet(org.apache.bsf.AbstractScriptEngineTest)

Tests run: 30, Failures: 0, Errors: 11, Skipped: 0

[INFO] ------------------------------------------------------------------------
[ERROR] BUILD FAILURE
[INFO] ------------------------------------------------------------------------
[INFO] There are test failures.

Please refer to /srv/gump/public/workspace/jakarta-bsf3/bsf-api/target/surefire-reports for the individual test results.
[INFO] ------------------------------------------------------------------------
[INFO] For more information, run Maven with the -e switch
[INFO] ------------------------------------------------------------------------
[INFO] Total time: 1 minute 4 seconds
[INFO] Finished at: Mon Oct 26 23:48:23 PST 2009
[INFO] Final Memory: 7M/22M
[INFO] ------------------------------------------------------------------------
---------------------------------------------

To subscribe to this information via syndicated feeds:
- RSS: http://vmgump.apache.org/gump/public/jakarta-bsf3/bsf-api/rss.xml
- Atom: http://vmgump.apache.org/gump/public/jakarta-bsf3/bsf-api/atom.xml

============================== Gump Tracking Only ===
Produced by Gump version 2.3.
Gump Run 07000027102009, vmgump:vmgump-public:07000027102009
Gump E-mail Identifier (unique within run) #4.

*********************************************************** G U M P
[GUMP@vmgump]: Project gsbase (in module gsbase) failed
To whom it may engage...
        
This is an automated request, but not an unsolicited one. For 
more information please visit http://gump.apache.org/nagged.html, 
and/or contact the folk at general@gump.apache.org.

Project gsbase has an issue affecting its community integration.
This issue affects 2 projects,
 and has been outstanding for 21 runs.
The current state of this project is 'Failed', with reason 'Build Failed'.
For reference only, the following projects are affected by this:
    - gsbase :  A collection of java utility classes
    - htmlunit :  A tool for testing web based applications


Full details are available at:
    http://vmgump.apache.org/gump/public/gsbase/gsbase/index.html

That said, some information snippets are provided here.

The following annotations (debug/informational/warning/error messages) were provided:
 -DEBUG- Sole output [gsbase-27102009.jar] identifier set to project name
 -DEBUG- (Gump generated) Maven Properties in: /srv/gump/public/workspace/gsbase/build.properties
 -INFO- Failed with reason build failed
 -DEBUG- Maven POM in: /srv/gump/public/workspace/gsbase/project.xml
 -DEBUG- Maven project properties in: /srv/gump/public/workspace/gsbase/project.properties
 -INFO- Failed to extract fallback artifacts from Gump Repository



The following work was performed:
http://vmgump.apache.org/gump/public/gsbase/gsbase/gump_work/build_gsbase_gsbase.html
Work Name: build_gsbase_gsbase (Type: Build)
Work ended in a state of : Failed
Elapsed: 6 secs
Command Line: maven --offline jar 
[Working Directory: /srv/gump/public/workspace/gsbase]
CLASSPATH: /usr/lib/jvm/java-6-sun/lib/tools.jar:/srv/gump/public/workspace/gsbase/target/classes:/srv/gump/public/workspace/junit/dist/junit-27102009.jar:/srv/gump/packages/junitperf-1.8/lib/junitperf.jar
---------------------------------------------
| |\/| / _` \ V / -_) ' \  ~ intelligent projects ~
|_|  |_\__,_|\_/\___|_||_|  v. 1.0.2

build:start:

java:prepare-filesystem:
    [mkdir] Created dir: /srv/gump/public/workspace/gsbase/target/classes

java:compile:
    [echo] Compiling to /srv/gump/public/workspace/gsbase/target/classes
    [echo] 
==========================================================

  NOTE: Targetting JVM 1.6, classes
  will not run on earlier JVMs

==========================================================
          
    [javac] Compiling 66 source files to /srv/gump/public/workspace/gsbase/target/classes
/srv/gump/public/workspace/gsbase/src/java/com/gargoylesoftware/base/resource/jdbc/StatementWrapper.java:65: com.gargoylesoftware.base.resource.jdbc.StatementWrapper is not abstract and does not override abstract method isPoolable() in java.sql.Statement
public class StatementWrapper implements Statement {
       ^
/srv/gump/public/workspace/gsbase/src/java/com/gargoylesoftware/base/resource/jdbc/PreparedStatementWrapper.java:64: com.gargoylesoftware.base.resource.jdbc.PreparedStatementWrapper is not abstract and does not override abstract method setNClob(int,java.io.Reader) in java.sql.PreparedStatement
public class PreparedStatementWrapper
       ^
/srv/gump/public/workspace/gsbase/src/java/com/gargoylesoftware/base/resource/jdbc/ConnectionWrapper.java:77: com.gargoylesoftware.base.resource.jdbc.ConnectionWrapper is not abstract and does not override abstract method createStruct(java.lang.String,java.lang.Object[]) in java.sql.Connection
public final class ConnectionWrapper implements Connection, ManagedResource {
             ^
/srv/gump/public/workspace/gsbase/src/java/com/gargoylesoftware/base/resource/jdbc/CallableStatementWrapper.java:81: com.gargoylesoftware.base.resource.jdbc.CallableStatementWrapper is not abstract and does not override abstract method setNClob(java.lang.String,java.io.Reader) in java.sql.CallableStatement
public final class CallableStatementWrapper
             ^
/srv/gump/public/workspace/gsbase/src/java/com/gargoylesoftware/base/resource/jdbc/DatabaseMetaDataWrapper.java:54: com.gargoylesoftware.base.resource.jdbc.DatabaseMetaDataWrapper is not abstract and does not override abstract method getFunctionColumns(java.lang.String,java.lang.String,java.lang.String,java.lang.String) in java.sql.DatabaseMetaData
public final class DatabaseMetaDataWrapper implements DatabaseMetaData {
             ^
/srv/gump/public/workspace/gsbase/src/java/com/gargoylesoftware/base/resource/jdbc/ResultSetWrapper.java:150: com.gargoylesoftware.base.resource.jdbc.ResultSetWrapper is not abstract and does not override abstract method updateNClob(java.lang.String,java.io.Reader) in java.sql.ResultSet
public final class ResultSetWrapper implements ResultSet {
             ^
Note: Some input files use unchecked or unsafe operations.
Note: Recompile with -Xlint:unchecked for details.
6 errors

BUILD FAILED
File...... /home/gump/.maven/cache/maven-java-plugin-1.5/plugin.jelly
Element... ant:javac
Line...... 63
Column.... 48
Compile failed; see the compiler error output for details.
Total time: 5 seconds
Finished at: Mon Oct 26 23:51:52 PST 2009

---------------------------------------------

To subscribe to this information via syndicated feeds:
- RSS: http://vmgump.apache.org/gump/public/gsbase/gsbase/rss.xml
- Atom: http://vmgump.apache.org/gump/public/gsbase/gsbase/atom.xml

============================== Gump Tracking Only ===
Produced by Gump version 2.3.
Gump Run 07000027102009, vmgump:vmgump-public:07000027102009
Gump E-mail Identifier (unique within run) #5.

*********************************************************** G U M P
[GUMP@vmgump]: Project gsbase-test (in module gsbase) failed
To whom it may engage...
        
This is an automated request, but not an unsolicited one. For 
more information please visit http://gump.apache.org/nagged.html, 
and/or contact the folk at general@gump.apache.org.

Project gsbase-test has an issue affecting its community integration.
This issue affects 1 projects,
 and has been outstanding for 21 runs.
The current state of this project is 'Failed', with reason 'Build Failed'.
For reference only, the following projects are affected by this:
    - gsbase-test :  A collection of java utility classes


Full details are available at:
    http://vmgump.apache.org/gump/public/gsbase/gsbase-test/index.html

That said, some information snippets are provided here.

The following annotations (debug/informational/warning/error messages) were provided:
 -WARNING- Overriding Maven properties: [/srv/gump/public/workspace/gsbase/build.properties]
 -DEBUG- (Gump generated) Maven Properties in: /srv/gump/public/workspace/gsbase/build.properties
 -INFO- Failed with reason build failed
 -DEBUG- Maven POM in: /srv/gump/public/workspace/gsbase/project.xml
 -DEBUG- Maven project properties in: /srv/gump/public/workspace/gsbase/project.properties



The following work was performed:
http://vmgump.apache.org/gump/public/gsbase/gsbase-test/gump_work/build_gsbase_gsbase-test.html
Work Name: build_gsbase_gsbase-test (Type: Build)
Work ended in a state of : Failed
Elapsed: 4 secs
Command Line: maven --offline jar 
[Working Directory: /srv/gump/public/workspace/gsbase]
CLASSPATH: /usr/lib/jvm/java-6-sun/lib/tools.jar:/srv/gump/public/workspace/gsbase/target/classes:/srv/gump/public/workspace/junit/dist/junit-27102009.jar:/srv/gump/packages/junitperf-1.8/lib/junitperf.jar
---------------------------------------------
|  \/  |__ _Apache__ ___
| |\/| / _` \ V / -_) ' \  ~ intelligent projects ~
|_|  |_\__,_|\_/\___|_||_|  v. 1.0.2

build:start:

java:prepare-filesystem:

java:compile:
    [echo] Compiling to /srv/gump/public/workspace/gsbase/target/classes
    [echo] 
==========================================================

  NOTE: Targetting JVM 1.6, classes
  will not run on earlier JVMs

==========================================================
          
    [javac] Compiling 60 source files to /srv/gump/public/workspace/gsbase/target/classes
/srv/gump/public/workspace/gsbase/src/java/com/gargoylesoftware/base/resource/jdbc/StatementWrapper.java:65: com.gargoylesoftware.base.resource.jdbc.StatementWrapper is not abstract and does not override abstract method isPoolable() in java.sql.Statement
public class StatementWrapper implements Statement {
       ^
/srv/gump/public/workspace/gsbase/src/java/com/gargoylesoftware/base/resource/jdbc/PreparedStatementWrapper.java:64: com.gargoylesoftware.base.resource.jdbc.PreparedStatementWrapper is not abstract and does not override abstract method setNClob(int,java.io.Reader) in java.sql.PreparedStatement
public class PreparedStatementWrapper
       ^
/srv/gump/public/workspace/gsbase/src/java/com/gargoylesoftware/base/resource/jdbc/ConnectionWrapper.java:77: com.gargoylesoftware.base.resource.jdbc.ConnectionWrapper is not abstract and does not override abstract method createStruct(java.lang.String,java.lang.Object[]) in java.sql.Connection
public final class ConnectionWrapper implements Connection, ManagedResource {
             ^
/srv/gump/public/workspace/gsbase/src/java/com/gargoylesoftware/base/resource/jdbc/CallableStatementWrapper.java:81: com.gargoylesoftware.base.resource.jdbc.CallableStatementWrapper is not abstract and does not override abstract method setNClob(java.lang.String,java.io.Reader) in java.sql.CallableStatement
public final class CallableStatementWrapper
             ^
/srv/gump/public/workspace/gsbase/src/java/com/gargoylesoftware/base/resource/jdbc/DatabaseMetaDataWrapper.java:54: com.gargoylesoftware.base.resource.jdbc.DatabaseMetaDataWrapper is not abstract and does not override abstract method getFunctionColumns(java.lang.String,java.lang.String,java.lang.String,java.lang.String) in java.sql.DatabaseMetaData
public final class DatabaseMetaDataWrapper implements DatabaseMetaData {
             ^
/srv/gump/public/workspace/gsbase/src/java/com/gargoylesoftware/base/resource/jdbc/ResultSetWrapper.java:150: com.gargoylesoftware.base.resource.jdbc.ResultSetWrapper is not abstract and does not override abstract method updateNClob(java.lang.String,java.io.Reader) in java.sql.ResultSet
public final class ResultSetWrapper implements ResultSet {
             ^
Note: Some input files use unchecked or unsafe operations.
Note: Recompile with -Xlint:unchecked for details.
6 errors

BUILD FAILED
File...... /home/gump/.maven/cache/maven-java-plugin-1.5/plugin.jelly
Element... ant:javac
Line...... 63
Column.... 48
Compile failed; see the compiler error output for details.
Total time: 4 seconds
Finished at: Mon Oct 26 23:52:35 PST 2009

---------------------------------------------

To subscribe to this information via syndicated feeds:
- RSS: http://vmgump.apache.org/gump/public/gsbase/gsbase-test/rss.xml
- Atom: http://vmgump.apache.org/gump/public/gsbase/gsbase-test/atom.xml

============================== Gump Tracking Only ===
Produced by Gump version 2.3.
Gump Run 07000027102009, vmgump:vmgump-public:07000027102009
Gump E-mail Identifier (unique within run) #6.

*********************************************************** G U M P
[GUMP@vmgump]: Module apr-util success, but with warnings.
To whom it may engage...
        
This is an automated request, but not an unsolicited one. For 
more information please visit http://gump.apache.org/nagged.html, 
and/or contact the folk at general@gump.apache.org.

Module apr-util contains errors.
The current state of this module is 'Success'.

Full details are available at:
    http://vmgump.apache.org/gump/public/apr-util/index.html

That said, some information snippets are provided here.

The following annotations (debug/informational/warning/error messages) were provided:
 -ERROR- *** Failed to update from source control.Stale contents ***



The following work was performed:
http://vmgump.apache.org/gump/public/apr-util/gump_work/update_apr-util.html
Work Name: update_apr-util (Type: Update)
Work ended in a state of : Failed
Elapsed: 1 sec
Command Line: svn --quiet update --non-interactive apr-util 
[Working Directory: /srv/gump/public/workspace/cvs]
---------------------------------------------
svn: Target path '/apr/apr-util/trunk' does not exist
---------------------------------------------

To subscribe to this information via syndicated feeds:
- RSS: http://vmgump.apache.org/gump/public/apr-util/rss.xml
- Atom: http://vmgump.apache.org/gump/public/apr-util/atom.xml

============================== Gump Tracking Only ===
Produced by Gump version 2.3.
Gump Run 07000027102009, vmgump:vmgump-public:07000027102009
Gump E-mail Identifier (unique within run) #7.

*********************************************************** G U M P
[GUMP@vmgump]: Project commons-collections (in module commons-collections-3.x) failed
To whom it may engage...
        
This is an automated request, but not an unsolicited one. For 
more information please visit http://gump.apache.org/nagged.html, 
and/or contact the folk at general@gump.apache.org.

Project commons-collections has an issue affecting its community integration.
This issue affects 236 projects,
 and has been outstanding for 79 runs.
The current state of this project is 'Failed', with reason 'Build Failed'.
For reference only, the following projects are affected by this:
    - JacORB :  The free Java implementation of the OMG's CORBA standard.
    - anakia :  Essentially an XML transformation tool, Anakia uses JDOM and...
    - ant-contrib :  Useful little Ant tasks
    - ant-contrib-test :  Useful little Ant tasks
    - ant-embed-optional :  Java based build tool
    - ant-xdocs-proposal :  Java based build tool
    - antbook-diary-core :  Examples to go with Java Development with Ant
    - antbook-sections :  Examples to go with Java Development with Ant
    - apollo :  Apollo Project
    - authx-core :  Apache Authentication and Authorization Framework
    - authx-example :  Apache Authentication and Authorization Framework
    - authx-jdbc :  Apache Authentication and Authorization Framework
    - authx-script :  Apache Authentication and Authorization Framework
    - authx-script-test :  Apache Authentication and Authorization Framework
    - bootstrap-excalibur-pool-impl :  Repository of reusable components.
    - cddlm :  Configuration and Deployment of Grid Applications and System...
    - checkstyle :  Java style checker
    - commons-beanutils :  Bean Utilities
    - commons-beanutils-core :  Apache Commons
    - commons-betwixt :  Commons Betwixt Package
    - commons-chain :  GoF "Chain of Responsibility" pattern
    - commons-collections :  Collections
    - commons-collections-testframework :  Apache Commons Collections 3.x
    - commons-dbcp :  Database Connection Pool
    - commons-digester :  XML to Java Object Configuration
    - commons-digester-rss :  Digester RSS Example
    - commons-fileupload :  Commons File Upload Package
    - commons-graph :  Apache commons dormant - sandbox components which are inacti...
    - commons-javaflow :  Commons Javaflow
    - commons-jelly :  Commons Jelly
    - commons-jelly-tags-ant :  Commons Jelly
    - commons-jelly-tags-antlr :  Commons Jelly
    - commons-jelly-tags-avalon :  Commons Jelly
    - commons-jelly-tags-bean :  Commons Jelly
    - commons-jelly-tags-beanshell :  Commons Jelly
    - commons-jelly-tags-betwixt :  Commons Jelly
    - commons-jelly-tags-bsf :  Commons Jelly
    - commons-jelly-tags-define :  Commons Jelly
    - commons-jelly-tags-define-test :  Commons Jelly
    - commons-jelly-tags-dynabean :  Commons Jelly
    - commons-jelly-tags-email :  Commons Jelly
    - commons-jelly-tags-fmt :  Commons Jelly
    - commons-jelly-tags-fmt-test :  Commons Jelly
    - commons-jelly-tags-html :  Commons Jelly
    - commons-jelly-tags-http :  Commons Jelly
    - commons-jelly-tags-interaction :  Commons Jelly
    - commons-jelly-tags-jaxme :  Commons Jelly
    - commons-jelly-tags-jface :  Commons Jelly
    - commons-jelly-tags-jms :  Commons Jelly
    - commons-jelly-tags-jmx :  Commons Jelly
    - commons-jelly-tags-jsl :  Commons Jelly
    - commons-jelly-tags-jsl-test :  Commons Jelly
    - commons-jelly-tags-junit :  Commons Jelly
    - commons-jelly-tags-log :  Commons Jelly
    - commons-jelly-tags-memory :  Commons Jelly
    - commons-jelly-tags-ojb :  Commons Jelly
    - commons-jelly-tags-quartz :  Commons Jelly
    - commons-jelly-tags-regexp :  Commons Jelly
    - commons-jelly-tags-soap :  Commons Jelly
    - commons-jelly-tags-sql :  Commons Jelly
    - commons-jelly-tags-swing :  Commons Jelly
    - commons-jelly-tags-swt :  Commons Jelly
    - commons-jelly-tags-threads :  Commons Jelly
    - commons-jelly-tags-util :  Commons Jelly
    - commons-jelly-tags-validate :  Commons Jelly
    - commons-jelly-tags-velocity :  Commons Jelly
    - commons-jelly-tags-xml :  Commons Jelly
    - commons-jelly-tags-xml-test :  Commons Jelly
    - commons-jelly-tags-xmlunit :  Commons Jelly
    - commons-jelly-test :  Commons Jelly
    - commons-jxpath :  XPath traversal of JavaBeans
    - commons-messenger :  A web based JMS framework
    - commons-modeler :  Modeler MBeans
    - commons-pool :  Object Pooling
    - commons-primitives :  Provides a collection of types and utilities optimized for w...
    - commons-services :  Basic Services Architecture
    - commons-transaction :  Commons Identifier Package
    - commons-validator :  Validation Framework
    - commons-vfs-sandbox :  Apache Commons
    - db-ddlutils :  Easy-to-use component for working with Database Definition (...
    - db-ojb :  ObjectRelationalBridge
    - db-ojb-from-packages :  ObjectRelationalBridge
    - db-torque-generator :  Persistence Layer
    - excalibur-component :  Repository of reusable components.
    - excalibur-cornerstone-connection-api :  Repository of reusable components.
    - excalibur-cornerstone-connection-impl :  Repository of reusable components.
    - excalibur-cornerstone-datasources-impl :  Repository of reusable components.
    - excalibur-cornerstone-scheduler-impl :  Repository of reusable components.
    - excalibur-cornerstone-threads-api :  Repository of reusable components.
    - excalibur-cornerstone-threads-impl :  Repository of reusable components.
    - excalibur-datasource :  Repository of reusable components.
    - excalibur-event :  Repository of reusable components.
    - excalibur-event-api :  Repository of reusable components.
    - excalibur-event-impl :  Repository of reusable components.
    - excalibur-fortress-bean :  Repository of reusable components.
    - excalibur-fortress-container-api :  Repository of reusable components.
    - excalibur-fortress-container-impl :  Repository of reusable components.
    - excalibur-fortress-container-test :  Repository of reusable components.
    - excalibur-fortress-examples :  Repository of reusable components.
    - excalibur-fortress-meta :  Repository of reusable components.
    - excalibur-fortress-migration :  Repository of reusable components.
    - excalibur-fortress-platform :  Repository of reusable components.
    - excalibur-fortress-testcase :  Repository of reusable components.
    - excalibur-instrument-api :  Repository of reusable components.
    - excalibur-instrument-client :  Repository of reusable components.
    - excalibur-instrument-mgr-api :  Repository of reusable components.
    - excalibur-instrument-mgr-http :  Repository of reusable components.
    - excalibur-instrument-mgr-impl :  Repository of reusable components.
    - excalibur-lifecycle-api :  Repository of reusable components.
    - excalibur-lifecycle-impl :  Repository of reusable components.
    - excalibur-logger :  Repository of reusable components.
    - excalibur-monitor :  Repository of reusable components.
    - excalibur-pool :  Repository of reusable components.
    - excalibur-pool-api :  Repository of reusable components.
    - excalibur-pool-impl :  Repository of reusable components.
    - excalibur-pool-impl-test :  Repository of reusable components.
    - excalibur-pool-instrumented :  Repository of reusable components.
    - excalibur-sourceresolve :  Repository of reusable components.
    - excalibur-store :  Repository of reusable components.
    - excalibur-store-test :  Repository of reusable components.
    - excalibur-testcase :  Repository of reusable components.
    - excalibur-thread :  Repository of reusable components.
    - excalibur-thread-api :  Repository of reusable components.
    - excalibur-thread-impl :  Repository of reusable components.
    - excalibur-thread-impl-test :  Repository of reusable components.
    - excalibur-thread-instrumented :  Repository of reusable components.
    - excalibur-xmlutil :  Repository of reusable components.
    - excalibur-xmlutil-test :  Repository of reusable components.
    - fulcrum-bsf :  Services Framework
    - fulcrum-cache :  Services Framework
    - fulcrum-cache-test :  Services Framework
    - fulcrum-configuration-impl :  Services Framework
    - fulcrum-crypto :  Services Framework
    - fulcrum-dvsl :  Services Framework
    - fulcrum-factory :  Services Framework
    - fulcrum-hsqldb :  Services Framework
    - fulcrum-intake :  Services Framework
    - fulcrum-localization :  Services Framework
    - fulcrum-mimetype :  Services Framework
    - fulcrum-naming :  Services Framework
    - fulcrum-osworkflow :  Services Framework
    - fulcrum-parser :  Services Framework
    - fulcrum-pool :  Services Framework
    - fulcrum-quartz :  Services Framework
    - fulcrum-quartz-test :  Services Framework
    - fulcrum-security-api :  Services Framework
    - fulcrum-security-memory :  Services Framework
    - fulcrum-security-nt :  Services Framework
    - fulcrum-template :  Services Framework
    - fulcrum-testcontainer :  Services Framework
    - fulcrum-upload :  Services Framework
    - fulcrum-xmlrpc :  Services Framework
    - fulcrum-xslt :  Services Framework
    - fulcrum/fulcrum-testcontainer :  Services Framework
    - invicta :  Open-source build management tool.
    - ivy :  Ivy Core
    - ivy-tests :  Ivy is a tool for managing (recording, tracking, resolving a...
    - jakarta-jmeter-svn :  Pure Java load testing and performance measurement tool.
   ...
    - jakarta-jmeter-test :  Pure Java load testing and performance measurement tool.
   ...
    - jakarta-lucene :  Java Based Search Engine
    - jakarta-taglibs-standard :  Standard Taglib
    - jakarta-tomcat :  Servlet 2.2 and JSP 1.1 Reference Implementation
    - jakarta-tomcat-4.0 :  Servlet 2.3 and JSP 1.2 Reference Implementation
    - jakarta-tomcat-catalina :  Servlet 2.4 Reference Implementation
    - jakarta-tomcat-coyote :  Connectors to various web servers
    - jakarta-tomcat-coyote-tomcat3 :  Connectors to various web servers
    - jakarta-tomcat-coyote-tomcat4 :  Connectors to various web servers
    - jakarta-tomcat-dbcp :  Servlet 2.4 and JSP 2.0 Reference Implementation
    - jakarta-tomcat-http11 :  Connectors to various web servers
    - jakarta-tomcat-jk :  Connectors to various web servers
    - jakarta-turbine-jcs :  Cache
    - james-server :  James Server
    - javax.el :  Java Servlet 2.5 & Server Pages JSP 2.1 implementation (for ...
    - javax.servlet :  Java Servlet 2.5 & Server Pages JSP 2.1 implementation (for ...
    - javax.servlet.jsp :  Java Servlet 2.5 & Server Pages JSP 2.1 implementation (for ...
    - javax.servlet.jsp-in-servlet :  Java Servlet 2.5 & Server Pages JSP 2.1 implementation (for ...
    - lenya :  Content Management System
    - logging-log4cxx-ant :  Apache log4cxx
    - logging-log4cxx-ant-no_wchar_t :  Apache log4cxx
    - logging-log4cxx-ant-static :  Apache log4cxx
    - lucene-java :  Java Based Search Engine
    - maven :  Project Management Tools
    - maven-bootstrap :  Project Management Tools
    - maven-fortress-plugin :  Repository of reusable components.
    - muse :  Muse Project
    - naming-config :  Apache Directory Naming Component
    - naming-config-test :  Apache Directory Naming Component
    - org.apache.velocity.velocity-engine :  Velocity Templating engine
    - poi :  POI
    - portals-bridges-frameworks :  Support for JSR168 compliant Portlet development
    - portals-bridges-struts :  Support for JSR168 compliant Portlet development
    - portals-bridges-velocity :  Support for JSR168 compliant Portlet development
    - portals-jetspeed-1 :  Enterprise Information Portal
    - portals-pluto-portal-1.0 :  JSR168 Container
    - quartz :  Job Scheduler
    - slide-webdavclient :  Content Management System based on WebDAV technology
    - slide-webdavlib :  Content Management System based on WebDAV technology
    - smartfrog :  Smartfrog: Application Deployment from HP Laboratories
    - smartfrog-components :  Smartfrog: Application Deployment from HP Laboratories
    - smartfrog-tasks :  Smartfrog: Application Deployment from HP Laboratories
    - smartfrog-tasks-test :  Smartfrog: Application Deployment from HP Laboratories
    - smartfrog-test :  Smartfrog: Application Deployment from HP Laboratories
    - smartfrog-testharness :  Smartfrog: Application Deployment from HP Laboratories
    - struts-sslext :  The Struts SSL Extension for HTTP/HTTPS switching
    - strutstestcase :  An extension of the standard JUnit TestCase class that provi...
    - test-ojb :  ObjectRelationalBridge
    - tomcat-catalina :  Servlet 2.3 and JSP 1.2 Reference Implementation
    - tomcat-tc6 :  Java Servlet 2.5 & Server Pages JSP 2.1 implementation (for ...
    - tomcat-trunk :  Java Servlet 3.0 & Server Pages JSP 2.1 implementation (for ...
    - tomcat-trunk-dbcp :  Java Servlet 3.0 & Server Pages JSP 2.1 implementation (for ...
    - velocity-anakia :  Anakia uses Apache Velocity to generate documents based on X...
    - velocity-anakia-test :  Anakia uses Apache Velocity to generate documents based on X...
    - velocity-dvsl :  Template engine
    - velocity-engine :  Velocity Templating engine
    - velocity-engine-test :  Velocity Templating engine
    - velocity-texen :  Texen is a general purpose text generating utility based on ...
    - velocity-texen-test :  Texen is a general purpose text generating utility based on ...
    - velocity-tools :  VelocityTools project
    - ws-juddi :  ws-juddi -- UDDI Toolkit/Repository
    - ws-juddi-test :  ws-juddi -- UDDI Toolkit/Repository
    - xdoclet :  Enhanced Doclet engine.
    - xdoclet-apache-module-prepare :  Intermediate target that prepares xdoclet's
    apache modul...
    - xdoclet-bea-module-prepare :  Intermediate target that prepares xdoclet's
    bea module
    - xdoclet-compile-core :  Intermediate target that compiles xdoclet's core
    classes
    - xdoclet-ejb-module-prepare :  Intermediate target that prepares xdoclet's
    ejb module
    - xdoclet-hibernate-module-prepare :  Intermediate target that prepares xdoclet's
    hibernate mo...
    - xdoclet-jdo-module-prepare :  Intermediate target that prepares xdoclet's
    jdo module
    - xdoclet-libelis-module-prepare :  Intermediate target that prepares xdoclet's
    libelis modu...
    - xdoclet-objectweb-module-prepare :  Intermediate target that prepares xdoclet's
    objectweb mo...
    - xdoclet-oracle-module-prepare :  Intermediate target that prepares xdoclet's
    oracle modul...
    - xdoclet-orion-module-prepare :  Intermediate target that prepares xdoclet's
    orion module
    - xdoclet-tjdo-module-prepare :  Intermediate target that prepares xdoclet's
    tjdo module
    - xdoclet-web-module-prepare :  Intermediate target that prepares xdoclet's
    web module
    - xdoclet-xdoclet-module-prepare :  Intermediate target that prepares xdoclet's
    xdoclet modu...
    - xjavadoc :  Enhanced Doclet engine.
    - xml-xindice :  native XML database


Full details are available at:
    http://vmgump.apache.org/gump/public/commons-collections-3.x/commons-collections/index.html

That said, some information snippets are provided here.

The following annotations (debug/informational/warning/error messages) were provided:
 -DEBUG- (Gump generated) Maven2 Settings in: /srv/gump/public/workspace/commons-collections-3.x/gump_mvn_settings.xml
 -INFO- Failed with reason build failed
 -DEBUG- Maven POM in: /srv/gump/public/workspace/commons-collections-3.x/pom.xml
 -DEBUG- Extracted fallback artifacts from Gump Repository



The following work was performed:
http://vmgump.apache.org/gump/public/commons-collections-3.x/commons-collections/gump_work/build_commons-collections-3.x_commons-collections.html
Work Name: build_commons-collections-3.x_commons-collections (Type: Build)
Work ended in a state of : Failed
Elapsed: 1 min 17 secs
Command Line: mvn --batch-mode --settings /srv/gump/public/workspace/commons-collections-3.x/gump_mvn_settings.xml package 
[Working Directory: /srv/gump/public/workspace/commons-collections-3.x]
CLASSPATH: /usr/lib/jvm/java-6-sun/lib/tools.jar:/srv/gump/public/workspace/commons-lang-2.x/target/commons-lang-2.4.jar:/srv/gump/public/workspace/junit/dist/junit-27102009.jar:/srv/gump/public/workspace/ant/dist/lib/ant-jmf.jar:/srv/gump/public/workspace/ant/dist/lib/ant-swing.jar:/srv/gump/public/workspace/ant/dist/lib/ant-apache-resolver.jar:/srv/gump/public/workspace/ant/dist/lib/ant-apache-xalan2.jar:/srv/gump/public/workspace/ant/dist/lib/ant-trax.jar:/srv/gump/public/workspace/ant/dist/lib/ant-junit.jar:/srv/gump/public/workspace/ant/dist/lib/ant-launcher.jar:/srv/gump/public/workspace/ant/dist/lib/ant-nodeps.jar:/srv/gump/public/workspace/ant/dist/lib/ant.jar
---------------------------------------------
[INFO] skip non existing resourceDirectory /srv/gump/public/workspace/commons-collections-3.x/src/test/resources
[INFO] [compiler:testCompile]
[INFO] Compiling 196 source files to /srv/gump/public/workspace/commons-collections-3.x/target/test-classes
[INFO] [surefire:test]
[INFO] Surefire report directory: /srv/gump/public/workspace/commons-collections-3.x/target/surefire-reports

-------------------------------------------------------
 T E S T S
-------------------------------------------------------
Running org.apache.commons.collections.TestAllPackages
Tests run: 13025, Failures: 0, Errors: 19, Skipped: 0, Time elapsed: 35.452 sec <<< FAILURE!

Results :

Tests in error: 
  testGetCardinalityMap(org.apache.commons.collections.TestCollectionUtils)
  testCardinalityOfNull(org.apache.commons.collections.TestCollectionUtils)
  testIntersection(org.apache.commons.collections.TestCollectionUtils)
  testDisjunction(org.apache.commons.collections.TestCollectionUtils)
  testSubtract(org.apache.commons.collections.TestCollectionUtils)
  testFind(org.apache.commons.collections.TestCollectionUtils)
  testNullFactory(org.apache.commons.collections.TestFactoryUtils)
  testConstantFactoryNull(org.apache.commons.collections.TestFactoryUtils)
  testGet(TestDoubleOrderedMap.testGet) 
  testPut(TestDoubleOrderedMap.testPut) 
  testRemove(TestDoubleOrderedMap.testRemove) 
  testGetKeyForValue(TestDoubleOrderedMap.testGetKeyForValue) 
  testRemoveValue(TestDoubleOrderedMap.testRemoveValue) 
  testCollections299(org.apache.commons.collections.TestExtendedProperties)
  testGetSetComparator(org.apache.commons.collections.iterators.TestCollatingIterator) 
  testRemoveLRU(TestLRUMap.testRemoveLRU) 
  testNoMappingReturnsNull(org.apache.commons.collections.map.TestMultiValueMap) 
  testRemoveAllViaIterator(org.apache.commons.collections.map.TestMultiValueMap) 
  testRemoveAllViaKeyedIterator(org.apache.commons.collections.map.TestMultiValueMap) 

Tests run: 13025, Failures: 0, Errors: 19, Skipped: 0

[INFO] ------------------------------------------------------------------------
[ERROR] BUILD FAILURE
[INFO] ------------------------------------------------------------------------
[INFO] There are test failures.

Please refer to /srv/gump/public/workspace/commons-collections-3.x/target/surefire-reports for the individual test results.
[INFO] ------------------------------------------------------------------------
[INFO] For more information, run Maven with the -e switch
[INFO] ------------------------------------------------------------------------
[INFO] Total time: 1 minute 15 seconds
[INFO] Finished at: Tue Oct 27 00:00:50 PST 2009
[INFO] Final Memory: 15M/46M
[INFO] ------------------------------------------------------------------------
---------------------------------------------

To subscribe to this information via syndicated feeds:
- RSS: http://vmgump.apache.org/gump/public/commons-collections-3.x/commons-collections/rss.xml
- Atom: http://vmgump.apache.org/gump/public/commons-collections-3.x/commons-collections/atom.xml

============================== Gump Tracking Only ===
Produced by Gump version 2.3.
Gump Run 07000027102009, vmgump:vmgump-public:07000027102009
Gump E-mail Identifier (unique within run) #8.

*********************************************************** G U M P
[GUMP@vmgump]: Module jdom success, but with warnings.
To whom it may engage...
        
This is an automated request, but not an unsolicited one. For 
more information please visit http://gump.apache.org/nagged.html, 
and/or contact the folk at general@gump.apache.org.

Module jdom contains errors.
The current state of this module is 'Success'.

Full details are available at:
    http://vmgump.apache.org/gump/public/jdom/index.html

That said, some information snippets are provided here.

The following annotations (debug/informational/warning/error messages) were provided:
 -ERROR- *** Failed to update from source control.Stale contents ***



The following work was performed:
http://vmgump.apache.org/gump/public/jdom/gump_work/update_jdom.html
Work Name: update_jdom (Type: Update)
Work ended in a state of : Failed
Elapsed: 3 mins 9 secs
Command Line: cvs -q -z3 -d :pserver:anonymous@cvs.jdom.org:/home/cvspublic update -P -d 
[Working Directory: /srv/gump/public/workspace/cvs/jdom]
---------------------------------------------
cvs [update aborted]: connect to cvs.jdom.org(65.212.180.182):2401 failed: Connection timed out
---------------------------------------------

To subscribe to this information via syndicated feeds:
- RSS: http://vmgump.apache.org/gump/public/jdom/rss.xml
- Atom: http://vmgump.apache.org/gump/public/jdom/atom.xml

============================== Gump Tracking Only ===
Produced by Gump version 2.3.
Gump Run 07000027102009, vmgump:vmgump-public:07000027102009
Gump E-mail Identifier (unique within run) #9.

*********************************************************** G U M P
[GUMP@vmgump]: Project commons-lang-2.x-test (in module commons-lang-2.x) failed
To whom it may engage...
        
This is an automated request, but not an unsolicited one. For 
more information please visit http://gump.apache.org/nagged.html, 
and/or contact the folk at general@gump.apache.org.

Project commons-lang-2.x-test has an issue affecting its community integration.
This issue affects 1 projects,
 and has been outstanding for 56 runs.
The current state of this project is 'Failed', with reason 'Build Failed'.
For reference only, the following projects are affected by this:
    - commons-lang-2.x-test :  Apache Commons Lang 2.x


Full details are available at:
    http://vmgump.apache.org/gump/public/commons-lang-2.x/commons-lang-2.x-test/index.html

That said, some information snippets are provided here.

The following annotations (debug/informational/warning/error messages) were provided:
 -WARNING- Overriding Maven2 settings: [/srv/gump/public/workspace/commons-lang-2.x/gump_mvn_settings.xml]
 -DEBUG- (Gump generated) Maven2 Settings in: /srv/gump/public/workspace/commons-lang-2.x/gump_mvn_settings.xml
 -INFO- Failed with reason build failed
 -DEBUG- Maven POM in: /srv/gump/public/workspace/commons-lang-2.x/pom.xml



The following work was performed:
http://vmgump.apache.org/gump/public/commons-lang-2.x/commons-lang-2.x-test/gump_work/build_commons-lang-2.x_commons-lang-2.x-test.html
Work Name: build_commons-lang-2.x_commons-lang-2.x-test (Type: Build)
Work ended in a state of : Failed
Elapsed: 38 secs
Command Line: mvn --batch-mode --settings /srv/gump/public/workspace/commons-lang-2.x/gump_mvn_settings.xml package 
[Working Directory: /srv/gump/public/workspace/commons-lang-2.x]
CLASSPATH: /usr/lib/jvm/java-6-sun/lib/tools.jar:/srv/gump/public/workspace/commons-lang-2.x/target/commons-lang-2.4.jar:/srv/gump/public/workspace/ant/dist/lib/ant-jmf.jar:/srv/gump/public/workspace/ant/dist/lib/ant-swing.jar:/srv/gump/public/workspace/ant/dist/lib/ant-apache-resolver.jar:/srv/gump/public/workspace/ant/dist/lib/ant-apache-xalan2.jar:/srv/gump/public/workspace/ant/dist/lib/ant-trax.jar:/srv/gump/public/workspace/ant/dist/lib/ant-junit.jar:/srv/gump/public/workspace/ant/dist/lib/ant-launcher.jar:/srv/gump/public/workspace/ant/dist/lib/ant-nodeps.jar:/srv/gump/public/workspace/ant/dist/lib/ant.jar:/srv/gump/public/workspace/junit/dist/junit-27102009.jar
---------------------------------------------
Tests in error: 
  testGetMessageString(org.apache.commons.lang.exception.NestableDelegateTestCase)
  testSetCauseToNull(org.apache.commons.lang.exception.ExceptionUtilsTestCase)
  testAddObjectArrayToObjectArray(org.apache.commons.lang.ArrayUtilsAddTest)
  testRemoveElementObjectArray(org.apache.commons.lang.ArrayUtilsRemoveTest)
  testRemoveElementBooleanArray(org.apache.commons.lang.ArrayUtilsRemoveTest)
  testRemoveElementByteArray(org.apache.commons.lang.ArrayUtilsRemoveTest)
  testRemoveElementCharArray(org.apache.commons.lang.ArrayUtilsRemoveTest)
  testRemoveElementDoubleArray(org.apache.commons.lang.ArrayUtilsRemoveTest)
  testRemoveElementFloatArray(org.apache.commons.lang.ArrayUtilsRemoveTest)
  testRemoveElementIntArray(org.apache.commons.lang.ArrayUtilsRemoveTest)
  testRemoveElementLongArray(org.apache.commons.lang.ArrayUtilsRemoveTest)
  testRemoveElementShortArray(org.apache.commons.lang.ArrayUtilsRemoveTest)
  testArrayIntMap(org.apache.commons.lang.EntitiesTest)
  testBinaryIntMap(org.apache.commons.lang.EntitiesTest)
  testContains(org.apache.commons.lang.IntHashMapTest)
  testClear(org.apache.commons.lang.IntHashMapTest)
  testContainsKey(org.apache.commons.lang.IntHashMapTest)
  testContainsValue(org.apache.commons.lang.IntHashMapTest)
  testIsEmpty(org.apache.commons.lang.IntHashMapTest)
  testPut(org.apache.commons.lang.IntHashMapTest)
  testRemove(org.apache.commons.lang.IntHashMapTest)
  testDeserializeStreamOfNull(org.apache.commons.lang.SerializationUtilsTest)
  testDeserializeBytesOfNull(org.apache.commons.lang.SerializationUtilsTest)
  testCloneNull(org.apache.commons.lang.SerializationUtilsTest)
  testSplitByCharacterType(org.apache.commons.lang.StringUtilsTest)
  testSplitByCharacterTypeCamelCase(org.apache.commons.lang.StringUtilsTest)
  testReplace_StringStringArrayStringArray(org.apache.commons.lang.StringUtilsTest)
  testReplace_StringStringArrayStringArrayBoolean(org.apache.commons.lang.StringUtilsTest)
  testRemoveStart(org.apache.commons.lang.StringUtilsTest)
  testRemoveEnd(org.apache.commons.lang.StringUtilsTest)
  testSubstringsBetween_StringStringString(org.apache.commons.lang.StringUtilsSubstringTest)
  testAbbreviate(org.apache.commons.lang.WordUtilsTest)
  testCloneNotSupportedException(org.apache.commons.lang.text.StrTokenizerTest)

Tests run: 1797, Failures: 0, Errors: 33, Skipped: 0

[INFO] ------------------------------------------------------------------------
[ERROR] BUILD FAILURE
[INFO] ------------------------------------------------------------------------
[INFO] There are test failures.

Please refer to /srv/gump/public/workspace/commons-lang-2.x/target/surefire-reports for the individual test results.
[INFO] ------------------------------------------------------------------------
[INFO] For more information, run Maven with the -e switch
[INFO] ------------------------------------------------------------------------
[INFO] Total time: 35 seconds
[INFO] Finished at: Tue Oct 27 00:19:56 PST 2009
[INFO] Final Memory: 13M/24M
[INFO] ------------------------------------------------------------------------
---------------------------------------------

To subscribe to this information via syndicated feeds:
- RSS: http://vmgump.apache.org/gump/public/commons-lang-2.x/commons-lang-2.x-test/rss.xml
- Atom: http://vmgump.apache.org/gump/public/commons-lang-2.x/commons-lang-2.x-test/atom.xml

============================== Gump Tracking Only ===
Produced by Gump version 2.3.
Gump Run 07000027102009, vmgump:vmgump-public:07000027102009
Gump E-mail Identifier (unique within run) #12.

*********************************************************** G U M P
[GUMP@vmgump]: Project jmock2 (in module jmock2) failed
To whom it may engage...
        
This is an automated request, but not an unsolicited one. For 
more information please visit http://gump.apache.org/nagged.html, 
and/or contact the folk at general@gump.apache.org.

Project jmock2 has an issue affecting its community integration.
This issue affects 1 projects,
 and has been outstanding for 21 runs.
The current state of this project is 'Failed', with reason 'Build Failed'.
For reference only, the following projects are affected by this:
    - jmock2 :  jMock is a library for testing Java code using mock objects.


Full details are available at:
    http://vmgump.apache.org/gump/public/jmock2/jmock2/index.html

That said, some information snippets are provided here.

The following annotations (debug/informational/warning/error messages) were provided:
 -INFO- Failed with reason build failed
 -INFO- Failed to extract fallback artifacts from Gump Repository



The following work was performed:
http://vmgump.apache.org/gump/public/jmock2/jmock2/gump_work/build_jmock2_jmock2.html
Work Name: build_jmock2_jmock2 (Type: Build)
Work ended in a state of : Failed
Elapsed: 13 secs
Command Line: /usr/lib/jvm/java-6-sun/bin/java -Djava.awt.headless=true -Xbootclasspath/p:/srv/gump/public/workspace/xml-xerces2/build/xercesImpl.jar:/srv/gump/public/workspace/xml-commons/java/external/build/xml-apis.jar org.apache.tools.ant.Main -Dgump.merge=/srv/gump/public/gump/work/merge.xml -Dbuild.sysclasspath=only -Dversion=27102009 
[Working Directory: /srv/gump/public/workspace/jmock2]
CLASSPATH: /usr/lib/jvm/java-6-sun/lib/tools.jar:/srv/gump/public/workspace/jmock2/build/classes:/srv/gump/public/workspace/jmock2/lib/objenesis-1.0.jar:/srv/gump/public/workspace/ant/dist/lib/ant-jmf.jar:/srv/gump/public/workspace/ant/dist/lib/ant-swing.jar:/srv/gump/public/workspace/ant/dist/lib/ant-apache-resolver.jar:/srv/gump/public/workspace/ant/dist/lib/ant-apache-xalan2.jar:/srv/gump/public/workspace/ant/dist/lib/ant-trax.jar:/srv/gump/public/workspace/ant/dist/lib/ant-junit.jar:/srv/gump/public/workspace/ant/dist/lib/ant-launcher.jar:/srv/gump/public/workspace/ant/dist/lib/ant-nodeps.jar:/srv/gump/public/workspace/ant/dist/lib/ant.jar:/srv/gump/packages/bsh-2.0b4/bsh-commands-2.0b4.jar:/srv/gump/packages/bsh-2.0b4/bsh-classpath-2.0b4.jar:/srv/gump/packages/bsh-2.0b4/bsh-core-2.0b4.jar:/srv/gump/packages/bsh-2.0b4/bsh-bsf-2.0b4.jar:/srv/gump/packages/bsh-2.0b4/bsh-2.0b4.jar:/srv/gump/packages/bsh-2.0b4/bsh-reflect-2.0b4.jar:/srv/gump/packages/bsh-2.0b4/bsh-util-2.0b4.
 jar:/srv/gump/packages/cglib/cglib-nodep-2.1_3.jar:/srv/gump/public/workspace/hamcrest/hamcrest-java/build/hamcrest-core-27102009.jar:/srv/gump/public/workspace/hamcrest/hamcrest-java/build/hamcrest-library-27102009.jar:/srv/gump/public/workspace/junit/dist/junit-27102009.jar:/srv/gump/packages/junit3.8.1/junit.jar:/srv/gump/public/workspace/xml-commons/java/external/build/xml-apis-ext.jar
---------------------------------------------
    [javac] location: class org.jmock.test.unit.lib.CurrentStateMatcherTest
    [javac]         assertTrue("should match", isNotCurrently("S").matches(stateMachine));
    [javac]         ^
    [javac] /srv/gump/public/workspace/jmock2/test/org/jmock/test/unit/lib/CurrentStateMatcherTest.java:38: cannot find symbol
    [javac] symbol  : method assertTrue(java.lang.String,boolean)
    [javac] location: class org.jmock.test.unit.lib.CurrentStateMatcherTest
    [javac]         assertTrue("should not match", !isCurrentlyS.matches(null));
    [javac]         ^
    [javac] /srv/gump/public/workspace/jmock2/test/org/jmock/test/unit/lib/CurrentStateMatcherTest.java:42: cannot find symbol
    [javac] symbol  : method assertTrue(java.lang.String,boolean)
    [javac] location: class org.jmock.test.unit.lib.CurrentStateMatcherTest
    [javac]         assertTrue("should not match", !isCurrentlyS.matches("something else"));
    [javac]         ^
    [javac] /srv/gump/public/workspace/jmock2/test/org/jmock/test/unit/lib/CurrentStateMatcherTest.java:46: cannot find symbol
    [javac] symbol  : method assertEquals(java.lang.String,java.lang.String)
    [javac] location: class org.jmock.test.unit.lib.CurrentStateMatcherTest
    [javac]         assertEquals("a state machine that is S", asString(isCurrently("S")));
    [javac]         ^
    [javac] /srv/gump/public/workspace/jmock2/test/org/jmock/test/unit/lib/CurrentStateMatcherTest.java:47: cannot find symbol
    [javac] symbol  : method assertEquals(java.lang.String,java.lang.String)
    [javac] location: class org.jmock.test.unit.lib.CurrentStateMatcherTest
    [javac]         assertEquals("a state machine that is not S", asString(isNotCurrently("S")));
    [javac]         ^
    [javac] /srv/gump/public/workspace/jmock2/test/org/jmock/test/unit/lib/CurrentStateMatcherTest.java:53: cannot find symbol
    [javac] symbol  : method assertMismatchDescription(java.lang.String,org.hamcrest.Matcher<org.jmock.States>,org.jmock.States)
    [javac] location: class org.jmock.test.unit.lib.CurrentStateMatcherTest
    [javac]         assertMismatchDescription("was not S", isCurrently("S"), stateMachine);
    [javac]         ^
    [javac] /srv/gump/public/workspace/jmock2/test/org/jmock/test/unit/lib/CurrentStateMatcherTest.java:56: method does not override or implement a method from a supertype
    [javac]     @Override
    [javac]     ^
    [javac] /srv/gump/public/workspace/jmock2/test/org/jmock/test/unit/support/SyntheticEmptyInterfaceClassLoader.java:35: cannot find symbol
    [javac] symbol  : variable COMPUTE_MAXS
    [javac] location: class net.sf.cglib.asm.ClassWriter
    [javac]         ClassWriter writer = new ClassWriter(ClassWriter.COMPUTE_MAXS);
    [javac]                                                         ^
    [javac] /srv/gump/public/workspace/jmock2/test/org/jmock/test/unit/support/SyntheticEmptyInterfaceClassLoader.java:35: internal error; cannot instantiate ClassWriter(boolean) at net.sf.cglib.asm.ClassWriter to ()
    [javac]         ClassWriter writer = new ClassWriter(ClassWriter.COMPUTE_MAXS);
    [javac]                              ^
    [javac] /srv/gump/public/workspace/jmock2/test/org/jmock/test/unit/support/SyntheticEmptyInterfaceClassLoader.java:36: visit(int,int,java.lang.String,java.lang.String,java.lang.String[],java.lang.String) in net.sf.cglib.asm.ClassWriter cannot be applied to (int,int,java.lang.String,<nulltype>,java.lang.String,<nulltype>)
    [javac]                 writer.visit(CLASS_FORMAT_VERSION,
    [javac]                       ^
    [javac] Note: /srv/gump/public/workspace/jmock2/src/org/jmock/integration/junit4/JMock.java uses or overrides a deprecated API.
    [javac] Note: Recompile with -Xlint:deprecation for details.
    [javac] 21 errors

BUILD FAILED
/srv/gump/public/workspace/jmock2/build.xml:61: Compile failed; see the compiler error output for details.

Total time: 12 seconds
---------------------------------------------

To subscribe to this information via syndicated feeds:
- RSS: http://vmgump.apache.org/gump/public/jmock2/jmock2/rss.xml
- Atom: http://vmgump.apache.org/gump/public/jmock2/jmock2/atom.xml

============================== Gump Tracking Only ===
Produced by Gump version 2.3.
Gump Run 07000027102009, vmgump:vmgump-public:07000027102009
Gump E-mail Identifier (unique within run) #13.

*********************************************************** G U M P
[GUMP@vmgump]: Project apr-iconv-configure (in module apr-iconv) failed
To whom it may engage...
        
This is an automated request, but not an unsolicited one. For 
more information please visit http://gump.apache.org/nagged.html, 
and/or contact the folk at general@gump.apache.org.

Project apr-iconv-configure has an issue affecting its community integration.
This issue affects 2 projects,
 and has been outstanding for 181 runs.
The current state of this project is 'Failed', with reason 'Build Failed'.
For reference only, the following projects are affected by this:
    - apr-iconv-configure :  Apache Portable Runtime
    - apr-iconv-make :  Apache Portable Runtime


Full details are available at:
    http://vmgump.apache.org/gump/public/apr-iconv/apr-iconv-configure/index.html

That said, some information snippets are provided here.

The following annotations (debug/informational/warning/error messages) were provided:
 -INFO- Failed with reason build failed



The following work was performed:
http://vmgump.apache.org/gump/public/apr-iconv/apr-iconv-configure/gump_work/buildscript_apr-iconv_apr-iconv-configure.html
Work Name: buildscript_apr-iconv_apr-iconv-configure (Type: Build)
Work ended in a state of : Failed
Elapsed: 1 sec
Command Line: /srv/gump/public/workspace/apr-iconv/configure --with-apr=/srv/gump/public/workspace/apr/dest-27102009 --prefix=/srv/gump/public/workspace/apr-iconv/dest-27102009 
[Working Directory: /srv/gump/public/workspace/apr-iconv]
---------------------------------------------
checking for gawk... no
checking for mawk... mawk
checking for a BSD-compatible install... /usr/bin/install -c
checking for APR... configure: error: the --with-apr parameter is incorrect. It must specify an install prefix, a build directory, or an apr-config file.
---------------------------------------------

To subscribe to this information via syndicated feeds:
- RSS: http://vmgump.apache.org/gump/public/apr-iconv/apr-iconv-configure/rss.xml
- Atom: http://vmgump.apache.org/gump/public/apr-iconv/apr-iconv-configure/atom.xml

============================== Gump Tracking Only ===
Produced by Gump version 2.3.
Gump Run 07000027102009, vmgump:vmgump-public:07000027102009
Gump E-mail Identifier (unique within run) #16.

*********************************************************** G U M P
[GUMP@vmgump]: Project derby (in module db-derby) failed
To whom it may engage...
        
This is an automated request, but not an unsolicited one. For 
more information please visit http://gump.apache.org/nagged.html, 
and/or contact the folk at general@gump.apache.org.

Project derby has an issue affecting its community integration.
This issue affects 1 projects,
 and has been outstanding for 21 runs.
The current state of this project is 'Failed', with reason 'Build Failed'.
For reference only, the following projects are affected by this:
    - derby :  Apache Derby, 100% Java relational database.


Full details are available at:
    http://vmgump.apache.org/gump/public/db-derby/derby/index.html

That said, some information snippets are provided here.

The following annotations (debug/informational/warning/error messages) were provided:
 -INFO- Failed with reason build failed
 -INFO- Failed to extract fallback artifacts from Gump Repository



The following work was performed:
http://vmgump.apache.org/gump/public/db-derby/derby/gump_work/build_db-derby_derby.html
Work Name: build_db-derby_derby (Type: Build)
Work ended in a state of : Failed
Elapsed: 1 min 15 secs
Command Line: /usr/lib/jvm/java-6-sun/bin/java -Djava.awt.headless=true -Xbootclasspath/p:/srv/gump/public/workspace/xml-commons/java/external/build/xml-apis.jar:/srv/gump/public/workspace/xml-xerces2/build/xercesImpl.jar:/srv/gump/public/workspace/xml-xalan/build/serializer.jar:/srv/gump/public/workspace/xml-xalan/build/xalan-unbundled.jar org.apache.tools.ant.Main -Dgump.merge=/srv/gump/public/gump/work/merge.xml -Dbuild.sysclasspath=only -Dsane=false gump_all 
[Working Directory: /srv/gump/public/workspace/db-derby]
CLASSPATH: /usr/lib/jvm/java-6-sun/lib/tools.jar:/srv/gump/public/workspace/db-derby/classes:/srv/gump/public/workspace/ant/dist/lib/ant-jmf.jar:/srv/gump/public/workspace/ant/dist/lib/ant-swing.jar:/srv/gump/public/workspace/ant/dist/lib/ant-apache-resolver.jar:/srv/gump/public/workspace/ant/dist/lib/ant-apache-xalan2.jar:/srv/gump/public/workspace/ant/dist/lib/ant-trax.jar:/srv/gump/public/workspace/ant/dist/lib/ant-junit.jar:/srv/gump/public/workspace/ant/dist/lib/ant-launcher.jar:/srv/gump/public/workspace/ant/dist/lib/ant-nodeps.jar:/srv/gump/public/workspace/ant/dist/lib/ant.jar:/srv/gump/public/workspace/xml-commons/java/external/build/xml-apis-ext.jar:/srv/gump/public/workspace/jakarta-servletapi-5/jsr154/dist/lib/servlet-api.jar:/srv/gump/public/workspace/jakarta-oro/jakarta-oro-27102009.jar:/srv/gump/packages/javacc-3.1/bin/lib/javacc.jar:/srv/gump/public/workspace/junit/dist/junit-27102009.jar
---------------------------------------------
engine_169:

compile_reference:
    [javac] Compiling 11 source files to /srv/gump/public/workspace/db-derby/classes
    [javac] Compiling 2 source files to /srv/gump/public/workspace/db-derby/classes

compile_authentication:
    [javac] Compiling 2 source files to /srv/gump/public/workspace/db-derby/classes

authentication:

compile_security:
    [javac] Compiling 2 source files to /srv/gump/public/workspace/db-derby/classes

security:

compile_mbeans:
    [javac] Compiling 4 source files to /srv/gump/public/workspace/db-derby/classes

compile_io:

storage:

compile_iapi_error_jsr169:

compile_reference:
    [javac] Compiling 2 source files to /srv/gump/public/workspace/db-derby/classes

compile_util:

compile_types:
    [javac] Compiling 1 source file to /srv/gump/public/workspace/db-derby/classes
    [javac] /srv/gump/public/workspace/db-derby/java/engine/org/apache/derby/impl/jdbc/EmbedStatement.java:60: org.apache.derby.impl.jdbc.EmbedStatement is not abstract and does not override abstract method isWrapperFor(java.lang.Class) in java.sql.Wrapper
    [javac] public class EmbedStatement extends ConnectionChild
    [javac]        ^
    [javac] /srv/gump/public/workspace/db-derby/java/engine/org/apache/derby/impl/jdbc/EmbedResultSetMetaData.java:59: org.apache.derby.impl.jdbc.EmbedResultSetMetaData is not abstract and does not override abstract method isWrapperFor(java.lang.Class) in java.sql.Wrapper
    [javac] public class EmbedResultSetMetaData
    [javac]        ^
    [javac] /srv/gump/public/workspace/db-derby/java/engine/org/apache/derby/impl/jdbc/EmbedDatabaseMetaData.java:88: org.apache.derby.impl.jdbc.EmbedDatabaseMetaData is not abstract and does not override abstract method autoCommitFailureClosesAllResultSets() in java.sql.DatabaseMetaData
    [javac] public class EmbedDatabaseMetaData extends ConnectionChild 
    [javac]        ^
    [javac] 3 errors

BUILD FAILED
/srv/gump/public/workspace/db-derby/build.xml:452: The following error occurred while executing this line:
/srv/gump/public/workspace/db-derby/java/engine/build.xml:79: The following error occurred while executing this line:
/srv/gump/public/workspace/db-derby/java/engine/org/apache/derby/iapi/build.xml:65: The following error occurred while executing this line:
/srv/gump/public/workspace/db-derby/java/engine/org/apache/derby/iapi/types/build.xml:53: Compile failed; see the compiler error output for details.

Total time: 1 minute 14 seconds
---------------------------------------------

To subscribe to this information via syndicated feeds:
- RSS: http://vmgump.apache.org/gump/public/db-derby/derby/rss.xml
- Atom: http://vmgump.apache.org/gump/public/db-derby/derby/atom.xml

============================== Gump Tracking Only ===
Produced by Gump version 2.3.
Gump Run 07000027102009, vmgump:vmgump-public:07000027102009
Gump E-mail Identifier (unique within run) #18.

*********************************************************** G U M P
[GUMP@vmgump]: Project dotnet-antlib-test (in module ant-antlibs) failed
To whom it may engage...
        
This is an automated request, but not an unsolicited one. For 
more information please visit http://gump.apache.org/nagged.html, 
and/or contact the folk at general@gump.apache.org.

Project dotnet-antlib-test has an issue affecting its community integration.
This issue affects 1 projects,
 and has been outstanding for 21 runs.
The current state of this project is 'Failed', with reason 'Build Failed'.
For reference only, the following projects are affected by this:
    - dotnet-antlib-test :  Task and Type Libraries for Apache Ant


Full details are available at:
    http://vmgump.apache.org/gump/public/ant-antlibs/dotnet-antlib-test/index.html

That said, some information snippets are provided here.

The following annotations (debug/informational/warning/error messages) were provided:
 -INFO- Failed with reason build failed



The following work was performed:
http://vmgump.apache.org/gump/public/ant-antlibs/dotnet-antlib-test/gump_work/build_ant-antlibs_dotnet-antlib-test.html
Work Name: build_ant-antlibs_dotnet-antlib-test (Type: Build)
Work ended in a state of : Failed
Elapsed: 13 secs
Command Line: /usr/lib/jvm/java-6-sun/bin/java -Djava.awt.headless=true -Xbootclasspath/p:/srv/gump/public/workspace/xml-xerces2/build/xercesImpl.jar:/srv/gump/public/workspace/xml-commons/java/external/build/xml-apis.jar org.apache.tools.ant.Main -Dgump.merge=/srv/gump/public/gump/work/merge.xml -Dbuild.sysclasspath=only -Dant-testutil.jar=/srv/gump/public/workspace/ant/build/lib/ant-testutil.jar test 
[Working Directory: /srv/gump/public/workspace/ant-antlibs/dotnet]
CLASSPATH: /usr/lib/jvm/java-6-sun/lib/tools.jar:/srv/gump/public/workspace/ant-antlibs/dotnet/build/test-classes:/srv/gump/public/workspace/ant/dist/lib/ant-jmf.jar:/srv/gump/public/workspace/ant/dist/lib/ant-swing.jar:/srv/gump/public/workspace/ant/dist/lib/ant-apache-resolver.jar:/srv/gump/public/workspace/ant/dist/lib/ant-apache-xalan2.jar:/srv/gump/public/workspace/ant/dist/lib/ant-trax.jar:/srv/gump/public/workspace/ant/dist/lib/ant-junit.jar:/srv/gump/public/workspace/ant/dist/lib/ant-launcher.jar:/srv/gump/public/workspace/ant/dist/lib/ant-nodeps.jar:/srv/gump/public/workspace/ant/dist/lib/ant.jar:/srv/gump/public/workspace/ant-antlibs/antunit/build/ant-antunit-27102009.jar:/srv/gump/public/workspace/ant-antlibs/dotnet/build/ant-dotnet-27102009.jar:/srv/gump/public/workspace/xml-commons/java/external/build/xml-apis-ext.jar
---------------------------------------------
[au:antunit] 	at line 96, column 37
[au:antunit] 	Message: Needed .net apps are missing
[au:antunit] 	took 0.022 sec
[au:antunit] Target: testBothSrc  caused an ERROR
[au:antunit] 	at line 96, column 37
[au:antunit] 	Message: Needed .net apps are missing
[au:antunit] 	took 0.011 sec
[au:antunit] Target: testSchemaFileMustHaveOneOptionOnly  caused an ERROR
[au:antunit] 	at line 96, column 37
[au:antunit] 	Message: Needed .net apps are missing
[au:antunit] 	took 0.006 sec
[au:antunit] Target: testLocalWsdl  caused an ERROR
[au:antunit] 	at line 96, column 37
[au:antunit] 	Message: Needed .net apps are missing
[au:antunit] 	took 0.009 sec
[au:antunit] Target: testSrcIsDir  caused an ERROR
[au:antunit] 	at line 96, column 37
[au:antunit] 	Message: Needed .net apps are missing
[au:antunit] 	took 0.006 sec
[au:antunit] Target: testLocalWsdlServerVB  caused an ERROR
[au:antunit] 	at line 96, column 37
[au:antunit] 	Message: Needed .net apps are missing
[au:antunit] 	took 0 sec
[au:antunit] Target: testLocalWsdlServer  caused an ERROR
[au:antunit] 	at line 96, column 37
[au:antunit] 	Message: Needed .net apps are missing
[au:antunit] 	took 0.011 sec
[au:antunit] Target: testNoSrc  caused an ERROR
[au:antunit] 	at line 96, column 37
[au:antunit] 	Message: Needed .net apps are missing
[au:antunit] 	took 0.023 sec
[au:antunit] Target: testSchemaFileMustExist  caused an ERROR
[au:antunit] 	at line 96, column 37
[au:antunit] 	Message: Needed .net apps are missing
[au:antunit] 	took 0.008 sec
[au:antunit] Target: testInvalidExtraOpsVB  caused an ERROR
[au:antunit] 	at line 96, column 37
[au:antunit] 	Message: Needed .net apps are missing
[au:antunit] 	took 0.017 sec
[au:antunit] Target: testDestIsDir  caused an ERROR
[au:antunit] 	at line 96, column 37
[au:antunit] 	Message: Needed .net apps are missing
[au:antunit] 	took 0.006 sec

test:

BUILD FAILED
/srv/gump/public/workspace/ant-antlibs/dotnet/common/build.xml:223: At least one AntUnit test has failed.

Total time: 13 seconds
---------------------------------------------

To subscribe to this information via syndicated feeds:
- RSS: http://vmgump.apache.org/gump/public/ant-antlibs/dotnet-antlib-test/rss.xml
- Atom: http://vmgump.apache.org/gump/public/ant-antlibs/dotnet-antlib-test/atom.xml

============================== Gump Tracking Only ===
Produced by Gump version 2.3.
Gump Run 07000027102009, vmgump:vmgump-public:07000027102009
Gump E-mail Identifier (unique within run) #19.

*********************************************************** G U M P
[GUMP@vmgump]: Project jython (in module jython) failed
To whom it may engage...
        
This is an automated request, but not an unsolicited one. For 
more information please visit http://gump.apache.org/nagged.html, 
and/or contact the folk at general@gump.apache.org.

Project jython has an issue affecting its community integration.
This issue affects 1 projects,
 and has been outstanding for 21 runs.
The current state of this project is 'Failed', with reason 'Build Failed'.
For reference only, the following projects are affected by this:
    - jython :  Java Python


Full details are available at:
    http://vmgump.apache.org/gump/public/jython/jython/index.html

That said, some information snippets are provided here.

The following annotations (debug/informational/warning/error messages) were provided:
 -DEBUG- Sole output [jython-dev.jar] identifier set to project name
 -INFO- Made directory [/srv/gump/public/workspace/jython/build/classes]
 -INFO- Failed with reason build failed
 -INFO- Failed to extract fallback artifacts from Gump Repository



The following work was performed:
http://vmgump.apache.org/gump/public/jython/jython/gump_work/build_jython_jython.html
Work Name: build_jython_jython (Type: Build)
Work ended in a state of : Failed
Elapsed: 1 min 6 secs
Command Line: /usr/lib/jvm/java-6-sun/bin/java -Djava.awt.headless=true -Xbootclasspath/p:/srv/gump/public/workspace/xml-commons/java/external/build/xml-apis.jar:/srv/gump/public/workspace/xml-xerces2/build/xercesImpl.jar org.apache.tools.ant.Main -Dgump.merge=/srv/gump/public/gump/work/merge.xml -Dbuild.sysclasspath=only -DdistDir=dist -DoutputDir=build jar 
[Working Directory: /srv/gump/public/workspace/jython]
CLASSPATH: /usr/lib/jvm/java-6-sun/lib/tools.jar:/srv/gump/public/workspace/jython/build/classes:/srv/gump/public/workspace/jython/extlibs/constantine-0.4.jar:/srv/gump/public/workspace/jython/extlibs/jna.jar:/srv/gump/public/workspace/jython/extlibs/jna-posix.jar:/srv/gump/public/workspace/jython/extlibs/libreadline-java-0.8.jar:/srv/gump/public/workspace/ant/dist/lib/ant-jmf.jar:/srv/gump/public/workspace/ant/dist/lib/ant-swing.jar:/srv/gump/public/workspace/ant/dist/lib/ant-apache-resolver.jar:/srv/gump/public/workspace/ant/dist/lib/ant-apache-xalan2.jar:/srv/gump/public/workspace/ant/dist/lib/ant-trax.jar:/srv/gump/public/workspace/ant/dist/lib/ant-junit.jar:/srv/gump/public/workspace/ant/dist/lib/ant-launcher.jar:/srv/gump/public/workspace/ant/dist/lib/ant-nodeps.jar:/srv/gump/public/workspace/ant/dist/lib/ant.jar:/srv/gump/packages/junit3.8.1/junit.jar:/srv/gump/public/workspace/xml-commons/java/build/resolver.jar:/srv/gump/packages/antlr/antlr-3.1.3.jar:/srv/gump/publi
 c/workspace/asm/output/dist/lib/asm-commons-27102009.jar:/srv/gump/public/workspace/asm/output/dist/lib/asm-27102009.jar:/srv/gump/public/workspace/jakarta-servletapi-5/jsr154/dist/lib/servlet-api.jar:/srv/gump/public/workspace/jline/target/jline-0.9.95-SNAPSHOT.jar:/srv/gump/public/workspace/junit/dist/junit-27102009.jar:/srv/gump/public/workspace/xml-commons/java/external/build/xml-apis-ext.jar
---------------------------------------------
    [javac] location: class org.python.modules.posix.PosixModule
    [javac]                 throw Py.OSError(file.isDirectory() ? Errno.EISDIR : Errno.ENOENT, path);
    [javac]                                                                      ^
    [javac] /srv/gump/public/workspace/jython/src/org/python/modules/posix/PosixModule.java:370: cannot find symbol
    [javac] symbol  : class Constant
    [javac] location: class org.python.modules.posix.PosixModule
    [javac]         Constant errno = Errno.valueOf(code);
    [javac]         ^
    [javac] /srv/gump/public/workspace/jython/src/org/python/modules/posix/PosixModule.java:370: cannot find symbol
    [javac] symbol  : variable Errno
    [javac] location: class org.python.modules.posix.PosixModule
    [javac]         Constant errno = Errno.valueOf(code);
    [javac]                          ^
    [javac] /srv/gump/public/workspace/jython/src/org/python/modules/posix/PosixModule.java:371: cannot find symbol
    [javac] symbol  : variable Errno
    [javac] location: class org.python.modules.posix.PosixModule
    [javac]         if (errno == Errno.__UNKNOWN_CONSTANT__) {
    [javac]                      ^
    [javac] /srv/gump/public/workspace/jython/src/org/python/modules/posix/PosixModule.java:377: package com.kenai.constantine.platform.linux does not exist
    [javac]             errno = Enum.valueOf(com.kenai.constantine.platform.linux.Errno.class,
    [javac]                                                                      ^
    [javac] /srv/gump/public/workspace/jython/src/org/python/modules/posix/PosixModule.java:434: cannot find symbol
    [javac] symbol  : variable Errno
    [javac] location: class org.python.modules.posix.PosixModule
    [javac]         throw Py.OSError(Errno.EBADF);
    [javac]                          ^
    [javac] /srv/gump/public/workspace/jython/src/org/python/modules/posix/PythonPOSIXHandler.java:23: cannot find symbol
    [javac] symbol  : variable ConstantSet
    [javac] location: class org.python.modules.posix.PythonPOSIXHandler
    [javac]     private ConstantSet errnos = ConstantSet.getConstantSet("Errno");
    [javac]                                  ^
    [javac] /srv/gump/public/workspace/jython/src/org/python/modules/posix/PythonPOSIXHandler.java:26: cannot find symbol
    [javac] symbol  : class Constant
    [javac] location: class org.python.modules.posix.PythonPOSIXHandler
    [javac]         Constant errno = errnos.getConstant(error.name());
    [javac]         ^
    [javac] /srv/gump/public/workspace/jython/src/org/python/util/JLineConsole.java:46: package Errno does not exist
    [javac]             Arrays.asList(Errno.EINTR.description(), Errno.EIO.description());
    [javac]                                ^
    [javac] /srv/gump/public/workspace/jython/src/org/python/util/JLineConsole.java:46: package Errno does not exist
    [javac]             Arrays.asList(Errno.EINTR.description(), Errno.EIO.description());
    [javac]                                                           ^
    [javac] Note: Some input files use unchecked or unsafe operations.
    [javac] Note: Recompile with -Xlint:unchecked for details.
    [javac] 48 errors

BUILD FAILED
/srv/gump/public/workspace/jython/build.xml:474: Compile failed; see the compiler error output for details.

Total time: 1 minute 5 seconds
---------------------------------------------

To subscribe to this information via syndicated feeds:
- RSS: http://vmgump.apache.org/gump/public/jython/jython/rss.xml
- Atom: http://vmgump.apache.org/gump/public/jython/jython/atom.xml

============================== Gump Tracking Only ===
Produced by Gump version 2.3.
Gump Run 07000027102009, vmgump:vmgump-public:07000027102009
Gump E-mail Identifier (unique within run) #21.

*********************************************************** G U M P
[GUMP@vmgump]: Project jaxen-test (in module jaxen) failed
To whom it may engage...
        
This is an automated request, but not an unsolicited one. For 
more information please visit http://gump.apache.org/nagged.html, 
and/or contact the folk at general@gump.apache.org.

Project jaxen-test has an issue affecting its community integration.
This issue affects 1 projects,
 and has been outstanding for 21 runs.
The current state of this project is 'Failed', with reason 'Build Failed'.
For reference only, the following projects are affected by this:
    - jaxen-test :  Universal Java XPath Engine


Full details are available at:
    http://vmgump.apache.org/gump/public/jaxen/jaxen-test/index.html

That said, some information snippets are provided here.

The following annotations (debug/informational/warning/error messages) were provided:
 -WARNING- Overriding Maven properties: [/srv/gump/public/workspace/jaxen/build.properties]
 -DEBUG- (Gump generated) Maven Properties in: /srv/gump/public/workspace/jaxen/build.properties
 -INFO- Failed with reason build failed
 -DEBUG- Maven POM in: /srv/gump/public/workspace/jaxen/project.xml
 -DEBUG- Maven project properties in: /srv/gump/public/workspace/jaxen/project.properties
 -INFO- Project Reports in: /srv/gump/public/workspace/jaxen/target/test-reports



The following work was performed:
http://vmgump.apache.org/gump/public/jaxen/jaxen-test/gump_work/build_jaxen_jaxen-test.html
Work Name: build_jaxen_jaxen-test (Type: Build)
Work ended in a state of : Failed
Elapsed: 1 min 13 secs
Command Line: maven --offline test 
[Working Directory: /srv/gump/public/workspace/jaxen]
CLASSPATH: /usr/lib/jvm/java-6-sun/lib/tools.jar:/srv/gump/public/workspace/jaxen/target/test-classes:/srv/gump/public/workspace/jaxen/target/jaxen-27102009.jar:/srv/gump/public/workspace/dom4j/build/dom4j.jar:/srv/gump/public/workspace/ant/dist/lib/ant-jmf.jar:/srv/gump/public/workspace/ant/dist/lib/ant-swing.jar:/srv/gump/public/workspace/ant/dist/lib/ant-apache-resolver.jar:/srv/gump/public/workspace/ant/dist/lib/ant-apache-xalan2.jar:/srv/gump/public/workspace/ant/dist/lib/ant-trax.jar:/srv/gump/public/workspace/ant/dist/lib/ant-junit.jar:/srv/gump/public/workspace/ant/dist/lib/ant-launcher.jar:/srv/gump/public/workspace/ant/dist/lib/ant-nodeps.jar:/srv/gump/public/workspace/ant/dist/lib/ant.jar:/srv/gump/public/workspace/jdom/build/jdom.jar:/srv/gump/public/workspace/junit/dist/junit-27102009.jar:/srv/gump/packages/maven-cobertura-plugin/maven-cobertura-plugin-1.1.jar:/srv/gump/packages/maven-findbugs-plugin/maven-findbugs-plugin-0.9.1.jar:/srv/gump/public/workspace/xml-
 commons/java/external/build/xml-apis-ext.jar:/srv/gump/packages/xom-1.1/xom-1.1b3.jar:/srv/gump/public/workspace/xom/build/xom-27102009.jar
---------------------------------------------
    [junit] Running org.jaxen.test.PrecedingSiblingAxisIteratorTest
    [junit] Tests run: 2, Failures: 0, Errors: 0, Time elapsed: 0.215 sec
    [junit] Running org.jaxen.test.SubstringTest
    [junit] Tests run: 20, Failures: 0, Errors: 0, Time elapsed: 0.333 sec
    [junit] Running org.jaxen.test.XPathSyntaxExceptionTest
    [junit] Tests run: 3, Failures: 0, Errors: 0, Time elapsed: 0.379 sec
    [junit] Running org.jaxen.test.StringLengthTest
    [junit] Tests run: 8, Failures: 0, Errors: 0, Time elapsed: 0.665 sec
    [junit] Running org.jaxen.test.SumTest
    [junit] Tests run: 2, Failures: 0, Errors: 0, Time elapsed: 0.29 sec
    [junit] Running org.jaxen.test.BinaryExprTest
    [junit] Tests run: 1, Failures: 0, Errors: 0, Time elapsed: 0.262 sec
    [junit] Running org.jaxen.test.NameTest
    [junit] Tests run: 9, Failures: 0, Errors: 0, Time elapsed: 0.377 sec
    [junit] Running org.jaxen.test.DefaultXPathExprTest
    [junit] Tests run: 3, Failures: 0, Errors: 0, Time elapsed: 0.309 sec
    [junit] Running org.jaxen.test.LocalNameTest
    [junit] Tests run: 10, Failures: 0, Errors: 0, Time elapsed: 0.383 sec
    [junit] Running org.jaxen.test.PriorityTest
    [junit] Tests run: 8, Failures: 0, Errors: 0, Time elapsed: 0.243 sec
    [junit] Running org.jaxen.test.FollowingAxisIteratorTest
    [junit] Tests run: 2, Failures: 0, Errors: 0, Time elapsed: 0.196 sec
    [junit] Running org.jaxen.test.NotTest
    [junit] Tests run: 7, Failures: 0, Errors: 0, Time elapsed: 0.29 sec
    [junit] Running org.jaxen.test.BaseXPathTest
    [junit] Tests run: 69, Failures: 0, Errors: 1, Time elapsed: 0.644 sec
    [junit] [ERROR] TEST org.jaxen.test.BaseXPathTest FAILED
    [junit] Running org.jaxen.test.SimpleVariableContextTest
    [junit] Tests run: 2, Failures: 0, Errors: 0, Time elapsed: 0.257 sec
    [junit] Running org.jaxen.test.PatternHandlerTest
    [junit] Tests run: 2, Failures: 0, Errors: 0, Time elapsed: 0.296 sec
    [junit] Running org.jaxen.test.NamespaceTest
    [junit] Tests run: 8, Failures: 0, Errors: 0, Time elapsed: 0.289 sec
    [junit] Running org.jaxen.test.SimpleNamespaceContextTest
    [junit] Tests run: 5, Failures: 0, Errors: 1, Time elapsed: 0.25 sec
    [junit] [ERROR] TEST org.jaxen.test.SimpleNamespaceContextTest FAILED
    [junit] Running org.jaxen.test.NodesetEqualityTest
    [junit] Tests run: 10, Failures: 0, Errors: 0, Time elapsed: 0.317 sec
    [junit] Running org.jaxen.test.NormalizeSpaceTest
    [junit] Tests run: 4, Failures: 0, Errors: 0, Time elapsed: 0.29 sec

BUILD FAILED
File...... /home/gump/.maven/cache/maven-test-plugin-1.6.2/plugin.jelly
Element... fail
Line...... 181
Column.... 54
There were test failures.
Total time: 1 minutes 13 seconds
Finished at: Tue Oct 27 00:59:02 PST 2009

---------------------------------------------

To subscribe to this information via syndicated feeds:
- RSS: http://vmgump.apache.org/gump/public/jaxen/jaxen-test/rss.xml
- Atom: http://vmgump.apache.org/gump/public/jaxen/jaxen-test/atom.xml

============================== Gump Tracking Only ===
Produced by Gump version 2.3.
Gump Run 07000027102009, vmgump:vmgump-public:07000027102009
Gump E-mail Identifier (unique within run) #24.

*********************************************************** G U M P
[GUMP@vmgump]: Project logging-log4cxx-configure (in module logging-log4cxx) failed
To whom it may engage...
        
This is an automated request, but not an unsolicited one. For 
more information please visit http://gump.apache.org/nagged.html, 
and/or contact the folk at general@gump.apache.org.

Project logging-log4cxx-configure has an issue affecting its community integration.
This issue affects 3 projects,
 and has been outstanding for 181 runs.
The current state of this project is 'Failed', with reason 'Build Failed'.
For reference only, the following projects are affected by this:
    - logging-log4cxx-configure :  Apache log4cxx
    - logging-log4cxx-make :  Apache log4cxx
    - logging-log4cxx-make-install :  Apache log4cxx


Full details are available at:
    http://vmgump.apache.org/gump/public/logging-log4cxx/logging-log4cxx-configure/index.html

That said, some information snippets are provided here.

The following annotations (debug/informational/warning/error messages) were provided:
 -DEBUG- Dependency on apr-make-install exists, no need to add for property --with-apr.
 -DEBUG- Dependency on apr-util-make-install exists, no need to add for property --with-apr-util.
 -INFO- Failed with reason build failed



The following work was performed:
http://vmgump.apache.org/gump/public/logging-log4cxx/logging-log4cxx-configure/gump_work/buildscript_logging-log4cxx_logging-log4cxx-configure.html
Work Name: buildscript_logging-log4cxx_logging-log4cxx-configure (Type: Build)
Work ended in a state of : Failed
Elapsed: 27 secs
Command Line: /srv/gump/public/workspace/logging-log4cxx/configure --with-apr-util=/srv/gump/public/workspace/apr-util --with-apr=/srv/gump/public/workspace/apr --prefix=/srv/gump/public/workspace/logging-log4cxx/dest-27102009 
[Working Directory: /srv/gump/public/workspace/logging-log4cxx]
---------------------------------------------
checking for f95... no
checking for fort... no
checking for ifort... no
checking for ifc... no
checking for efc... no
checking for pgf95... no
checking for lf95... no
checking for ftn... no
checking whether we are using the GNU Fortran 77 compiler... no
checking whether  accepts -g... no
checking the maximum length of command line arguments... 98304
checking command to parse /usr/bin/nm -B output from ccache gcc object... ok
checking for objdir... .libs
checking for ar... ar
checking for ranlib... ranlib
checking for strip... strip
checking if ccache gcc supports -fno-rtti -fno-exceptions... no
checking for ccache gcc option to produce PIC... -fPIC
checking if ccache gcc PIC flag -fPIC works... yes
checking if ccache gcc static flag -static works... yes
checking if ccache gcc supports -c -o file.o... yes
checking whether the ccache gcc linker (/usr/bin/ld) supports shared libraries... yes
checking whether -lc should be explicitly linked in... no
checking dynamic linker characteristics... GNU/Linux ld.so
checking how to hardcode library paths into programs... immediate
checking whether stripping libraries is possible... yes
checking if libtool supports shared libraries... yes
checking whether to build shared libraries... yes
checking whether to build static libraries... yes
configure: creating libtool
appending configuration tag "CXX" to libtool
checking for ld used by ccache g++... /usr/bin/ld
checking if the linker (/usr/bin/ld) is GNU ld... yes
checking whether the ccache g++ linker (/usr/bin/ld) supports shared libraries... yes
checking for ccache g++ option to produce PIC... -fPIC
checking if ccache g++ PIC flag -fPIC works... yes
checking if ccache g++ static flag -static works... yes
checking if ccache g++ supports -c -o file.o... yes
checking whether the ccache g++ linker (/usr/bin/ld) supports shared libraries... yes
checking dynamic linker characteristics... GNU/Linux ld.so
(cached) (cached) checking how to hardcode library paths into programs... immediate
appending configuration tag "F77" to libtool
checking for a BSD-compatible install... /usr/bin/install -c
checking whether make sets $(MAKE)... (cached) yes
checking whether we are using the GNU C++ compiler... (cached) yes
checking whether ccache g++ accepts -g... (cached) yes
checking dependency style of ccache g++... (cached) gcc3
checking how to run the C++ preprocessor... ccache g++ -E
checking for doxygen... no
checking for APR... configure: error: the --with-apr parameter is incorrect. It must specify an install prefix, a build directory, or an apr-config file.
---------------------------------------------

To subscribe to this information via syndicated feeds:
- RSS: http://vmgump.apache.org/gump/public/logging-log4cxx/logging-log4cxx-configure/rss.xml
- Atom: http://vmgump.apache.org/gump/public/logging-log4cxx/logging-log4cxx-configure/atom.xml

============================== Gump Tracking Only ===
Produced by Gump version 2.3.
Gump Run 07000027102009, vmgump:vmgump-public:07000027102009
Gump E-mail Identifier (unique within run) #25.

*********************************************************** G U M P
[GUMP@vmgump]: Module tomcat-jasper_tc6 success, but with warnings.
To whom it may engage...
        
This is an automated request, but not an unsolicited one. For 
more information please visit http://gump.apache.org/nagged.html, 
and/or contact the folk at general@gump.apache.org.

Module tomcat-jasper_tc6 contains errors.
The current state of this module is 'Success'.

Full details are available at:
    http://vmgump.apache.org/gump/public/tomcat-jasper_tc6/index.html

That said, some information snippets are provided here.

The following annotations (debug/informational/warning/error messages) were provided:
 -ERROR- *** Failed to update from source control.Stale contents ***



The following work was performed:
http://vmgump.apache.org/gump/public/tomcat-jasper_tc6/gump_work/update_tomcat-jasper_tc6.html
Work Name: update_tomcat-jasper_tc6 (Type: Update)
Work ended in a state of : Failed
Elapsed: 1 sec
Command Line: svn --quiet update --non-interactive tomcat-jasper_tc6 
[Working Directory: /srv/gump/public/workspace/cvs]
---------------------------------------------
svn: Target path '/tomcat/jasper/tc6.0.x' does not exist
---------------------------------------------

To subscribe to this information via syndicated feeds:
- RSS: http://vmgump.apache.org/gump/public/tomcat-jasper_tc6/rss.xml
- Atom: http://vmgump.apache.org/gump/public/tomcat-jasper_tc6/atom.xml

============================== Gump Tracking Only ===
Produced by Gump version 2.3.
Gump Run 07000027102009, vmgump:vmgump-public:07000027102009
Gump E-mail Identifier (unique within run) #27.

*********************************************************** G U M P
[GUMP@vmgump]: Project emma (in module emma) failed
To whom it may engage...
        
This is an automated request, but not an unsolicited one. For 
more information please visit http://gump.apache.org/nagged.html, 
and/or contact the folk at general@gump.apache.org.

Project emma has an issue affecting its community integration.
This issue affects 1 projects,
 and has been outstanding for 558 runs.
The current state of this project is 'Failed', with reason 'Build Failed'.
For reference only, the following projects are affected by this:
    - emma :  code coverage tool


Full details are available at:
    http://vmgump.apache.org/gump/public/emma/emma/index.html

That said, some information snippets are provided here.

The following annotations (debug/informational/warning/error messages) were provided:
 -INFO- Failed with reason build failed
 -INFO- Failed to extract fallback artifacts from Gump Repository



The following work was performed:
http://vmgump.apache.org/gump/public/emma/emma/gump_work/build_emma_emma.html
Work Name: build_emma_emma (Type: Build)
Work ended in a state of : Failed
Elapsed: 5 secs
Command Line: /usr/lib/jvm/java-6-sun/bin/java -Djava.awt.headless=true -Xbootclasspath/p:/srv/gump/public/workspace/xml-commons/java/external/build/xml-apis.jar:/srv/gump/public/workspace/xml-xerces2/build/xercesImpl.jar org.apache.tools.ant.Main -Dgump.merge=/srv/gump/public/gump/work/merge.xml -Dbuild.sysclasspath=only -Dapp.short.name=emma-27102009 
[Working Directory: /srv/gump/public/workspace/emma]
CLASSPATH: /usr/lib/jvm/java-6-sun/lib/tools.jar:/srv/gump/public/workspace/emma/out/core/classes:/srv/gump/public/workspace/emma/out/ant/classes:/srv/gump/public/workspace/emma/lib/internal/stamptool.jar:/srv/gump/public/workspace/ant/dist/lib/ant-jmf.jar:/srv/gump/public/workspace/ant/dist/lib/ant-swing.jar:/srv/gump/public/workspace/ant/dist/lib/ant-apache-resolver.jar:/srv/gump/public/workspace/ant/dist/lib/ant-apache-xalan2.jar:/srv/gump/public/workspace/ant/dist/lib/ant-trax.jar:/srv/gump/public/workspace/ant/dist/lib/ant-junit.jar:/srv/gump/public/workspace/ant/dist/lib/ant-launcher.jar:/srv/gump/public/workspace/ant/dist/lib/ant-nodeps.jar:/srv/gump/public/workspace/ant/dist/lib/ant.jar:/srv/gump/public/workspace/xml-commons/java/external/build/xml-apis-ext.jar
---------------------------------------------
timestamp:

-pre-compile:

core.bootstrap.compile:
    [javac] Compiling 2 source files to /srv/gump/public/workspace/emma/out/core/classes
    [javac] 
    [javac]           WARNING
    [javac] 
    [javac] The -source switch defaults to 1.5 in JDK 1.5 and 1.6.
    [javac] If you specify -target 1.2 you now must also specify -source 1.2.
    [javac] Ant will implicitly add -source 1.2 for you.  Please change your build file.

core.java14.compile:
    [javac] Compiling 1 source file to /srv/gump/public/workspace/emma/out/core/classes
    [javac] 
    [javac]           WARNING
    [javac] 
    [javac] The -source switch defaults to 1.5 in JDK 1.5 and 1.6.
    [javac] If you specify -target 1.2 you now must also specify -source 1.2.
    [javac] Ant will implicitly add -source 1.2 for you.  Please change your build file.

core.java13.compile:
    [javac] Compiling 1 source file to /srv/gump/public/workspace/emma/out/core/classes
    [javac] 
    [javac]           WARNING
    [javac] 
    [javac] The -source switch defaults to 1.5 in JDK 1.5 and 1.6.
    [javac] If you specify -target 1.2 you now must also specify -source 1.2.
    [javac] Ant will implicitly add -source 1.2 for you.  Please change your build file.

core.compile:
    [javac] Compiling 175 source files to /srv/gump/public/workspace/emma/out/core/classes
    [javac] 
    [javac]           WARNING
    [javac] 
    [javac] The -source switch defaults to 1.5 in JDK 1.5 and 1.6.
    [javac] If you specify -target 1.2 you now must also specify -source 1.2.
    [javac] Ant will implicitly add -source 1.2 for you.  Please change your build file.
    [javac] /srv/gump/public/workspace/emma/core/java12/com/vladium/emma/run/InstrClassLoader.java:346: reference to CodeSource is ambiguous, both method CodeSource(java.net.URL,java.security.cert.Certificate[]) in java.security.CodeSource and method CodeSource(java.net.URL,java.security.CodeSigner[]) in java.security.CodeSource match
    [javac]         final CodeSource csrc = new CodeSource (srcURL, null);
    [javac]                                 ^
    [javac] Note: Some input files use or override a deprecated API.
    [javac] Note: Recompile with -Xlint:deprecation for details.
    [javac] 1 error

BUILD FAILED
/srv/gump/public/workspace/emma/build.xml:297: Compile failed; see the compiler error output for details.

Total time: 5 seconds
---------------------------------------------

To subscribe to this information via syndicated feeds:
- RSS: http://vmgump.apache.org/gump/public/emma/emma/rss.xml
- Atom: http://vmgump.apache.org/gump/public/emma/emma/atom.xml

============================== Gump Tracking Only ===
Produced by Gump version 2.3.
Gump Run 07000027102009, vmgump:vmgump-public:07000027102009
Gump E-mail Identifier (unique within run) #28.

*********************************************************** G U M P
[GUMP@vmgump]: Project slf4j-test (in module slf4j) failed
To whom it may engage...
        
This is an automated request, but not an unsolicited one. For 
more information please visit http://gump.apache.org/nagged.html, 
and/or contact the folk at general@gump.apache.org.

Project slf4j-test has an issue affecting its community integration.
This issue affects 1 projects,
 and has been outstanding for 80 runs.
The current state of this project is 'Failed', with reason 'Build Failed'.
For reference only, the following projects are affected by this:
    - slf4j-test :  Simple Logging Facade for Java


Full details are available at:
    http://vmgump.apache.org/gump/public/slf4j/slf4j-test/index.html

That said, some information snippets are provided here.

The following annotations (debug/informational/warning/error messages) were provided:
 -WARNING- Overriding Maven2 settings: [/srv/gump/public/workspace/slf4j/gump_mvn_settings.xml]
 -DEBUG- (Gump generated) Maven2 Settings in: /srv/gump/public/workspace/slf4j/gump_mvn_settings.xml
 -INFO- Failed with reason build failed
 -DEBUG- Maven POM in: /srv/gump/public/workspace/slf4j/pom.xml



The following work was performed:
http://vmgump.apache.org/gump/public/slf4j/slf4j-test/gump_work/build_slf4j_slf4j-test.html
Work Name: build_slf4j_slf4j-test (Type: Build)
Work ended in a state of : Failed
Elapsed: 18 secs
Command Line: mvn --batch-mode --settings /srv/gump/public/workspace/slf4j/gump_mvn_settings.xml package 
[Working Directory: /srv/gump/public/workspace/slf4j]
CLASSPATH: /usr/lib/jvm/java-6-sun/lib/tools.jar:/srv/gump/public/workspace/slf4j/slf4j-migrator/target/slf4j-migrator-1.5.9-SNAPSHOT.jar:/srv/gump/public/workspace/slf4j/slf4j-nop/target/slf4j-nop-1.5.9-SNAPSHOT.jar:/srv/gump/public/workspace/slf4j/log4j-over-slf4j/target/log4j-over-slf4j-1.5.9-SNAPSHOT.jar:/srv/gump/public/workspace/slf4j/slf4j-log4j12/target/slf4j-log4j12-1.5.9-SNAPSHOT.jar:/srv/gump/public/workspace/slf4j/slf4j-jcl/target/slf4j-jcl-1.5.9-SNAPSHOT.jar:/srv/gump/public/workspace/slf4j/slf4j-api/target/slf4j-api-1.5.9-SNAPSHOT.jar:/srv/gump/public/workspace/slf4j/jcl104-over-slf4j/target/jcl104-over-slf4j-1.5.9-SNAPSHOT.jar:/srv/gump/public/workspace/slf4j/slf4j-jdk14/target/slf4j-jdk14-1.5.9-SNAPSHOT.jar:/srv/gump/public/workspace/slf4j/slf4j-simple/target/slf4j-simple-1.5.9-SNAPSHOT.jar:/srv/gump/public/workspace/slf4j/slf4j-ext/target/slf4j-ext-1.5.9-SNAPSHOT.jar:/srv/gump/public/workspace/slf4j/jcl-over-slf4j/target/jcl-over-slf4j-1.5.9-SNAPSHOT.jar:/srv
 /gump/public/workspace/slf4j/jul-to-slf4j/target/jul-to-slf4j-1.5.9-SNAPSHOT.jar
---------------------------------------------
[WARNING] Removing: jar from forked lifecycle, to prevent recursive invocation.
[INFO] No goals needed for project - skipping
[INFO] [source:jar {execution: default}]
[INFO] Building jar: /srv/gump/public/workspace/slf4j/slf4j-api/target/slf4j-api-1.5.9-SNAPSHOT-sources.jar
[INFO] [jar:jar {execution: bundle-test-jar}]
[INFO] [jar:test-jar {execution: bundle-test-jar}]
[INFO] ------------------------------------------------------------------------
[INFO] Building SLF4J Simple Binding
[INFO]    task-segment: [package]
[INFO] ------------------------------------------------------------------------
[INFO] [resources:resources]
[WARNING] File encoding has not been set, using platform encoding UTF-8, i.e. build is platform dependent!
[WARNING] Using platform encoding (UTF-8 actually) to copy filtered resources, i.e. build is platform dependent!
[INFO] Copying 1 resource
[INFO] [compiler:compile]
[INFO] Nothing to compile - all classes are up to date
[INFO] [resources:testResources]
[WARNING] Using platform encoding (UTF-8 actually) to copy filtered resources, i.e. build is platform dependent!
[INFO] skip non existing resourceDirectory /srv/gump/public/workspace/slf4j/slf4j-simple/src/test/resources
[INFO] [compiler:testCompile]
[INFO] Nothing to compile - all classes are up to date
[INFO] [surefire:test]
[INFO] Surefire report directory: /srv/gump/public/workspace/slf4j/slf4j-simple/target/surefire-reports

-------------------------------------------------------
 T E S T S
-------------------------------------------------------
Running org.slf4j.InvocationTest
Tests run: 6, Failures: 0, Errors: 1, Skipped: 0, Time elapsed: 0.109 sec <<< FAILURE!

Results :

Tests in error: 
  testMDC(org.slf4j.InvocationTest)

Tests run: 6, Failures: 0, Errors: 1, Skipped: 0

[INFO] ------------------------------------------------------------------------
[ERROR] BUILD FAILURE
[INFO] ------------------------------------------------------------------------
[INFO] There are test failures.

Please refer to /srv/gump/public/workspace/slf4j/slf4j-simple/target/surefire-reports for the individual test results.
[INFO] ------------------------------------------------------------------------
[INFO] For more information, run Maven with the -e switch
[INFO] ------------------------------------------------------------------------
[INFO] Total time: 16 seconds
[INFO] Finished at: Tue Oct 27 01:45:48 PST 2009
[INFO] Final Memory: 19M/35M
[INFO] ------------------------------------------------------------------------
---------------------------------------------

To subscribe to this information via syndicated feeds:
- RSS: http://vmgump.apache.org/gump/public/slf4j/slf4j-test/rss.xml
- Atom: http://vmgump.apache.org/gump/public/slf4j/slf4j-test/atom.xml

============================== Gump Tracking Only ===
Produced by Gump version 2.3.
Gump Run 07000027102009, vmgump:vmgump-public:07000027102009
Gump E-mail Identifier (unique within run) #32.

*********************************************************** G U M P
[GUMP@vmgump]: Project jetty-test (in module jetty) failed
To whom it may engage...
        
This is an automated request, but not an unsolicited one. For 
more information please visit http://gump.apache.org/nagged.html, 
and/or contact the folk at general@gump.apache.org.

Project jetty-test has an issue affecting its community integration.
This issue affects 1 projects,
 and has been outstanding for 43 runs.
The current state of this project is 'Failed', with reason 'Build Failed'.
For reference only, the following projects are affected by this:
    - jetty-test :  Java HTTP Servlet Server


Full details are available at:
    http://vmgump.apache.org/gump/public/jetty/jetty-test/index.html

That said, some information snippets are provided here.

The following annotations (debug/informational/warning/error messages) were provided:
 -WARNING- Overriding Maven2 settings: [/srv/gump/public/workspace/jetty/gump_mvn_settings.xml]
 -DEBUG- (Gump generated) Maven2 Settings in: /srv/gump/public/workspace/jetty/gump_mvn_settings.xml
 -INFO- Failed with reason build failed
 -DEBUG- Maven POM in: /srv/gump/public/workspace/jetty/pom.xml



The following work was performed:
http://vmgump.apache.org/gump/public/jetty/jetty-test/gump_work/build_jetty_jetty-test.html
Work Name: build_jetty_jetty-test (Type: Build)
Work ended in a state of : Failed
Elapsed: 58 secs
Command Line: mvn --batch-mode --settings /srv/gump/public/workspace/jetty/gump_mvn_settings.xml package 
[Working Directory: /srv/gump/public/workspace/jetty]
CLASSPATH: /usr/lib/jvm/java-6-sun/lib/tools.jar:/srv/gump/public/workspace/jetty/jetty-client/target/jetty-client-7.0.1-SNAPSHOT.jar:/srv/gump/public/workspace/jetty/jetty-jaspi/target/jetty-jaspi-7.0.1-SNAPSHOT.jar:/srv/gump/public/workspace/jetty/jetty-xml/target/jetty-xml-7.0.1-SNAPSHOT.jar:/srv/gump/public/workspace/jetty/jetty-security/target/jetty-security-7.0.1-SNAPSHOT.jar:/srv/gump/public/workspace/jetty/jetty-policy/target/jetty-policy-7.0.1-SNAPSHOT.jar:/srv/gump/public/workspace/jetty/jetty-centralized-logging/target/jetty-centralized-logging-7.0.1-SNAPSHOT.jar:/srv/gump/public/workspace/jetty/jetty-webapp/target/jetty-webapp-7.0.1-SNAPSHOT.jar:/srv/gump/public/workspace/jetty/jetty-http/target/jetty-http-7.0.1-SNAPSHOT.jar:/srv/gump/public/workspace/jetty/jetty-continuation/target/jetty-continuation-7.0.1-SNAPSHOT.jar:/srv/gump/public/workspace/jetty/jetty-annotations/target/jetty-annotations-7.0.1-SNAPSHOT.jar:/srv/gump/public/workspace/jetty/jetty-start/target
 /jetty-start-7.0.1-SNAPSHOT.jar:/srv/gump/public/workspace/jetty/jetty-util/target/jetty-util-7.0.1-SNAPSHOT.jar:/srv/gump/public/workspace/jetty/jetty-ajp/target/jetty-ajp-7.0.1-SNAPSHOT.jar:/srv/gump/public/workspace/jetty/jetty-webapp-logging/target/jetty-webapp-logging-7.0.1-SNAPSHOT.jar:/srv/gump/public/workspace/jetty/jetty-io/target/jetty-io-7.0.1-SNAPSHOT.jar:/srv/gump/public/workspace/jetty/jetty-plus/target/jetty-plus-7.0.1-SNAPSHOT.jar:/srv/gump/public/workspace/jetty/jetty-servlet/target/jetty-servlet-7.0.1-SNAPSHOT.jar:/srv/gump/public/workspace/jetty/jetty-rewrite/target/jetty-rewrite-7.0.1-SNAPSHOT.jar:/srv/gump/public/workspace/jetty/jetty-server/target/jetty-server-7.0.1-SNAPSHOT.jar:/srv/gump/public/workspace/jetty/jetty-jndi/target/jetty-jndi-7.0.1-SNAPSHOT.jar:/srv/gump/public/workspace/jetty/jetty-deploy/target/jetty-deploy-7.0.1-SNAPSHOT.jar:/srv/gump/public/workspace/jetty/jetty-jmx/target/jetty-jmx-7.0.1-SNAPSHOT.jar:/srv/gump/public/workspace/jetty/j
 etty-webapp-verifier/target/jetty-webapp-verifier-7.0.1-SNAPSHOT.jar:/srv/gump/public/workspace/jetty/jetty-servlets/target/jetty-servlets-7.0.1-SNAPSHOT.jar:/srv/gump/public/workspace/ant/dist/lib/ant-jmf.jar:/srv/gump/public/workspace/ant/dist/lib/ant-swing.jar:/srv/gump/public/workspace/ant/dist/lib/ant-apache-resolver.jar:/srv/gump/public/workspace/ant/dist/lib/ant-apache-xalan2.jar:/srv/gump/public/workspace/ant/dist/lib/ant-trax.jar:/srv/gump/public/workspace/ant/dist/lib/ant-junit.jar:/srv/gump/public/workspace/ant/dist/lib/ant-launcher.jar:/srv/gump/public/workspace/ant/dist/lib/ant-nodeps.jar:/srv/gump/public/workspace/ant/dist/lib/ant.jar:/srv/gump/packages/bsh-2.0b4/bsh-commands-2.0b4.jar:/srv/gump/packages/bsh-2.0b4/bsh-classpath-2.0b4.jar:/srv/gump/packages/bsh-2.0b4/bsh-core-2.0b4.jar:/srv/gump/packages/bsh-2.0b4/bsh-bsf-2.0b4.jar:/srv/gump/packages/bsh-2.0b4/bsh-2.0b4.jar:/srv/gump/packages/bsh-2.0b4/bsh-reflect-2.0b4.jar:/srv/gump/packages/bsh-2.0b4/bsh-util-
 2.0b4.jar:/srv/gump/public/workspace/apache-commons/beanutils/dist/commons-beanutils-27102009.jar:/srv/gump/public/workspace/apache-commons/digester/dist/commons-digester.jar:/srv/gump/public/workspace/httpcomponents/oac.hc3x/dist/commons-httpclient.jar:/srv/gump/packages/jaf-1.1ea/activation.jar:/srv/gump/public/workspace/tomcat-tc6/output/build/lib/servlet-api.jar:/srv/gump/packages/javamail-1.4/mail.jar:/srv/gump/packages/javamail-1.4/lib/mailapi.jar:/srv/gump/packages/jtidy-04aug2000r7-dev/build/Tidy.jar:/srv/gump/public/workspace/junit/dist/junit-27102009.jar:/srv/gump/public/workspace/mx4j/dist/lib/mx4j-impl.jar:/srv/gump/public/workspace/mx4j/dist/lib/mx4j-jmx.jar:/srv/gump/public/workspace/mx4j/dist/lib/mx4j.jar:/srv/gump/public/workspace/mx4j/tools-dist/lib/mx4j-tools.jar:/srv/gump/public/workspace/slf4j/slf4j-migrator/target/slf4j-migrator-1.5.9-SNAPSHOT.jar:/srv/gump/public/workspace/slf4j/slf4j-nop/target/slf4j-nop-1.5.9-SNAPSHOT.jar:/srv/gump/public/workspace/sl
 f4j/log4j-over-slf4j/target/log4j-over-slf4j-1.5.9-SNAPSHOT.jar:/srv/gump/public/workspace/slf4j/slf4j-log4j12/target/slf4j-log4j12-1.5.9-SNAPSHOT.jar:/srv/gump/public/workspace/slf4j/slf4j-jcl/target/slf4j-jcl-1.5.9-SNAPSHOT.jar:/srv/gump/public/workspace/slf4j/slf4j-api/target/slf4j-api-1.5.9-SNAPSHOT.jar:/srv/gump/public/workspace/slf4j/jcl104-over-slf4j/target/jcl104-over-slf4j-1.5.9-SNAPSHOT.jar:/srv/gump/public/workspace/slf4j/slf4j-jdk14/target/slf4j-jdk14-1.5.9-SNAPSHOT.jar:/srv/gump/public/workspace/slf4j/slf4j-simple/target/slf4j-simple-1.5.9-SNAPSHOT.jar:/srv/gump/public/workspace/slf4j/slf4j-ext/target/slf4j-ext-1.5.9-SNAPSHOT.jar:/srv/gump/public/workspace/slf4j/jcl-over-slf4j/target/jcl-over-slf4j-1.5.9-SNAPSHOT.jar:/srv/gump/public/workspace/slf4j/jul-to-slf4j/target/jul-to-slf4j-1.5.9-SNAPSHOT.jar:/srv/gump/public/workspace/jakarta-slide/webdavclient/dist/lib/jakarta-slide-webdavlib-27102009.jar:/srv/gump/public/workspace/xml-commons/java/external/build/xml-a
 pis-ext.jar
---------------------------------------------
Running org.eclipse.jetty.util.log.LogTest
Tests run: 4, Failures: 0, Errors: 0, Skipped: 0, Time elapsed: 0.029 sec
Running org.eclipse.jetty.util.MultiExceptionTest
Tests run: 3, Failures: 0, Errors: 0, Skipped: 0, Time elapsed: 0.019 sec
Running org.eclipse.jetty.util.URLEncodedTest
org.eclipse.jetty.util.MultiMap@2428ebad
org.eclipse.jetty.util.MultiMap@2428ebad
org.eclipse.jetty.util.MultiMap@2428ebad
org.eclipse.jetty.util.MultiMap@2428ebad
Tests run: 2, Failures: 0, Errors: 0, Skipped: 0, Time elapsed: 0.064 sec
Running org.eclipse.jetty.util.LazyListTest
Tests run: 15, Failures: 0, Errors: 0, Skipped: 0, Time elapsed: 0.032 sec
Running org.eclipse.jetty.util.resource.ResourceTest
User Dir=/srv/gump/public/workspace/jetty/jetty-util/src/test/java/org/eclipse/jetty/util/resource/
Rel  Dir=src/test/java/org/eclipse/jetty/util/resource/
User URL=file:/srv/gump/public/workspace/jetty/jetty-util/src/test/java/org/eclipse/jetty/util/resource/
Tests run: 11, Failures: 0, Errors: 0, Skipped: 0, Time elapsed: 0.116 sec
Running org.eclipse.jetty.util.component.LifeCycleListenerTest
2009-10-27 02:06:08.261:WARN::FAILED org.eclipse.jetty.util.component.LifeCycleListenerTest$TestLifeCycle@17ee8b8: java.lang.Exception: expected test exception
2009-10-27 02:06:08.265:WARN::FAILED org.eclipse.jetty.util.component.LifeCycleListenerTest$TestLifeCycle@e0b6f5: java.lang.Exception: expected test exception
Tests run: 2, Failures: 0, Errors: 0, Skipped: 0, Time elapsed: 0.027 sec
Running org.eclipse.jetty.util.resource.ResourceCollectionTest
1.txt
2.txt
3.txt
dir/
Tests run: 3, Failures: 0, Errors: 0, Skipped: 0, Time elapsed: 0.036 sec
Running org.eclipse.jetty.util.StringMapTest
Tests run: 11, Failures: 0, Errors: 0, Skipped: 0, Time elapsed: 0.137 sec

Results :

Tests in error: 
  testExclude(org.eclipse.jetty.util.ajax.JSONPojoConvertorTest)

Tests run: 116, Failures: 0, Errors: 1, Skipped: 0

[INFO] ------------------------------------------------------------------------
[ERROR] BUILD FAILURE
[INFO] ------------------------------------------------------------------------
[INFO] There are test failures.

Please refer to /srv/gump/public/workspace/jetty/jetty-util/target/surefire-reports for the individual test results.
[INFO] ------------------------------------------------------------------------
[INFO] For more information, run Maven with the -e switch
[INFO] ------------------------------------------------------------------------
[INFO] Total time: 57 seconds
[INFO] Finished at: Tue Oct 27 02:06:08 PST 2009
[INFO] Final Memory: 27M/48M
[INFO] ------------------------------------------------------------------------
---------------------------------------------

To subscribe to this information via syndicated feeds:
- RSS: http://vmgump.apache.org/gump/public/jetty/jetty-test/rss.xml
- Atom: http://vmgump.apache.org/gump/public/jetty/jetty-test/atom.xml

============================== Gump Tracking Only ===
Produced by Gump version 2.3.
Gump Run 07000027102009, vmgump:vmgump-public:07000027102009
Gump E-mail Identifier (unique within run) #33.

*********************************************************** G U M P
[GUMP@vmgump]: Project xstream (in module xstream) failed
To whom it may engage...
        
This is an automated request, but not an unsolicited one. For 
more information please visit http://gump.apache.org/nagged.html, 
and/or contact the folk at general@gump.apache.org.

Project xstream has an issue affecting its community integration.
This issue affects 2 projects,
 and has been outstanding for 131 runs.
The current state of this project is 'Failed', with reason 'Build Failed'.
For reference only, the following projects are affected by this:
    - xstream :  simple library to serialize object to XML and back
    again
    - xstream-in-xstream :  simple library to serialize object to XML and back
    again


Full details are available at:
    http://vmgump.apache.org/gump/public/xstream/xstream/index.html

That said, some information snippets are provided here.

The following annotations (debug/informational/warning/error messages) were provided:
 -DEBUG- Sole output [xstream-1.4-SNAPSHOT.jar] identifier set to project name
 -INFO- Optional dependency commons-lang3 failed with reason build failed
 -DEBUG- (Gump generated) Maven2 Settings in: /srv/gump/public/workspace/xstream/xstream/gump_mvn_settings.xml
 -INFO- Failed with reason build failed
 -DEBUG- Maven POM in: /srv/gump/public/workspace/xstream/xstream/pom.xml
 -DEBUG- Extracted fallback artifacts from Gump Repository



The following work was performed:
http://vmgump.apache.org/gump/public/xstream/xstream/gump_work/build_xstream_xstream.html
Work Name: build_xstream_xstream (Type: Build)
Work ended in a state of : Failed
Elapsed: 1 min 21 secs
Command Line: mvn --batch-mode -Dmaven.final.name=xstream-27102009 --settings /srv/gump/public/workspace/xstream/xstream/gump_mvn_settings.xml package 
[Working Directory: /srv/gump/public/workspace/xstream/xstream]
CLASSPATH: /usr/lib/jvm/java-6-sun/lib/tools.jar:/srv/gump/packages/cglib/cglib-nodep-2.1_3.jar:commons-lang-gump-27102009.jar:/srv/gump/public/workspace/dom4j/build/dom4j.jar:/srv/gump/public/workspace/jakarta-oro/jakarta-oro-27102009.jar:/srv/gump/public/workspace/jdom/build/jdom.jar:/srv/gump/public/workspace/jmock/build/dist/jmock-core-27102009.jar:/srv/gump/public/workspace/jmock/build/dist/jmock-cglib-27102009.jar:/srv/gump/public/workspace/junit/dist/junit-27102009.jar:/srv/gump/packages/stax/jsr173_1.0_api.jar:/srv/gump/packages/stax/jsr173_1.0_ri.jar:/srv/gump/public/workspace/xom/build/xom-27102009.jar:/srv/gump/public/workspace/xpp/build/xpp3-27102009.jar
---------------------------------------------
Tests run: 10, Failures: 0, Errors: 0, Skipped: 0, Time elapsed: 0.036 sec

Results :

Tests in error: 
  testUninitializedArray(com.thoughtworks.acceptance.ArraysTest)
  testCustomObjectWillNotUnmarshalTransientFields(com.thoughtworks.acceptance.CustomClassesTest)
  testCustomObjectWillNotUnmarshalInheritedTransientFields(com.thoughtworks.acceptance.CustomClassesTest)
  testCustomObjectWillNotUnmarshalTransientFieldsFromAttributes(com.thoughtworks.acceptance.CustomClassesTest)
  testNullsAreDistinguishedFromEmptyStrings(com.thoughtworks.acceptance.CustomClassesTest)
  testEscapesNullKeyWhileExtractingKey(com.thoughtworks.xstream.persistence.FileStreamStrategyTest)
  testRemovesAnInvalidFile(com.thoughtworks.xstream.persistence.FileStreamStrategyTest)
  testGetsAnInvalidFile(com.thoughtworks.xstream.persistence.FileStreamStrategyTest)
  testAttributeCanBeOmitted(com.thoughtworks.acceptance.OmitFieldsTest)
  testSerializesWithNoSelfReferenceForUninitializedCauseInJdk14(com.thoughtworks.xstream.converters.extended.ThrowableConverterTest)
  testSerializesWithInitializedCauseInJdk14(com.thoughtworks.xstream.converters.extended.ThrowableConverterTest)
  testRemovesAnInvalidObject(com.thoughtworks.xstream.persistence.XmlMapTest)
  testGetsAnInvalidObject(com.thoughtworks.xstream.persistence.XmlMapTest)
  testAttributesCanBeFetchedFromTags(com.thoughtworks.xstream.io.xml.XppDomReaderTest)
  testAttributesCanBeFetchedFromTags(com.thoughtworks.xstream.io.xml.Dom4JReaderTest)
  testAttributesCanBeFetchedFromTags(com.thoughtworks.xstream.io.copy.HierarchicalStreamCopierTest)
  testAttributesCanBeFetchedFromTags(com.thoughtworks.xstream.io.xml.DomReaderTest)
  testTreeMapWithoutComparator(com.thoughtworks.acceptance.TreeMapAndTreeSetTest)
  testAttributesCanBeFetchedFromTags(com.thoughtworks.xstream.io.binary.BinaryStreamTest)
  testAttributesCanBeFetchedFromTags(com.thoughtworks.xstream.io.xml.StaxReaderTest)
  testEscapesNullKeyWhileExtractingKey(com.thoughtworks.xstream.persistence.FilePersistenceStrategyTest)
  testRemovesAnInvalidFile(com.thoughtworks.xstream.persistence.FilePersistenceStrategyTest)
  testGetsAnInvalidFile(com.thoughtworks.xstream.persistence.FilePersistenceStrategyTest)
  testAttributesCanBeFetchedFromTags(com.thoughtworks.xstream.io.xml.XppReaderTest)
  testDoesNotMarkFieldsAsImplicitCollectionByDefault(com.thoughtworks.xstream.mapper.ImplicitCollectionMapperTest)
  testAllowsFieldsToBeMarkedAsNamedImplicitCollectionsToBeAdded(com.thoughtworks.xstream.mapper.ImplicitCollectionMapperTest)
  testNull(com.thoughtworks.acceptance.BasicTypesTest)
  testAttributesCanBeFetchedFromTags(com.thoughtworks.xstream.io.xml.JDomReaderTest)
  testAttributesCanBeFetchedFromTags(com.thoughtworks.xstream.io.xml.XomReaderTest)

Tests run: 1148, Failures: 0, Errors: 29, Skipped: 0

[INFO] ------------------------------------------------------------------------
[ERROR] BUILD FAILURE
[INFO] ------------------------------------------------------------------------
[INFO] There are test failures.

Please refer to /srv/gump/public/workspace/xstream/xstream/target/surefire-reports for the individual test results.
[INFO] ------------------------------------------------------------------------
[INFO] For more information, run Maven with the -e switch
[INFO] ------------------------------------------------------------------------
[INFO] Total time: 1 minute 19 seconds
[INFO] Finished at: Tue Oct 27 02:15:13 PST 2009
[INFO] Final Memory: 13M/32M
[INFO] ------------------------------------------------------------------------
---------------------------------------------

To subscribe to this information via syndicated feeds:
- RSS: http://vmgump.apache.org/gump/public/xstream/xstream/rss.xml
- Atom: http://vmgump.apache.org/gump/public/xstream/xstream/atom.xml

============================== Gump Tracking Only ===
Produced by Gump version 2.3.
Gump Run 07000027102009, vmgump:vmgump-public:07000027102009
Gump E-mail Identifier (unique within run) #36.

*********************************************************** G U M P
[GUMP@vmgump]: Project commons-jci (in module apache-commons) failed
To whom it may engage...
        
This is an automated request, but not an unsolicited one. For 
more information please visit http://gump.apache.org/nagged.html, 
and/or contact the folk at general@gump.apache.org.

Project commons-jci has an issue affecting its community integration.
This issue affects 2 projects,
 and has been outstanding for 1269 runs.
The current state of this project is 'Failed', with reason 'Build Failed'.
For reference only, the following projects are affected by this:
    - commons-jci :  Commons JCI
    - commons-jci-test :  Apache Commons


Full details are available at:
    http://vmgump.apache.org/gump/public/apache-commons/commons-jci/index.html

That said, some information snippets are provided here.

The following annotations (debug/informational/warning/error messages) were provided:
 -DEBUG- Sole output [commons-jci-27102009.jar] identifier set to project name
 -INFO- Optional dependency commons-collections failed with reason build failed
 -INFO- Optional dependency commons-logging prerequisite failed with reason build failed
 -INFO- Optional dependency commons-lang3 failed with reason build failed
 -DEBUG- (Gump generated) Maven2 Settings in: /srv/gump/public/workspace/apache-commons/jci/gump_mvn_settings.xml
 -INFO- Failed with reason build failed
 -DEBUG- Maven POM in: /srv/gump/public/workspace/apache-commons/jci/pom.xml
 -INFO- Failed to extract fallback artifacts from Gump Repository



The following work was performed:
http://vmgump.apache.org/gump/public/apache-commons/commons-jci/gump_work/build_apache-commons_commons-jci.html
Work Name: build_apache-commons_commons-jci (Type: Build)
Work ended in a state of : Failed
Elapsed: 46 secs
Command Line: mvn --batch-mode -Dmaven.test.skip.exec=true --settings /srv/gump/public/workspace/apache-commons/jci/gump_mvn_settings.xml package 
[Working Directory: /srv/gump/public/workspace/apache-commons/jci]
CLASSPATH: /usr/lib/jvm/java-6-sun/lib/tools.jar:/srv/gump/public/workspace/jakarta-bcel/target/bcel-5.3-SNAPSHOT.jar:commons-collections-gump-26102009.jar:/srv/gump/public/workspace/apache-commons/io/target/commons-io-27102009.jar:commons-lang-gump-27102009.jar:commons-logging-gump-26102009.jar:commons-logging-api-gump-26102009.jar:/srv/gump/packages/eclipse/plugins/org.eclipse.jdt.core_3.4.2/jdtcore.jar:/srv/gump/packages/jarjar/jarjar-0.6.jar:/srv/gump/public/workspace/asm/output/dist/lib/asm-analysis-27102009.jar:/srv/gump/public/workspace/asm/output/dist/lib/asm-util-27102009.jar:/srv/gump/public/workspace/asm/output/dist/lib/asm-xml-27102009.jar:/srv/gump/public/workspace/asm/output/dist/lib/asm-commons-27102009.jar:/srv/gump/public/workspace/asm/output/dist/lib/asm-27102009.jar:/srv/gump/public/workspace/asm/output/dist/lib/asm-tree-27102009.jar:/srv/gump/packages/antlr/antlr-3.1.3.jar:/srv/gump/packages/groovy-1.0-jsr-03/groovy-1.0-jsr-03.jar:/srv/gump/packages/maven-
 cobertura-plugin/maven-cobertura-plugin-1.1.jar
---------------------------------------------
Downloading: http://localhost:8192/maven2/org/vafer/dependency/0.2/dependency-0.2.pom
Downloading: http://localhost:8192/maven2/asm/asm-commons/2.2.1/asm-commons-2.2.1.pom
Downloading: http://localhost:8192/maven2/asm/asm/2.2.1/asm-2.2.1.pom
Downloading: http://localhost:8192/maven2/asm/asm-util/2.2.1/asm-util-2.2.1.pom
Downloading: http://localhost:8192/maven2/asm/asm-analysis/2.2.1/asm-analysis-2.2.1.pom
Downloading: http://localhost:8192/maven2/asm/asm-tree/2.2.1/asm-tree-2.2.1.pom
Downloading: http://localhost:8192/maven2/asm/asm-attrs/2.2.1/asm-attrs-2.2.1.pom
Downloading: http://localhost:8192/maven2/commons-io/commons-io/1.1/commons-io-1.1.pom
Downloading: http://localhost:8192/maven2/asm/asm/2.2/asm-2.2.pom
Downloading: http://localhost:8192/maven2/org/vafer/dependency/0.2/dependency-0.2.jar
Downloading: http://localhost:8192/maven2/asm/asm-commons/2.2.1/asm-commons-2.2.1.jar
32K downloaded
Downloading: http://localhost:8192/maven2/asm/asm/2.2/asm-2.2.jar
42K downloaded
Downloading: http://localhost:8192/maven2/asm/asm-util/2.2.1/asm-util-2.2.1.jar
34K downloaded
Downloading: http://localhost:8192/maven2/asm/asm-analysis/2.2.1/asm-analysis-2.2.1.jar
17K downloaded
Downloading: http://localhost:8192/maven2/asm/asm-tree/2.2.1/asm-tree-2.2.1.jar
21K downloaded
Downloading: http://localhost:8192/maven2/asm/asm-attrs/2.2.1/asm-attrs-2.2.1.jar
[INFO] [antrun:run {execution: javadoc.resources}]
[INFO] Executing tasks
[INFO] Executed tasks
[INFO] [resources:resources]
[INFO] Using 'iso-8859-1' encoding to copy filtered resources.
[INFO] Copying 0 resource to META-INF
[INFO] [compiler:compile]
[INFO] Compiling 6 source files to /srv/gump/public/workspace/apache-commons/jci/compilers/javac/target/classes
[INFO] ------------------------------------------------------------------------
[ERROR] BUILD FAILURE
[INFO] ------------------------------------------------------------------------
[INFO] Compilation failure

/srv/gump/public/workspace/apache-commons/jci/compilers/javac/src/main/java/org/apache/commons/jci/compilers/JavacClassLoader.java:[108,46] cannot find symbol
symbol  : constructor ClassWriter(boolean,boolean)
location: class org.objectweb.asm.ClassWriter

/srv/gump/public/workspace/apache-commons/jci/compilers/javac/src/main/java/org/apache/commons/jci/compilers/JavacClassLoader.java:[109,44] cannot find symbol
symbol  : method accept(org.vafer.dependency.asm.RenamingVisitor,boolean)
location: class org.objectweb.asm.ClassReader


[INFO] ------------------------------------------------------------------------
[INFO] For more information, run Maven with the -e switch
[INFO] ------------------------------------------------------------------------
[INFO] Total time: 44 seconds
[INFO] Finished at: Tue Oct 27 02:30:21 PST 2009
[INFO] Final Memory: 47M/84M
[INFO] ------------------------------------------------------------------------
---------------------------------------------

To subscribe to this information via syndicated feeds:
- RSS: http://vmgump.apache.org/gump/public/apache-commons/commons-jci/rss.xml
- Atom: http://vmgump.apache.org/gump/public/apache-commons/commons-jci/atom.xml

============================== Gump Tracking Only ===
Produced by Gump version 2.3.
Gump Run 07000027102009, vmgump:vmgump-public:07000027102009
Gump E-mail Identifier (unique within run) #39.

*********************************************************** G U M P
[GUMP@vmgump]: Project groovy (in module groovy) failed
To whom it may engage...
        
This is an automated request, but not an unsolicited one. For 
more information please visit http://gump.apache.org/nagged.html, 
and/or contact the folk at general@gump.apache.org.

Project groovy has an issue affecting its community integration.
This issue affects 1 projects,
 and has been outstanding for 33 runs.
The current state of this project is 'Failed', with reason 'Missing Build Outputs'.
For reference only, the following projects are affected by this:
    - groovy :  New agile dynamic language using a Java-like syntax for the ...


Full details are available at:
    http://vmgump.apache.org/gump/public/groovy/groovy/index.html

That said, some information snippets are provided here.

The following annotations (debug/informational/warning/error messages) were provided:
 -DEBUG- Sole output [groovy-1.7-beta-2-SNAPSHOT.jar] identifier set to project name
 -INFO- Optional dependency javax.servlet prerequisite failed with reason build failed
 -INFO- Optional dependency javax.servlet.jsp-in-servlet prerequisite failed with reason build failed
 -INFO- Optional dependency commons-primitives prerequisite failed with reason build failed
 -INFO- Optional dependency commons-collections failed with reason build failed
 -INFO- Optional dependency commons-cli failed with reason build failed
 -INFO- Optional dependency jakarta-bsf prerequisite failed with reason build failed
 -INFO- Optional dependency commons-httpclient prerequisite failed with reason build failed
 -INFO- Optional dependency mx4j prerequisite failed with reason build failed
 -INFO- Optional dependency commons-logging prerequisite failed with reason build failed
 -INFO- Optional dependency xstream failed with reason build failed
 -DEBUG- (Gump generated) Maven2 Settings in: /srv/gump/public/workspace/groovy/gump_mvn_settings.xml
 -DEBUG- Maven POM in: /srv/gump/public/workspace/groovy/pom.xml
 -INFO- Failed with reason missing build outputs
 -ERROR- Missing Output: /srv/gump/public/workspace/groovy/target/groovy-1.7-beta-2-SNAPSHOT.jar
 -ERROR- See Directory Listing Work for Missing Outputs
 -INFO- Failed to extract fallback artifacts from Gump Repository



The following work was performed:
http://vmgump.apache.org/gump/public/groovy/groovy/gump_work/build_groovy_groovy.html
Work Name: build_groovy_groovy (Type: Build)
Work ended in a state of : Success
Elapsed: 23 secs
Command Line: mvn --batch-mode --settings /srv/gump/public/workspace/groovy/gump_mvn_settings.xml package 
[Working Directory: /srv/gump/public/workspace/groovy]
CLASSPATH: /usr/lib/jvm/java-6-sun/lib/tools.jar:/srv/gump/public/workspace/ant/dist/lib/ant-jmf.jar:/srv/gump/public/workspace/ant/dist/lib/ant-swing.jar:/srv/gump/public/workspace/ant/dist/lib/ant-apache-resolver.jar:/srv/gump/public/workspace/ant/dist/lib/ant-apache-xalan2.jar:/srv/gump/public/workspace/ant/dist/lib/ant-trax.jar:/srv/gump/public/workspace/ant/dist/lib/ant-junit.jar:/srv/gump/public/workspace/ant/dist/lib/ant-launcher.jar:/srv/gump/public/workspace/ant/dist/lib/ant-nodeps.jar:/srv/gump/public/workspace/ant/dist/lib/ant.jar:/srv/gump/packages/antlr/antlr-3.1.3.jar:/srv/gump/public/workspace/asm/output/dist/lib/asm-analysis-27102009.jar:/srv/gump/public/workspace/asm/output/dist/lib/asm-util-27102009.jar:/srv/gump/public/workspace/asm/output/dist/lib/asm-xml-27102009.jar:/srv/gump/public/workspace/asm/output/dist/lib/asm-commons-27102009.jar:/srv/gump/public/workspace/asm/output/dist/lib/asm-27102009.jar:/srv/gump/public/workspace/asm/output/dist/lib/asm-tree
 -27102009.jar:/srv/gump/packages/axion-1.0-M2/axion-1.0-M2.jar:/srv/gump/packages/cglib/cglib-nodep-2.1_3.jar:commons-cli-gump-26102009.jar:commons-collections-gump-26102009.jar:/srv/gump/public/workspace/httpcomponents/oac.hc3x/dist/commons-httpclient.jar:commons-logging-gump-26102009.jar:commons-logging-api-gump-26102009.jar:/srv/gump/public/workspace/apache-commons/primitives/target/commons-primitives-27102009.jar:/srv/gump/public/workspace/hsqldb/lib/hsqldb.jar:bsf-gump-26102009.jar:/srv/gump/public/workspace/jakarta-regexp/build/jakarta-regexp-27102009.jar:/srv/gump/public/workspace/tomcat-tc6/output/build/lib/servlet-api.jar:/srv/gump/public/workspace/tomcat-tc6/output/build/lib/jsp-api.jar:/srv/gump/packages/jarjar/jarjar-0.6.jar:/srv/gump/public/workspace/jmock/build/dist/jmock-core-27102009.jar:/srv/gump/public/workspace/jmock/build/dist/jmock-cglib-27102009.jar:/srv/gump/public/workspace/junit/dist/junit-27102009.jar:/srv/gump/packages/mockobjects-0.09/mockobjects-
 core-0.09.jar:/srv/gump/packages/mockobjects-0.09/mockobjects-jdk1.4-0.09.jar:/srv/gump/packages/mockobjects-0.09/mockobjects-alt-jdk1.4-0.09.jar:/srv/gump/public/workspace/mx4j/dist/lib/mx4j-impl.jar:/srv/gump/public/workspace/mx4j/dist/lib/mx4j-jmx.jar:/srv/gump/public/workspace/mx4j/dist/lib/mx4j.jar:/srv/gump/packages/nekohtml-0.9.5/nekohtml.jar:/srv/gump/packages/openejb-0.9.2/dist/openejb_loader-0.9.2.jar:/srv/gump/packages/openejb-0.9.2/dist/openejb_ejb_tests-0.9.2.jar:/srv/gump/packages/openejb-0.9.2/dist/openejb_server-0.9.2.jar:/srv/gump/packages/openejb-0.9.2/dist/openejb_client-0.9.2.jar:/srv/gump/packages/openejb-0.9.2/dist/openejb-0.9.2.jar:/srv/gump/packages/qdox-1.6.3/qdox-1.6.3.jar:/srv/gump/packages/radeox-1.0-BETA-2/lib/radeox-api.jar:/srv/gump/packages/radeox-1.0-BETA-2/lib/radeox.jar:/srv/gump/public/workspace/xml-commons/java/external/build/xml-apis-ext.jar:/srv/gump/public/workspace/xmlunit/build/java/lib/xmlunit-sumo-27102009.jar:/srv/gump/public/work
 space/xpp/build/xpp3-27102009.jar:xstream-gump-26102009.jar
---------------------------------------------
Downloading: http://localhost:8192/maven2/org/apache/ivy/ivy/2.1.0/ivy-2.1.0.pom
Downloading: http://localhost:8192/maven2/asm/asm/3.2/asm-3.2.jar
42K downloaded
Downloading: http://localhost:8192/maven2/junit/junit/4.7/junit-4.7.jar
233K downloaded
Downloading: http://localhost:8192/maven2/commons-cli/commons-cli/1.2/commons-cli-1.2.jar
Downloading: http://localhost:8192/maven2/asm/asm-commons/3.2/asm-commons-3.2.jar
32K downloaded
Downloading: http://localhost:8192/maven2/asm/asm-tree/3.2/asm-tree-3.2.jar
21K downloaded
Downloading: http://localhost:8192/maven2/asm/asm-util/3.2/asm-util-3.2.jar
34K downloaded
Downloading: http://localhost:8192/maven2/asm/asm-analysis/3.2/asm-analysis-3.2.jar
17K downloaded
Downloading: http://localhost:8192/maven2/bsf/bsf/2.4.0/bsf-2.4.0.jar
Downloading: http://localhost:8192/maven2/org/livetribe/livetribe-jsr223/2.0.6/livetribe-jsr223-2.0.6.jar
Downloading: http://localhost:8192/maven2/javax/servlet/jsp-api/2.0/jsp-api-2.0.jar
Downloading: http://localhost:8192/maven2/com/thoughtworks/xstream/xstream/1.3.1/xstream-1.3.1.jar
Downloading: http://localhost:8192/maven2/jline/jline/0.9.94/jline-0.9.94.jar
85K downloaded
Downloading: http://localhost:8192/maven2/org/apache/ivy/ivy/2.1.0/ivy-2.1.0.jar
[INFO] [compiler:compile]
[INFO] Nothing to compile - all classes are up to date
[INFO] [resources:testResources]
[WARNING] Using platform encoding (UTF-8 actually) to copy filtered resources, i.e. build is platform dependent!
[INFO] skip non existing resourceDirectory /srv/gump/public/workspace/groovy/src/test/resources
Downloading: http://localhost:8192/maven2/org/apache/ant/ant-junit/1.7.1/ant-junit-1.7.1.jar
98K downloaded
Downloading: http://localhost:8192/maven2/xmlunit/xmlunit/1.3/xmlunit-1.3.jar
111K downloaded
Downloading: http://localhost:8192/maven2/hsqldb/hsqldb/1.8.0.10/hsqldb-1.8.0.10.jar
729K downloaded
[INFO] [compiler:testCompile]
[INFO] Not compiling test sources
Downloading: http://localhost:8192/maven2/org/apache/maven/surefire/surefire-booter/2.3/surefire-booter-2.3.pom
Downloading: http://localhost:8192/maven2/org/apache/maven/surefire/surefire-api/2.3/surefire-api-2.3.pom
Downloading: http://localhost:8192/maven2/org/apache/maven/surefire/surefire-booter/2.3/surefire-booter-2.3.jar
Downloading: http://localhost:8192/maven2/org/apache/maven/surefire/surefire-api/2.3/surefire-api-2.3.jar
[INFO] [surefire:test]
[INFO] Tests are skipped.
[INFO] [jar:jar]
[WARNING] JAR will be empty - no content was marked for inclusion!
[INFO] Building jar: /srv/gump/public/workspace/groovy/target/groovy-1.7-rc-1-SNAPSHOT.jar
[INFO] ------------------------------------------------------------------------
[INFO] BUILD SUCCESSFUL
[INFO] ------------------------------------------------------------------------
[INFO] Total time: 21 seconds
[INFO] Finished at: Tue Oct 27 02:41:20 PST 2009
[INFO] Final Memory: 10M/18M
[INFO] ------------------------------------------------------------------------
---------------------------------------------

To subscribe to this information via syndicated feeds:
- RSS: http://vmgump.apache.org/gump/public/groovy/groovy/rss.xml
- Atom: http://vmgump.apache.org/gump/public/groovy/groovy/atom.xml

============================== Gump Tracking Only ===
Produced by Gump version 2.3.
Gump Run 07000027102009, vmgump:vmgump-public:07000027102009
Gump E-mail Identifier (unique within run) #41.

*********************************************************** G U M P
[GUMP@vmgump]: Project castor-xml-test (in module castor) failed
To whom it may engage...
        
This is an automated request, but not an unsolicited one. For 
more information please visit http://gump.apache.org/nagged.html, 
and/or contact the folk at general@gump.apache.org.

Project castor-xml-test has an issue affecting its community integration.
This issue affects 1 projects,
 and has been outstanding for 91 runs.
The current state of this project is 'Failed', with reason 'Build Failed'.
For reference only, the following projects are affected by this:
    - castor-xml-test :  Java to XML, SQL, LDAP bindings


Full details are available at:
    http://vmgump.apache.org/gump/public/castor/castor-xml-test/index.html

That said, some information snippets are provided here.

The following annotations (debug/informational/warning/error messages) were provided:
 -WARNING- Overriding Maven2 settings: [/srv/gump/public/workspace/castor/xml/gump_mvn_settings.xml]
 -DEBUG- (Gump generated) Maven2 Settings in: /srv/gump/public/workspace/castor/xml/gump_mvn_settings.xml
 -INFO- Failed with reason build failed
 -DEBUG- Maven POM in: /srv/gump/public/workspace/castor/xml/pom.xml



The following work was performed:
http://vmgump.apache.org/gump/public/castor/castor-xml-test/gump_work/build_castor_castor-xml-test.html
Work Name: build_castor_castor-xml-test (Type: Build)
Work ended in a state of : Failed
Elapsed: 16 secs
Command Line: mvn --batch-mode --settings /srv/gump/public/workspace/castor/xml/gump_mvn_settings.xml package 
[Working Directory: /srv/gump/public/workspace/castor/xml]
CLASSPATH: /usr/lib/jvm/java-6-sun/lib/tools.jar:/srv/gump/public/workspace/castor/xml/target/castor-xml-1.3.1-SNAPSHOT.jar
---------------------------------------------
Tests run: 3, Failures: 0, Errors: 0, Skipped: 0, Time elapsed: 0.024 sec
Running org.exolab.castor.xml.util.XMLClassDescriptorResolverImplThreadSafetyTest
Tests run: 1, Failures: 0, Errors: 0, Skipped: 0, Time elapsed: 4.199 sec
Running org.exolab.castor.xml.util.XMLClassDescriptorResolverImplTest
Tests run: 4, Failures: 0, Errors: 0, Skipped: 0, Time elapsed: 0.014 sec
Running org.castor.xml.JavaNamingTest
[main] - Package name: . is not valid
[main] - Package name: .org is not valid
[main] - Package name: org. is not valid
[main] - Package name: . is not valid
[main] - Package name: .org is not valid
[main] - Package name: org. is not valid
Tests run: 10, Failures: 0, Errors: 1, Skipped: 0, Time elapsed: 0.021 sec <<< FAILURE!
Running org.castor.util.TestBase64Decoder
Tests run: 2, Failures: 0, Errors: 0, Skipped: 0, Time elapsed: 0.006 sec
Running org.castor.xml.XMLPropertiesTest
Tests run: 4, Failures: 0, Errors: 0, Skipped: 0, Time elapsed: 0.024 sec
Running org.castor.util.TestHex
Tests run: 1, Failures: 0, Errors: 0, Skipped: 0, Time elapsed: 0.037 sec
Running org.exolab.castor.xml.TestUnmarshaller
[main] - InternalContext must not be null
[main] - InternalContext must not be null
[main] - InternalContext must not be null
[main] - InternalContext must not be null
Tests run: 19, Failures: 0, Errors: 0, Skipped: 0, Time elapsed: 0.135 sec
Running org.exolab.castor.xml.XMLContextTest
Tests run: 2, Failures: 0, Errors: 0, Skipped: 0, Time elapsed: 0.224 sec

Results :

Tests in error: 
  testPut(org.castor.util.TestIdentityMap)
  testGet(org.castor.util.TestIdentityMap)
  testGetClassName(org.castor.xml.JavaNamingTest)

Tests run: 85, Failures: 0, Errors: 3, Skipped: 0

[INFO] ------------------------------------------------------------------------
[ERROR] BUILD FAILURE
[INFO] ------------------------------------------------------------------------
[INFO] There are test failures.

Please refer to /srv/gump/public/workspace/castor/xml/target/surefire-reports for the individual test results.
[INFO] ------------------------------------------------------------------------
[INFO] For more information, run Maven with the -e switch
[INFO] ------------------------------------------------------------------------
[INFO] Total time: 14 seconds
[INFO] Finished at: Tue Oct 27 02:48:11 PST 2009
[INFO] Final Memory: 10M/19M
[INFO] ------------------------------------------------------------------------
---------------------------------------------

To subscribe to this information via syndicated feeds:
- RSS: http://vmgump.apache.org/gump/public/castor/castor-xml-test/rss.xml
- Atom: http://vmgump.apache.org/gump/public/castor/castor-xml-test/atom.xml

============================== Gump Tracking Only ===
Produced by Gump version 2.3.
Gump Run 07000027102009, vmgump:vmgump-public:07000027102009
Gump E-mail Identifier (unique within run) #42.

*********************************************************** G U M P
[GUMP@vmgump]: Project httpcomponents-core-tests (in module httpcomponents) failed
To whom it may engage...
        
This is an automated request, but not an unsolicited one. For 
more information please visit http://gump.apache.org/nagged.html, 
and/or contact the folk at general@gump.apache.org.

Project httpcomponents-core-tests has an issue affecting its community integration.
This issue affects 1 projects,
 and has been outstanding for 85 runs.
The current state of this project is 'Failed', with reason 'Build Failed'.
For reference only, the following projects are affected by this:
    - httpcomponents-core-tests :  Unit Tests for HttpComponents Core


Full details are available at:
    http://vmgump.apache.org/gump/public/httpcomponents/httpcomponents-core-tests/index.html

That said, some information snippets are provided here.

The following annotations (debug/informational/warning/error messages) were provided:
 -WARNING- Overriding Maven2 settings: [/srv/gump/public/workspace/httpcomponents/httpcore/gump_mvn_settings.xml]
 -DEBUG- (Gump generated) Maven2 Settings in: /srv/gump/public/workspace/httpcomponents/httpcore/gump_mvn_settings.xml
 -INFO- Failed with reason build failed
 -DEBUG- Maven POM in: /srv/gump/public/workspace/httpcomponents/httpcore/pom.xml
 -INFO- Project Reports in: /srv/gump/public/workspace/httpcomponents/httpcore/httpcore/target/surefire-reports



The following work was performed:
http://vmgump.apache.org/gump/public/httpcomponents/httpcomponents-core-tests/gump_work/build_httpcomponents_httpcomponents-core-tests.html
Work Name: build_httpcomponents_httpcomponents-core-tests (Type: Build)
Work ended in a state of : Failed
Elapsed: 11 secs
Command Line: mvn --batch-mode --settings /srv/gump/public/workspace/httpcomponents/httpcore/gump_mvn_settings.xml test 
[Working Directory: /srv/gump/public/workspace/httpcomponents/httpcore]
CLASSPATH: /usr/lib/jvm/java-6-sun/lib/tools.jar:/srv/gump/public/workspace/httpcomponents/httpcore/httpcore/target/httpcore-4.1-alpha2-SNAPSHOT.jar:/srv/gump/public/workspace/httpcomponents/httpcore/httpcore-nio/target/httpcore-nio-4.1-alpha2-SNAPSHOT.jar:/srv/gump/public/workspace/junit/dist/junit-27102009.jar:/srv/gump/packages/jsse1.0.3/lib/jcert.jar:/srv/gump/packages/jsse1.0.3/lib/jnet.jar:/srv/gump/packages/jsse1.0.3/lib/jsse.jar
---------------------------------------------
  testRequestExpectContinueZeroContent(org.apache.http.protocol.TestStandardInterceptors)
  testRequestTargetHostMissingHostHTTP10(org.apache.http.protocol.TestStandardInterceptors)
  testRequestTargetHostConnectHttp10(org.apache.http.protocol.TestStandardInterceptors)
  testRequestUserAgentMissingUserAgent(org.apache.http.protocol.TestStandardInterceptors)
  testResponseConnControlNoEntity(org.apache.http.protocol.TestStandardInterceptors)
  testResponseConnControlEntityContentLength(org.apache.http.protocol.TestStandardInterceptors)
  testResponseConnControlEntityChunked(org.apache.http.protocol.TestStandardInterceptors)
  testResponseConnControlClientRequest2(org.apache.http.protocol.TestStandardInterceptors)
  testResponseContentStatusNoContent(org.apache.http.protocol.TestStandardInterceptors)
  testResponseContentStatusResetContent(org.apache.http.protocol.TestStandardInterceptors)
  testResponseContentStatusNotModified(org.apache.http.protocol.TestStandardInterceptors)
  testResponseContentEntityChunked(org.apache.http.protocol.TestStandardInterceptors)
  testResponseContentEntityContentLenghtDelimited(org.apache.http.protocol.TestStandardInterceptors)
  testResponseContentEntityUnknownContentLength(org.apache.http.protocol.TestStandardInterceptors)
  testResponseContentEntityChunkedHTTP10(org.apache.http.protocol.TestStandardInterceptors)
  testResponseContentEntityNoContentTypeAndEncoding(org.apache.http.protocol.TestStandardInterceptors)
  testResponseDateNotGenerated(org.apache.http.protocol.TestStandardInterceptors)
  testRequestDateNotGenerated(org.apache.http.protocol.TestStandardInterceptors)
  testResponseServerMissing(org.apache.http.protocol.TestStandardInterceptors)
  testRegisterUnregister(org.apache.http.protocol.TestHttpRequestHandlerRegistry)
  testContentType(org.apache.http.entity.TestAbstractHttpEntity)
  testContentEncoding(org.apache.http.entity.TestAbstractHttpEntity)
  testParamByName(org.apache.http.message.TestHeaderElement)
  testNullContentTypeGetContentCharset(org.apache.http.util.TestEntityUtils)
  testNoCharsetGetContentCharset(org.apache.http.util.TestEntityUtils)
  testFirstLastHeaders(org.apache.http.message.TestHeaderGroup)
  testCondensedHeader(org.apache.http.message.TestHeaderGroup)
  testBasicReadWriteLine(org.apache.http.impl.TestSessionBuffers)
  testComplexReadWriteLine(org.apache.http.impl.TestSessionBuffers)
  testBasicReadWriteLineLargeBuffer(org.apache.http.impl.TestSessionBuffers)
  testMultibyteCodedReadWriteLine(org.apache.http.impl.TestSessionBuffers)
  testNonAsciiReadWriteLine(org.apache.http.impl.TestSessionBuffers)
  testSetResponseEntity(org.apache.http.message.TestBasicMessages)
  testSetRequestEntity(org.apache.http.message.TestBasicMessages)

Tests run: 419, Failures: 0, Errors: 41, Skipped: 0

[INFO] ------------------------------------------------------------------------
[ERROR] BUILD FAILURE
[INFO] ------------------------------------------------------------------------
[INFO] There are test failures.

Please refer to /srv/gump/public/workspace/httpcomponents/httpcore/httpcore/target/surefire-reports for the individual test results.
[INFO] ------------------------------------------------------------------------
[INFO] For more information, run Maven with the -e switch
[INFO] ------------------------------------------------------------------------
[INFO] Total time: 9 seconds
[INFO] Finished at: Tue Oct 27 02:54:02 PST 2009
[INFO] Final Memory: 21M/38M
[INFO] ------------------------------------------------------------------------
---------------------------------------------

To subscribe to this information via syndicated feeds:
- RSS: http://vmgump.apache.org/gump/public/httpcomponents/httpcomponents-core-tests/rss.xml
- Atom: http://vmgump.apache.org/gump/public/httpcomponents/httpcomponents-core-tests/atom.xml

============================== Gump Tracking Only ===
Produced by Gump version 2.3.
Gump Run 07000027102009, vmgump:vmgump-public:07000027102009
Gump E-mail Identifier (unique within run) #45.

*********************************************************** G U M P
[GUMP@vmgump]: Project mina-test (in module mina) failed
To whom it may engage...
        
This is an automated request, but not an unsolicited one. For 
more information please visit http://gump.apache.org/nagged.html, 
and/or contact the folk at general@gump.apache.org.

Project mina-test has an issue affecting its community integration.
This issue affects 1 projects,
 and has been outstanding for 21 runs.
The current state of this project is 'Failed', with reason 'Build Failed'.
For reference only, the following projects are affected by this:
    - mina-test :  A Multipurpose Infrastrusture for Network Applications


Full details are available at:
    http://vmgump.apache.org/gump/public/mina/mina-test/index.html

That said, some information snippets are provided here.

The following annotations (debug/informational/warning/error messages) were provided:
 -WARNING- Overriding Maven2 settings: [/srv/gump/public/workspace/mina/gump_mvn_settings.xml]
 -DEBUG- (Gump generated) Maven2 Settings in: /srv/gump/public/workspace/mina/gump_mvn_settings.xml
 -INFO- Failed with reason build failed
 -DEBUG- Maven POM in: /srv/gump/public/workspace/mina/pom.xml
 -INFO- Project Reports in: /srv/gump/public/workspace/mina/target/test-reports
 -WARNING- No directory [/srv/gump/public/workspace/mina/target/test-reports]



The following work was performed:
http://vmgump.apache.org/gump/public/mina/mina-test/gump_work/build_mina_mina-test.html
Work Name: build_mina_mina-test (Type: Build)
Work ended in a state of : Failed
Elapsed: 1 min 38 secs
Command Line: mvn --batch-mode --settings /srv/gump/public/workspace/mina/gump_mvn_settings.xml install 
[Working Directory: /srv/gump/public/workspace/mina]
CLASSPATH: /usr/lib/jvm/java-6-sun/lib/tools.jar:/srv/gump/public/workspace/mina/transport-apr/target/mina-transport-apr-2.0.0-RC2-SNAPSHOT.jar:/srv/gump/public/workspace/mina/integration-ognl/target/mina-integration-ognl-2.0.0-RC2-SNAPSHOT.jar:/srv/gump/public/workspace/mina/integration-jmx/target/mina-integration-jmx-2.0.0-RC2-SNAPSHOT.jar:/srv/gump/public/workspace/mina/statemachine/target/mina-statemachine-2.0.0-RC2-SNAPSHOT.jar:/srv/gump/public/workspace/mina/filter-compression/target/mina-filter-compression-2.0.0-RC2-SNAPSHOT.jar:/srv/gump/public/workspace/mina/integration-beans/target/mina-integration-beans-2.0.0-RC2-SNAPSHOT.jar:/srv/gump/public/workspace/mina/core/target/mina-core-2.0.0-RC2-SNAPSHOT.jar
---------------------------------------------
Running org.apache.mina.transport.socket.nio.DatagramConnectorTest
Tests run: 3, Failures: 0, Errors: 0, Skipped: 0, Time elapsed: 0.015 sec
Running org.apache.mina.handler.chain.ChainedIoHandlerTest
Tests run: 1, Failures: 0, Errors: 0, Skipped: 0, Time elapsed: 0.009 sec
Running org.apache.mina.filter.codec.CumulativeProtocolDecoderTest
Tests run: 4, Failures: 0, Errors: 0, Skipped: 0, Time elapsed: 0.011 sec
Running org.apache.mina.filter.keepalive.KeepAliveFilterTest
Tests run: 3, Failures: 0, Errors: 0, Skipped: 0, Time elapsed: 12.106 sec
Running org.apache.mina.transport.socket.nio.SocketBindTest
Tests run: 6, Failures: 0, Errors: 1, Skipped: 0, Time elapsed: 4.455 sec <<< FAILURE!
Running org.apache.mina.core.IoFilterChainTest
Tests run: 8, Failures: 0, Errors: 0, Skipped: 0, Time elapsed: 0.018 sec
Running org.apache.mina.util.byteaccess.ByteAccessTest
Tests run: 14, Failures: 0, Errors: 0, Skipped: 0, Time elapsed: 0.302 sec
Running org.apache.mina.filter.codec.serialization.ObjectSerializationTest
Tests run: 2, Failures: 0, Errors: 0, Skipped: 0, Time elapsed: 0.036 sec
Running org.apache.mina.core.FutureTest
Tests run: 7, Failures: 0, Errors: 0, Skipped: 0, Time elapsed: 0.059 sec
Running org.apache.mina.filter.firewall.SubnetIPv6Test
Tests run: 1, Failures: 0, Errors: 0, Skipped: 0, Time elapsed: 0.021 sec
Running org.apache.mina.filter.stream.StreamWriteFilterTest
Tests run: 8, Failures: 0, Errors: 0, Skipped: 0, Time elapsed: 0.959 sec
Running org.apache.mina.filter.firewall.SubnetIPv4Test
Tests run: 6, Failures: 0, Errors: 0, Skipped: 0, Time elapsed: 0.007 sec
Running org.apache.mina.transport.vmpipe.VmPipeBindTest
Tests run: 6, Failures: 0, Errors: 1, Skipped: 0, Time elapsed: 2.562 sec <<< FAILURE!

Results :

Tests in error: 
  testGet(org.apache.mina.util.ExpiringMapTest)
  testAnonymousBind(org.apache.mina.transport.socket.nio.DatagramBindTest)
  testAnonymousBind(org.apache.mina.transport.socket.nio.SocketBindTest)
  testAnonymousBind(org.apache.mina.transport.vmpipe.VmPipeBindTest)

Tests run: 185, Failures: 0, Errors: 4, Skipped: 0

[INFO] ------------------------------------------------------------------------
[ERROR] BUILD FAILURE
[INFO] ------------------------------------------------------------------------
[INFO] There are test failures.

Please refer to /srv/gump/public/workspace/mina/core/target/surefire-reports for the individual test results.
[INFO] ------------------------------------------------------------------------
[INFO] For more information, run Maven with the -e switch
[INFO] ------------------------------------------------------------------------
[INFO] Total time: 1 minute 36 seconds
[INFO] Finished at: Tue Oct 27 02:55:57 PST 2009
[INFO] Final Memory: 23M/42M
[INFO] ------------------------------------------------------------------------
---------------------------------------------

To subscribe to this information via syndicated feeds:
- RSS: http://vmgump.apache.org/gump/public/mina/mina-test/rss.xml
- Atom: http://vmgump.apache.org/gump/public/mina/mina-test/atom.xml

============================== Gump Tracking Only ===
Produced by Gump version 2.3.
Gump Run 07000027102009, vmgump:vmgump-public:07000027102009
Gump E-mail Identifier (unique within run) #47.

*********************************************************** G U M P
[GUMP@vmgump]: Project ws-axis2 (in module ws-axis2) failed
To whom it may engage...
        
This is an automated request, but not an unsolicited one. For 
more information please visit http://gump.apache.org/nagged.html, 
and/or contact the folk at general@gump.apache.org.

Project ws-axis2 has an issue affecting its community integration.
This issue affects 1 projects,
 and has been outstanding for 51 runs.
The current state of this project is 'Failed', with reason 'Build Failed'.
For reference only, the following projects are affected by this:
    - ws-axis2 :  Apache Axis2 SOAP Stack


Full details are available at:
    http://vmgump.apache.org/gump/public/ws-axis2/ws-axis2/index.html

That said, some information snippets are provided here.

The following annotations (debug/informational/warning/error messages) were provided:
 -DEBUG- Sole output [ws-axis2-27102009] identifier set to project name
 -INFO- Optional dependency javax.servlet prerequisite failed with reason build failed
 -INFO- Optional dependency commons-httpclient prerequisite failed with reason build failed
 -INFO- Optional dependency xml-security prerequisite failed with reason build failed
 -DEBUG- (Gump generated) Maven2 Settings in: /srv/gump/public/workspace/ws-axis2/java/gump_mvn_settings.xml
 -INFO- Failed with reason build failed
 -DEBUG- Maven POM in: /srv/gump/public/workspace/ws-axis2/java/pom.xml
 -INFO- Failed to extract fallback artifacts from Gump Repository



The following work was performed:
http://vmgump.apache.org/gump/public/ws-axis2/ws-axis2/gump_work/build_ws-axis2_ws-axis2.html
Work Name: build_ws-axis2_ws-axis2 (Type: Build)
Work ended in a state of : Failed
Elapsed: 12 mins 25 secs
Command Line: mvn --batch-mode --settings /srv/gump/public/workspace/ws-axis2/java/gump_mvn_settings.xml package 
[Working Directory: /srv/gump/public/workspace/ws-axis2/java]
CLASSPATH: /usr/lib/jvm/java-6-sun/lib/tools.jar:/srv/gump/public/workspace/annogen/build/distribution/annogen-27102009.jar:/srv/gump/public/workspace/httpcomponents/oac.hc3x/dist/commons-httpclient.jar:/srv/gump/packages/dougLea/concurrent.jar:/srv/gump/public/workspace/tomcat-tc6/output/build/lib/servlet-api.jar:/srv/gump/packages/jaf-1.1ea/activation.jar:/srv/gump/packages/javamail-1.4/mail.jar:/srv/gump/packages/javamail-1.4/lib/mailapi.jar:/srv/gump/public/workspace/jaxen/target/jaxen-27102009.jar:/srv/gump/packages/jsse1.0.3/lib/jcert.jar:/srv/gump/packages/jsse1.0.3/lib/jnet.jar:/srv/gump/packages/jsse1.0.3/lib/jsse.jar:/srv/gump/packages/jms1.1/lib/jms.jar:/srv/gump/public/workspace/logging-log4j-12/dist/lib/log4j-27102009.jar:/srv/gump/packages/stax/jsr173_1.0_api.jar:/srv/gump/packages/stax/jsr173_1.0_ri.jar:/srv/gump/public/workspace/ws-axis2-commons/axiom/modules/axiom-impl/target/axiom-impl-1.2.9-SNAPSHOT.jar:/srv/gump/public/workspace/ws-axis2-commons/axiom/modu
 les/axiom-api/target/axiom-api-1.2.9-SNAPSHOT.jar:/srv/gump/public/workspace/ws-axis2-commons/axiom/modules/axiom-dom/target/axiom-dom-1.2.9-SNAPSHOT.jar:/srv/gump/public/workspace/ws-axis2-commons/neethi/target/neethi-3.0.0-SNAPSHOT.jar:/srv/gump/public/workspace/ws-axis2-commons/XmlSchema/target/XmlSchema-2.0-SNAPSHOT.jar:/srv/gump/public/workspace/wsdl4j/build/lib/qname.jar:/srv/gump/public/workspace/wsdl4j/build/lib/wsdl4j.jar:/srv/gump/public/workspace/xml-xmlbeans/build/lib/xbean_xpath.jar:/srv/gump/public/workspace/xml-xmlbeans/build/lib/xmlpublic.jar:/srv/gump/public/workspace/xml-xmlbeans/build/lib/xbean.jar:xml-security-gump-26102009.jar
---------------------------------------------
Running org.apache.axis2.deployment.BadModuleTest
Tests run: 1, Failures: 0, Errors: 0, Skipped: 0, Time elapsed: 0.01 sec
Running org.apache.axis2.dispatchers.SOAPMessageBodyBasedServiceDispatcherTest
Tests run: 1, Failures: 0, Errors: 0, Skipped: 0, Time elapsed: 0.005 sec
Running org.apache.axis2.context.ContextListenerTest
Tests run: 1, Failures: 0, Errors: 1, Skipped: 0, Time elapsed: 0.024 sec <<< FAILURE!

Results :

Failed tests: 
  testExternalizeMessageContext(org.apache.axis2.context.ContextPropertiesExternalizeTest)
  testExternalizeOperationContext(org.apache.axis2.context.ContextPropertiesExternalizeTest)
  testExternalizeServiceContext(org.apache.axis2.context.ContextPropertiesExternalizeTest)
  testExternalizeServiceGroupContext(org.apache.axis2.context.ContextPropertiesExternalizeTest)
  testExternalizeSessionContext(org.apache.axis2.context.ContextPropertiesExternalizeTest)

Tests in error: 
  testOperationActionMapping(org.apache.axis2.description.AxisServiceTest)
  testExcludeOperations(org.apache.axis2.deployment.OperationExcludeTest)
  testEmptyAction(org.apache.axis2.engine.SOAPActionBasedDispatcherTest)
  testNullAction(org.apache.axis2.engine.SOAPActionBasedDispatcherTest)
  testDuplicateAction(org.apache.axis2.engine.SOAPActionBasedDispatcherTest)
  testActionVsOpName(org.apache.axis2.engine.SOAPActionBasedDispatcherTest)
  testInvalidActionVsOpName(org.apache.axis2.engine.SOAPActionBasedDispatcherTest)
  testPhaseRulesWithAfter(org.apache.axis2.phaserule.AddingHandlerToEachPhaseTest)
  testFaultyServiceDueToModuleLogging(org.apache.axis2.deployment.FaultyServicesDueToModuleTest)
  testFaultyServicesRecovery(org.apache.axis2.deployment.FaultyServicesDueToModuleTest)
  testToAndFromOMForSubmissionSpecEPR(org.apache.axis2.addressing.EndpointReferenceHelperTest)
  testSingleParameterWithoutValue(org.apache.axis2.transport.http.util.QueryStringParserTest)
  testMultipleParametersWithoutValue1(org.apache.axis2.transport.http.util.QueryStringParserTest)
  testMultipleParametersWithoutValue2(org.apache.axis2.transport.http.util.QueryStringParserTest)
  testConfinement(org.apache.axis2.classloader.JarFileClassLoaderTest)
  testHandlers(org.apache.axis2.description.RegistryTest)
  testContextListener(org.apache.axis2.context.ContextListenerTest)

Tests run: 167, Failures: 5, Errors: 17, Skipped: 0

[INFO] ------------------------------------------------------------------------
[ERROR] BUILD FAILURE
[INFO] ------------------------------------------------------------------------
[INFO] There are test failures.

Please refer to /srv/gump/public/workspace/ws-axis2/java/modules/kernel/target/surefire-reports for the individual test results.
[INFO] ------------------------------------------------------------------------
[INFO] For more information, run Maven with the -e switch
[INFO] ------------------------------------------------------------------------
[INFO] Total time: 12 minutes 23 seconds
[INFO] Finished at: Tue Oct 27 03:11:36 PST 2009
[INFO] Final Memory: 40M/99M
[INFO] ------------------------------------------------------------------------
---------------------------------------------

To subscribe to this information via syndicated feeds:
- RSS: http://vmgump.apache.org/gump/public/ws-axis2/ws-axis2/rss.xml
- Atom: http://vmgump.apache.org/gump/public/ws-axis2/ws-axis2/atom.xml

============================== Gump Tracking Only ===
Produced by Gump version 2.3.
Gump Run 07000027102009, vmgump:vmgump-public:07000027102009
Gump E-mail Identifier (unique within run) #48.

*********************************************************** G U M P
[GUMP@vmgump]: Project castor-core-test (in module castor) failed
To whom it may engage...
        
This is an automated request, but not an unsolicited one. For 
more information please visit http://gump.apache.org/nagged.html, 
and/or contact the folk at general@gump.apache.org.

Project castor-core-test has an issue affecting its community integration.
This issue affects 1 projects,
 and has been outstanding for 91 runs.
The current state of this project is 'Failed', with reason 'Build Failed'.
For reference only, the following projects are affected by this:
    - castor-core-test :  Java to XML, SQL, LDAP bindings


Full details are available at:
    http://vmgump.apache.org/gump/public/castor/castor-core-test/index.html

That said, some information snippets are provided here.

The following annotations (debug/informational/warning/error messages) were provided:
 -WARNING- Overriding Maven2 settings: [/srv/gump/public/workspace/castor/core/gump_mvn_settings.xml]
 -DEBUG- (Gump generated) Maven2 Settings in: /srv/gump/public/workspace/castor/core/gump_mvn_settings.xml
 -INFO- Failed with reason build failed
 -DEBUG- Maven POM in: /srv/gump/public/workspace/castor/core/pom.xml



The following work was performed:
http://vmgump.apache.org/gump/public/castor/castor-core-test/gump_work/build_castor_castor-core-test.html
Work Name: build_castor_castor-core-test (Type: Build)
Work ended in a state of : Failed
Elapsed: 8 secs
Command Line: mvn --batch-mode --settings /srv/gump/public/workspace/castor/core/gump_mvn_settings.xml package 
[Working Directory: /srv/gump/public/workspace/castor/core]
CLASSPATH: /usr/lib/jvm/java-6-sun/lib/tools.jar:/srv/gump/public/workspace/castor/core/target/castor-core-1.3.1-SNAPSHOT.jar
---------------------------------------------
[INFO] Building Castor CORE - Core code/functioanlity
[INFO]    task-segment: [package]
[INFO] ------------------------------------------------------------------------
[INFO] [resources:resources]
[WARNING] Using platform encoding (UTF-8 actually) to copy filtered resources, i.e. build is platform dependent!
[INFO] Copying 4 resources
[INFO] [compiler:compile]
[INFO] Nothing to compile - all classes are up to date
[INFO] [resources:testResources]
[WARNING] Using platform encoding (UTF-8 actually) to copy filtered resources, i.e. build is platform dependent!
[INFO] Copying 0 resource
[INFO] [compiler:testCompile]
[INFO] Nothing to compile - all classes are up to date
[INFO] [surefire:test]
[INFO] Surefire report directory: /srv/gump/public/workspace/castor/core/target/surefire-reports

-------------------------------------------------------
 T E S T S
-------------------------------------------------------
Running org.castor.core.annotationprocessing.BaseAnnotationProcessingServiceTest
Tests run: 3, Failures: 0, Errors: 0, Skipped: 0, Time elapsed: 0.058 sec
Running org.castor.core.nature.PropertyHolderTest
Tests run: 1, Failures: 0, Errors: 0, Skipped: 1, Time elapsed: 0.005 sec
Running org.castor.core.annotationprocessing.BaseTargetAwareAnnotationProcessingServiceTest
Tests run: 4, Failures: 0, Errors: 0, Skipped: 0, Time elapsed: 0.029 sec
Running org.castor.core.nature.BaseNatureTest
Tests run: 16, Failures: 0, Errors: 1, Skipped: 0, Time elapsed: 0.027 sec <<< FAILURE!
Running org.castor.core.nature.TestNature
Tests run: 1, Failures: 0, Errors: 0, Skipped: 1, Time elapsed: 0.002 sec

Results :

Tests in error: 
  testGetPropertyIfNotSet(org.castor.core.nature.BaseNatureTest)

Tests run: 25, Failures: 0, Errors: 1, Skipped: 2

[INFO] ------------------------------------------------------------------------
[ERROR] BUILD FAILURE
[INFO] ------------------------------------------------------------------------
[INFO] There are test failures.

Please refer to /srv/gump/public/workspace/castor/core/target/surefire-reports for the individual test results.
[INFO] ------------------------------------------------------------------------
[INFO] For more information, run Maven with the -e switch
[INFO] ------------------------------------------------------------------------
[INFO] Total time: 7 seconds
[INFO] Finished at: Tue Oct 27 03:12:59 PST 2009
[INFO] Final Memory: 9M/16M
[INFO] ------------------------------------------------------------------------
---------------------------------------------

To subscribe to this information via syndicated feeds:
- RSS: http://vmgump.apache.org/gump/public/castor/castor-core-test/rss.xml
- Atom: http://vmgump.apache.org/gump/public/castor/castor-core-test/atom.xml

============================== Gump Tracking Only ===
Produced by Gump version 2.3.
Gump Run 07000027102009, vmgump:vmgump-public:07000027102009
Gump E-mail Identifier (unique within run) #49.

*********************************************************** G U M P
[GUMP@vmgump]: Project ws-commons-axiom-test (in module ws-axis2-commons) failed
To whom it may engage...
        
This is an automated request, but not an unsolicited one. For 
more information please visit http://gump.apache.org/nagged.html, 
and/or contact the folk at general@gump.apache.org.

Project ws-commons-axiom-test has an issue affecting its community integration.
This issue affects 1 projects,
 and has been outstanding for 29 runs.
The current state of this project is 'Failed', with reason 'Build Failed'.
For reference only, the following projects are affected by this:
    - ws-commons-axiom-test :  Common stuff for the WS projects.


Full details are available at:
    http://vmgump.apache.org/gump/public/ws-axis2-commons/ws-commons-axiom-test/index.html

That said, some information snippets are provided here.

The following annotations (debug/informational/warning/error messages) were provided:
 -WARNING- Overriding Maven2 settings: [/srv/gump/public/workspace/ws-axis2-commons/axiom/gump_mvn_settings.xml]
 -DEBUG- (Gump generated) Maven2 Settings in: /srv/gump/public/workspace/ws-axis2-commons/axiom/gump_mvn_settings.xml
 -INFO- Failed with reason build failed
 -DEBUG- Maven POM in: /srv/gump/public/workspace/ws-axis2-commons/axiom/pom.xml



The following work was performed:
http://vmgump.apache.org/gump/public/ws-axis2-commons/ws-commons-axiom-test/gump_work/build_ws-axis2-commons_ws-commons-axiom-test.html
Work Name: build_ws-axis2-commons_ws-commons-axiom-test (Type: Build)
Work ended in a state of : Failed
Elapsed: 21 secs
Command Line: mvn --batch-mode --settings /srv/gump/public/workspace/ws-axis2-commons/axiom/gump_mvn_settings.xml package 
[Working Directory: /srv/gump/public/workspace/ws-axis2-commons/axiom]
CLASSPATH: /usr/lib/jvm/java-6-sun/lib/tools.jar:/srv/gump/public/workspace/ws-axis2-commons/axiom/modules/axiom-impl/target/axiom-impl-1.2.9-SNAPSHOT.jar:/srv/gump/public/workspace/ws-axis2-commons/axiom/modules/axiom-api/target/axiom-api-1.2.9-SNAPSHOT.jar:/srv/gump/public/workspace/ws-axis2-commons/axiom/modules/axiom-dom/target/axiom-dom-1.2.9-SNAPSHOT.jar
---------------------------------------------
Running org.apache.axiom.util.namespace.ScopedNamespaceContextTest
Tests run: 4, Failures: 0, Errors: 2, Skipped: 0, Time elapsed: 0.015 sec <<< FAILURE!
Running org.apache.axiom.util.blob.MemoryBlobTest
Tests run: 9, Failures: 0, Errors: 0, Skipped: 0, Time elapsed: 0.048 sec
Running org.apache.axiom.attachments.utils.BAAInputStreamTest
Tests run: 1, Failures: 0, Errors: 0, Skipped: 0, Time elapsed: 0.003 sec
Running org.apache.axiom.om.impl.serialize.StreamingOMSerializerTest
Tests run: 11, Failures: 0, Errors: 0, Skipped: 0, Time elapsed: 0.386 sec
Running org.apache.axiom.om.util.CommonUtilsTest
Tests run: 1, Failures: 0, Errors: 0, Skipped: 0, Time elapsed: 0.004 sec
Running org.apache.axiom.om.util.Base64Test
Tests run: 1, Failures: 0, Errors: 0, Skipped: 0, Time elapsed: 0.012 sec
Running org.apache.axiom.util.blob.OverflowBlobTest
Oct 27, 2009 3:13:32 AM org.apache.axiom.util.blob.OverflowBlob finalize
WARNING: Cleaning up unreleased temporary file /tmp/test56722.dat
Oct 27, 2009 3:13:32 AM org.apache.axiom.util.blob.OverflowBlob finalize
WARNING: Cleaning up unreleased temporary file /tmp/test56723.dat
Tests run: 9, Failures: 0, Errors: 0, Skipped: 0, Time elapsed: 0.028 sec
Running org.apache.axiom.om.util.StAXUtilsTest
Tests run: 4, Failures: 0, Errors: 0, Skipped: 0, Time elapsed: 0.694 sec
Running org.apache.axiom.attachments.impl.BufferUtilsTest
Tests run: 4, Failures: 0, Errors: 0, Skipped: 0, Time elapsed: 0.687 sec
Running org.apache.axiom.util.stax.XMLStreamReaderUtilsTest
Tests run: 6, Failures: 0, Errors: 0, Skipped: 0, Time elapsed: 0.114 sec
Running org.apache.axiom.attachments.DeleteAttachmentTest
Tests run: 1, Failures: 0, Errors: 0, Skipped: 0, Time elapsed: 0.005 sec
Running org.apache.axiom.util.stax.xop.XOPDecodingStreamReaderTest
Tests run: 2, Failures: 0, Errors: 0, Skipped: 0, Time elapsed: 0.568 sec

Results :

Tests in error: 
  testScope(org.apache.axiom.util.namespace.ScopedNamespaceContextTest)
  testMaskedPrefix(org.apache.axiom.util.namespace.ScopedNamespaceContextTest)

Tests run: 69, Failures: 0, Errors: 2, Skipped: 0

[INFO] ------------------------------------------------------------------------
[ERROR] BUILD FAILURE
[INFO] ------------------------------------------------------------------------
[INFO] There are test failures.

Please refer to /srv/gump/public/workspace/ws-axis2-commons/axiom/modules/axiom-api/target/surefire-reports for the individual test results.
[INFO] ------------------------------------------------------------------------
[INFO] For more information, run Maven with the -e switch
[INFO] ------------------------------------------------------------------------
[INFO] Total time: 19 seconds
[INFO] Finished at: Tue Oct 27 03:13:34 PST 2009
[INFO] Final Memory: 29M/52M
[INFO] ------------------------------------------------------------------------
---------------------------------------------

To subscribe to this information via syndicated feeds:
- RSS: http://vmgump.apache.org/gump/public/ws-axis2-commons/ws-commons-axiom-test/rss.xml
- Atom: http://vmgump.apache.org/gump/public/ws-axis2-commons/ws-commons-axiom-test/atom.xml

============================== Gump Tracking Only ===
Produced by Gump version 2.3.
Gump Run 07000027102009, vmgump:vmgump-public:07000027102009
Gump E-mail Identifier (unique within run) #50.

*********************************************************** G U M P
[GUMP@vmgump]: Project castor-test (in module castor) failed
To whom it may engage...
        
This is an automated request, but not an unsolicited one. For 
more information please visit http://gump.apache.org/nagged.html, 
and/or contact the folk at general@gump.apache.org.

Project castor-test has an issue affecting its community integration.
This issue affects 1 projects,
 and has been outstanding for 53 runs.
The current state of this project is 'Failed', with reason 'Build Failed'.
For reference only, the following projects are affected by this:
    - castor-test :  Java to XML, SQL, LDAP bindings


Full details are available at:
    http://vmgump.apache.org/gump/public/castor/castor-test/index.html

That said, some information snippets are provided here.

The following annotations (debug/informational/warning/error messages) were provided:
 -WARNING- Overriding Maven2 settings: [/srv/gump/public/workspace/castor/gump_mvn_settings.xml]
 -DEBUG- (Gump generated) Maven2 Settings in: /srv/gump/public/workspace/castor/gump_mvn_settings.xml
 -INFO- Failed with reason build failed
 -DEBUG- Maven POM in: /srv/gump/public/workspace/castor/pom.xml



The following work was performed:
http://vmgump.apache.org/gump/public/castor/castor-test/gump_work/build_castor_castor-test.html
Work Name: build_castor_castor-test (Type: Build)
Work ended in a state of : Failed
Elapsed: 16 secs
Command Line: mvn --batch-mode --settings /srv/gump/public/workspace/castor/gump_mvn_settings.xml package 
[Working Directory: /srv/gump/public/workspace/castor]
CLASSPATH: /usr/lib/jvm/java-6-sun/lib/tools.jar:/srv/gump/public/workspace/castor/core/target/castor-core-1.3.1-SNAPSHOT.jar:/srv/gump/public/workspace/castor/xml/target/castor-xml-1.3.1-SNAPSHOT.jar
---------------------------------------------
[INFO] Building Castor CORE - Core code/functioanlity
[INFO]    task-segment: [package]
[INFO] ------------------------------------------------------------------------
[INFO] [resources:resources]
[WARNING] Using platform encoding (UTF-8 actually) to copy filtered resources, i.e. build is platform dependent!
[INFO] Copying 4 resources
[INFO] [compiler:compile]
[INFO] Nothing to compile - all classes are up to date
[INFO] [resources:testResources]
[WARNING] Using platform encoding (UTF-8 actually) to copy filtered resources, i.e. build is platform dependent!
[INFO] Copying 0 resource
[INFO] [compiler:testCompile]
[INFO] Nothing to compile - all classes are up to date
[INFO] [surefire:test]
[INFO] Surefire report directory: /srv/gump/public/workspace/castor/core/target/surefire-reports

-------------------------------------------------------
 T E S T S
-------------------------------------------------------
Running org.castor.core.annotationprocessing.BaseAnnotationProcessingServiceTest
Tests run: 3, Failures: 0, Errors: 0, Skipped: 0, Time elapsed: 0.083 sec
Running org.castor.core.nature.PropertyHolderTest
Tests run: 1, Failures: 0, Errors: 0, Skipped: 1, Time elapsed: 0.007 sec
Running org.castor.core.annotationprocessing.BaseTargetAwareAnnotationProcessingServiceTest
Tests run: 4, Failures: 0, Errors: 0, Skipped: 0, Time elapsed: 0.04 sec
Running org.castor.core.nature.BaseNatureTest
Tests run: 16, Failures: 0, Errors: 1, Skipped: 0, Time elapsed: 0.174 sec <<< FAILURE!
Running org.castor.core.nature.TestNature
Tests run: 1, Failures: 0, Errors: 0, Skipped: 1, Time elapsed: 0.001 sec

Results :

Tests in error: 
  testGetPropertyIfNotSet(org.castor.core.nature.BaseNatureTest)

Tests run: 25, Failures: 0, Errors: 1, Skipped: 2

[INFO] ------------------------------------------------------------------------
[ERROR] BUILD FAILURE
[INFO] ------------------------------------------------------------------------
[INFO] There are test failures.

Please refer to /srv/gump/public/workspace/castor/core/target/surefire-reports for the individual test results.
[INFO] ------------------------------------------------------------------------
[INFO] For more information, run Maven with the -e switch
[INFO] ------------------------------------------------------------------------
[INFO] Total time: 15 seconds
[INFO] Finished at: Tue Oct 27 03:15:15 PST 2009
[INFO] Final Memory: 14M/26M
[INFO] ------------------------------------------------------------------------
---------------------------------------------

To subscribe to this information via syndicated feeds:
- RSS: http://vmgump.apache.org/gump/public/castor/castor-test/rss.xml
- Atom: http://vmgump.apache.org/gump/public/castor/castor-test/atom.xml

============================== Gump Tracking Only ===
Produced by Gump version 2.3.
Gump Run 07000027102009, vmgump:vmgump-public:07000027102009
Gump E-mail Identifier (unique within run) #51.

*********************************************************** G U M P
[GUMP@vmgump]: Project tapestry (in module tapestry) failed
To whom it may engage...
        
This is an automated request, but not an unsolicited one. For 
more information please visit http://gump.apache.org/nagged.html, 
and/or contact the folk at general@gump.apache.org.

Project tapestry has an issue affecting its community integration.
This issue affects 1 projects,
 and has been outstanding for 1249 runs.
The current state of this project is 'Failed', with reason 'Build Failed'.
For reference only, the following projects are affected by this:
    - tapestry :  Component-based web application framework organized around i...


Full details are available at:
    http://vmgump.apache.org/gump/public/tapestry/tapestry/index.html

That said, some information snippets are provided here.

The following annotations (debug/informational/warning/error messages) were provided:
 -DEBUG- Sole output [tapestry-27102009.jar] identifier set to project name
 -INFO- Optional dependency commons-digester prerequisite failed with reason build failed
 -INFO- Optional dependency commons-digester prerequisite failed with reason build failed
 -INFO- Optional dependency commons-fileupload prerequisite failed with reason build failed
 -INFO- Optional dependency commons-beanutils prerequisite failed with reason build failed
 -INFO- Optional dependency commons-logging prerequisite failed with reason build failed
 -INFO- Optional dependency commons-lang3 failed with reason build failed
 -DEBUG- (Gump generated) Maven2 Settings in: /srv/gump/public/workspace/tapestry/gump_mvn_settings.xml
 -INFO- Failed with reason build failed
 -DEBUG- Maven POM in: /srv/gump/public/workspace/tapestry/pom.xml
 -INFO- Failed to extract fallback artifacts from Gump Repository



The following work was performed:
http://vmgump.apache.org/gump/public/tapestry/tapestry/gump_work/build_tapestry_tapestry.html
Work Name: build_tapestry_tapestry (Type: Build)
Work ended in a state of : Failed
Elapsed: 60 secs
Command Line: mvn --batch-mode --settings /srv/gump/public/workspace/tapestry/gump_mvn_settings.xml package 
[Working Directory: /srv/gump/public/workspace/tapestry]
CLASSPATH: /usr/lib/jvm/java-6-sun/lib/tools.jar:/srv/gump/public/workspace/apache-commons/beanutils/dist/commons-beanutils-27102009.jar:/srv/gump/public/workspace/apache-commons/codec/dist/commons-codec-27102009.jar:/srv/gump/public/workspace/apache-commons/digester/dist/commons-digester.jar:/srv/gump/public/workspace/apache-commons/fileupload/target/commons-fileupload-27102009.jar:/srv/gump/public/workspace/apache-commons/io/target/commons-io-27102009.jar:commons-lang-gump-27102009.jar:commons-logging-gump-26102009.jar:commons-logging-api-gump-26102009.jar:/srv/gump/public/workspace/jakarta-oro/jakarta-oro-27102009.jar:/srv/gump/public/workspace/jakarta-servletapi-4/lib/servlet.jar:/srv/gump/public/workspace/javassist/javassist.jar:/srv/gump/public/workspace/jdom/build/jdom.jar:/srv/gump/public/workspace/logging-log4j-12/dist/lib/log4j-27102009.jar:/srv/gump/packages/ognl-2.6.7/ognl-2.6.7.jar:/srv/gump/public/workspace/xml-commons/java/external/build/xml-apis-ext.jar
---------------------------------------------
location: class org.apache.tapestry.services.impl.HiveMindExpressionCompiler

/srv/gump/public/workspace/tapestry/tapestry-framework/src/java/org/apache/tapestry/services/impl/HiveMindExpressionCompiler.java:[425,21] cannot find symbol
symbol  : method getRootExpression(ognl.Node,java.lang.Object,ognl.OgnlContext)
location: class org.apache.tapestry.services.impl.HiveMindExpressionCompiler

/srv/gump/public/workspace/tapestry/tapestry-framework/src/java/org/apache/tapestry/listener/ListenerMapPropertyAccessor.java:[81,20] cannot find symbol
symbol  : method getPropertyClass(ognl.OgnlContext,java.lang.Object,java.lang.Object)
location: class ognl.ObjectPropertyAccessor

/srv/gump/public/workspace/tapestry/tapestry-framework/src/java/org/apache/tapestry/listener/ListenerMapPropertyAccessor.java:[91,36] cannot find symbol
symbol  : method getCompiler()
location: class ognl.OgnlRuntime

/srv/gump/public/workspace/tapestry/tapestry-framework/src/java/org/apache/tapestry/listener/ListenerMapPropertyAccessor.java:[93,12] cannot find symbol
symbol  : variable ExpressionCompiler
location: class org.apache.tapestry.listener.ListenerMapPropertyAccessor

/srv/gump/public/workspace/tapestry/tapestry-framework/src/java/org/apache/tapestry/listener/ListenerMapPropertyAccessor.java:[95,19] cannot find symbol
symbol  : method setCurrentAccessor(java.lang.Class)
location: class ognl.OgnlContext

/srv/gump/public/workspace/tapestry/tapestry-framework/src/java/org/apache/tapestry/listener/ListenerMapPropertyAccessor.java:[96,19] cannot find symbol
symbol  : method setCurrentType(java.lang.Class)
location: class ognl.OgnlContext

/srv/gump/public/workspace/tapestry/tapestry-framework/src/java/org/apache/tapestry/listener/ListenerMapPropertyAccessor.java:[101,20] cannot find symbol
symbol  : method getSourceAccessor(ognl.OgnlContext,java.lang.Object,java.lang.Object)
location: class ognl.ObjectPropertyAccessor

/srv/gump/public/workspace/tapestry/tapestry-framework/src/java/org/apache/tapestry/listener/ListenerMapPropertyAccessor.java:[106,18] cannot find symbol
symbol  : class UnsupportedCompilationException
location: class org.apache.tapestry.listener.ListenerMapPropertyAccessor

/srv/gump/public/workspace/tapestry/tapestry-framework/src/java/org/apache/tapestry/binding/ExpressionBinding.java:[135,45] cannot find symbol
symbol  : method getAccessor()
location: interface ognl.Node

/srv/gump/public/workspace/tapestry/tapestry-framework/src/java/org/apache/tapestry/binding/ExpressionBinding.java:[210,53] cannot find symbol
symbol  : method getAccessor()
location: interface ognl.Node


[INFO] ------------------------------------------------------------------------
[INFO] For more information, run Maven with the -e switch
[INFO] ------------------------------------------------------------------------
[INFO] Total time: 58 seconds
[INFO] Finished at: Tue Oct 27 03:18:23 PST 2009
[INFO] Final Memory: 23M/57M
[INFO] ------------------------------------------------------------------------
---------------------------------------------

To subscribe to this information via syndicated feeds:
- RSS: http://vmgump.apache.org/gump/public/tapestry/tapestry/rss.xml
- Atom: http://vmgump.apache.org/gump/public/tapestry/tapestry/atom.xml

============================== Gump Tracking Only ===
Produced by Gump version 2.3.
Gump Run 07000027102009, vmgump:vmgump-public:07000027102009
Gump E-mail Identifier (unique within run) #52.

*********************************************************** G U M P
[GUMP@vmgump]: Project cocoon (in module cocoon) failed
To whom it may engage...
        
This is an automated request, but not an unsolicited one. For 
more information please visit http://gump.apache.org/nagged.html, 
and/or contact the folk at general@gump.apache.org.

Project cocoon has an issue affecting its community integration.
This issue affects 1 projects,
 and has been outstanding for 1273 runs.
The current state of this project is 'Failed', with reason 'Build Failed'.
For reference only, the following projects are affected by this:
    - cocoon :  Java XML Framework


Full details are available at:
    http://vmgump.apache.org/gump/public/cocoon/cocoon/index.html

That said, some information snippets are provided here.

The following annotations (debug/informational/warning/error messages) were provided:
 -INFO- Optional dependency htmlunit prerequisite failed with reason build failed
 -INFO- Optional dependency commons-jxpath prerequisite failed with reason build failed
 -INFO- Optional dependency excalibur-datasource prerequisite failed with reason build failed
 -INFO- Optional dependency excalibur-pool-instrumented prerequisite failed with reason build failed
 -INFO- Optional dependency velocity-engine prerequisite failed with reason build failed
 -INFO- Optional dependency commons-validator prerequisite failed with reason build failed
 -INFO- Optional dependency commons-digester prerequisite failed with reason build failed
 -INFO- Optional dependency commons-beanutils prerequisite failed with reason build failed
 -INFO- Optional dependency commons-collections failed with reason build failed
 -INFO- Optional dependency xml-fop prerequisite failed with reason build failed
 -INFO- Optional dependency commons-httpclient prerequisite failed with reason build failed
 -INFO- Optional dependency commons-logging prerequisite failed with reason build failed
 -INFO- Optional dependency commons-lang3 failed with reason build failed
 -INFO- Optional dependency commons-jexl failed with reason build failed
 -DEBUG- (Gump generated) Maven2 Settings in: /srv/gump/public/workspace/cocoon/gump_mvn_settings.xml
 -INFO- Failed with reason build failed
 -DEBUG- Maven POM in: /srv/gump/public/workspace/cocoon/pom.xml



The following work was performed:
http://vmgump.apache.org/gump/public/cocoon/cocoon/gump_work/build_cocoon_cocoon.html
Work Name: build_cocoon_cocoon (Type: Build)
Work ended in a state of : Failed
Elapsed: 6 mins 27 secs
Command Line: mvn --batch-mode --settings /srv/gump/public/workspace/cocoon/gump_mvn_settings.xml package 
[Working Directory: /srv/gump/public/workspace/cocoon]
CLASSPATH: /usr/lib/jvm/java-6-sun/lib/tools.jar:/srv/gump/public/workspace/junit/dist/junit-27102009.jar:commons-lang-gump-27102009.jar:/srv/gump/public/workspace/ant/dist/lib/ant-jmf.jar:/srv/gump/public/workspace/ant/dist/lib/ant-swing.jar:/srv/gump/public/workspace/ant/dist/lib/ant-apache-resolver.jar:/srv/gump/public/workspace/ant/dist/lib/ant-apache-xalan2.jar:/srv/gump/public/workspace/ant/dist/lib/ant-trax.jar:/srv/gump/public/workspace/ant/dist/lib/ant-junit.jar:/srv/gump/public/workspace/ant/dist/lib/ant-launcher.jar:/srv/gump/public/workspace/ant/dist/lib/ant-nodeps.jar:/srv/gump/public/workspace/ant/dist/lib/ant.jar:/srv/gump/public/workspace/aopalliance/build/aopalliance.jar:/srv/gump/packages/bsh-2.0b4/bsh-commands-2.0b4.jar:/srv/gump/packages/bsh-2.0b4/bsh-classpath-2.0b4.jar:/srv/gump/packages/bsh-2.0b4/bsh-core-2.0b4.jar:/srv/gump/packages/bsh-2.0b4/bsh-bsf-2.0b4.jar:/srv/gump/packages/bsh-2.0b4/bsh-2.0b4.jar:/srv/gump/packages/bsh-2.0b4/bsh-reflect-2.0b4.jar
 :/srv/gump/packages/bsh-2.0b4/bsh-util-2.0b4.jar:/srv/gump/public/workspace/apache-commons/beanutils/dist/commons-beanutils-27102009.jar:/srv/gump/public/workspace/apache-commons/codec/dist/commons-codec-27102009.jar:commons-collections-gump-26102009.jar:/srv/gump/public/workspace/apache-commons/configuration/target/commons-configuration-1.7-SNAPSHOT.jar:/srv/gump/public/workspace/apache-commons/digester/dist/commons-digester.jar:/srv/gump/public/workspace/httpcomponents/oac.hc3x/dist/commons-httpclient.jar:/srv/gump/public/workspace/apache-commons/io/target/commons-io-27102009.jar:commons-jexl-gump-26102009.jar:/srv/gump/public/workspace/apache-commons/jxpath/dist/commons-jxpath.jar:commons-logging-gump-26102009.jar:commons-logging-api-gump-26102009.jar:/srv/gump/public/workspace/apache-commons/validator/dist/commons-validator-27102009.jar:/srv/gump/packages/dougLea/concurrent.jar:/srv/gump/public/workspace/dom4j/build/dom4j.jar:/srv/gump/public/workspace/excalibur/componen
 ts/datasource/target/excalibur-datasource-2.2.3-SNAPSHOT.jar:/srv/gump/public/workspace/excalibur/components/pool/instrumented/target/excalibur-pool-instrumented-2.2.3-SNAPSHOT.jar:/srv/gump/public/workspace/hsqldb/lib/hsqldb.jar:/srv/gump/public/workspace/htmlunit/target/htmlunit-27102009.jar:/srv/gump/public/workspace/jakarta-oro/jakarta-oro-27102009.jar:/srv/gump/public/workspace/jakarta-regexp/build/jakarta-regexp-27102009.jar:/srv/gump/public/workspace/jaxen/target/jaxen-27102009.jar:/srv/gump/public/workspace/jdom/build/jdom.jar:/srv/gump/public/workspace/jmock/build/dist/jmock-core-27102009.jar:/srv/gump/public/workspace/jmock/build/dist/jmock-cglib-27102009.jar:/srv/gump/packages/jtidy-04aug2000r7-dev/build/Tidy.jar:/srv/gump/public/workspace/logging-log4j-12/dist/lib/log4j-27102009.jar:/srv/gump/packages/nekohtml-0.9.5/nekohtml.jar:/srv/gump/public/workspace/rhino/build/rhino_27102009/js.jar:velocity-gump-26102009.jar:velocity-dep-gump-26102009.jar:/srv/gump/public/
 workspace/xml-commons/java/external/build/xml-apis-ext.jar:/srv/gump/public/workspace/xml-commons/java/external/build/xml-apis.jar:/srv/gump/public/workspace/xml-batik/batik-27102009/lib/batik-util.jar:/srv/gump/public/workspace/xml-batik/batik-27102009/lib/batik-swing.jar:/srv/gump/public/workspace/xml-batik/batik-27102009/lib/batik-css.jar:/srv/gump/public/workspace/xml-batik/batik-27102009/lib/batik-bridge.jar:/srv/gump/public/workspace/xml-batik/batik-27102009/lib/batik-xml.jar:/srv/gump/public/workspace/xml-batik/batik-27102009/lib/batik-svg-dom.jar:/srv/gump/public/workspace/xml-batik/batik-27102009/lib/batik-awt-util.jar:/srv/gump/public/workspace/xml-batik/batik-27102009/lib/batik-transcoder.jar:/srv/gump/public/workspace/xml-batik/batik-27102009/lib/batik-gui-util.jar:/srv/gump/public/workspace/xml-batik/batik-27102009/lib/batik-dom.jar:/srv/gump/public/workspace/xml-batik/batik-27102009/lib/batik-ext.jar:/srv/gump/public/workspace/xml-batik/batik-27102009/lib/batik
 -script.jar:/srv/gump/public/workspace/xml-batik/batik-27102009/lib/batik-svggen.jar:/srv/gump/public/workspace/xml-batik/batik-27102009/lib/batik-parser.jar:/srv/gump/public/workspace/xml-batik/batik-27102009/lib/batik-extension.jar:/srv/gump/public/workspace/xml-batik/batik-27102009/lib/batik-gvt.jar:/srv/gump/public/workspace/xml-fop/build/fop.jar:/srv/gump/public/workspace/xml-commons/java/build/resolver.jar:/srv/gump/public/workspace/xml-xerces2/build/xercesImpl.jar:/srv/gump/public/workspace/xmlunit/build/java/lib/xmlunit-sumo-27102009.jar:/srv/gump/public/workspace/xom/build/xom-27102009.jar
---------------------------------------------
[INFO] [surefire:test]
[INFO] Surefire report directory: /srv/gump/public/workspace/cocoon/core/cocoon-util/target/surefire-reports

-------------------------------------------------------
 T E S T S
-------------------------------------------------------
Running org.apache.cocoon.util.test.MIMEUtilsTestCase
Tests run: 1, Failures: 0, Errors: 0, Skipped: 0, Time elapsed: 0.027 sec
Running org.apache.cocoon.util.WildcardMatcherHelperTestCase
Tests run: 40, Failures: 0, Errors: 14, Skipped: 0, Time elapsed: 0.091 sec <<< FAILURE!
Running org.apache.cocoon.util.test.IOUtilsTestCase
Tests run: 2, Failures: 0, Errors: 0, Skipped: 0, Time elapsed: 0.069 sec
Running org.apache.cocoon.util.test.NetUtilsTestCase
Tests run: 8, Failures: 0, Errors: 0, Skipped: 0, Time elapsed: 0.016 sec
Running org.apache.cocoon.util.test.DeprecationTestCase
Tests run: 8, Failures: 0, Errors: 0, Skipped: 0, Time elapsed: 0.02 sec
Running org.apache.cocoon.util.BufferedOutputStreamTestCase
Tests run: 5, Failures: 0, Errors: 0, Skipped: 0, Time elapsed: 0.008 sec

Results :

Tests in error: 
  test01WildcardURIMatch(org.apache.cocoon.util.WildcardMatcherHelperTestCase)
  test02WildcardURIMatch(org.apache.cocoon.util.WildcardMatcherHelperTestCase)
  test07WildcardURIMatch(org.apache.cocoon.util.WildcardMatcherHelperTestCase)
  test08WildcardURIMatch(org.apache.cocoon.util.WildcardMatcherHelperTestCase)
  test16WildcardURIMatch(org.apache.cocoon.util.WildcardMatcherHelperTestCase)
  test23WildcardURIMatch(org.apache.cocoon.util.WildcardMatcherHelperTestCase)
  test24WildcardURIMatch(org.apache.cocoon.util.WildcardMatcherHelperTestCase)
  test25WildcardURIMatch(org.apache.cocoon.util.WildcardMatcherHelperTestCase)
  test31WildcardURIMatch(org.apache.cocoon.util.WildcardMatcherHelperTestCase)
  test33WildcardURIMatch(org.apache.cocoon.util.WildcardMatcherHelperTestCase)
  test36WildcardURIMatch(org.apache.cocoon.util.WildcardMatcherHelperTestCase)
  test37WildcardURIMatch(org.apache.cocoon.util.WildcardMatcherHelperTestCase)
  testEmptyPattern(org.apache.cocoon.util.WildcardMatcherHelperTestCase)
  testEndPattern(org.apache.cocoon.util.WildcardMatcherHelperTestCase)

Tests run: 64, Failures: 0, Errors: 14, Skipped: 0

[INFO] ------------------------------------------------------------------------
[ERROR] BUILD FAILURE
[INFO] ------------------------------------------------------------------------
[INFO] There are test failures.
[INFO] ------------------------------------------------------------------------
[INFO] For more information, run Maven with the -e switch
[INFO] ------------------------------------------------------------------------
[INFO] Total time: 6 minutes 25 seconds
[INFO] Finished at: Tue Oct 27 03:31:29 PST 2009
[INFO] Final Memory: 70M/130M
[INFO] ------------------------------------------------------------------------
---------------------------------------------

To subscribe to this information via syndicated feeds:
- RSS: http://vmgump.apache.org/gump/public/cocoon/cocoon/rss.xml
- Atom: http://vmgump.apache.org/gump/public/cocoon/cocoon/atom.xml

============================== Gump Tracking Only ===
Produced by Gump version 2.3.
Gump Run 07000027102009, vmgump:vmgump-public:07000027102009
Gump E-mail Identifier (unique within run) #54.

*********************************************************** G U M P
[GUMP@vmgump]: Project kerberos-common (in module kerberos-shared) failed
To whom it may engage...
        
This is an automated request, but not an unsolicited one. For 
more information please visit http://gump.apache.org/nagged.html, 
and/or contact the folk at general@gump.apache.org.

Project kerberos-common has an issue affecting its community integration.
This issue affects 2 projects,
 and has been outstanding for 102 runs.
The current state of this project is 'Failed', with reason 'Build Failed'.
For reference only, the following projects are affected by this:
    - kerberos-common :  Apache Directory Project
    - kerberos-protocol :  Apache Kerberos Server


Full details are available at:
    http://vmgump.apache.org/gump/public/kerberos-shared/kerberos-common/index.html

That said, some information snippets are provided here.

The following annotations (debug/informational/warning/error messages) were provided:
 -DEBUG- Sole output [kerberos-common-27102009.jar] identifier set to project name
 -DEBUG- (Gump generated) Maven2 Settings in: /srv/gump/public/workspace/kerberos-shared/gump_mvn_settings.xml
 -INFO- Failed with reason build failed
 -DEBUG- Maven POM in: /srv/gump/public/workspace/kerberos-shared/pom.xml
 -INFO- Project Reports in: /srv/gump/public/workspace/kerberos-shared/common/target/test-reports
 -WARNING- No directory [/srv/gump/public/workspace/kerberos-shared/common/target/test-reports]
 -INFO- Failed to extract fallback artifacts from Gump Repository



The following work was performed:
http://vmgump.apache.org/gump/public/kerberos-shared/kerberos-common/gump_work/build_kerberos-shared_kerberos-common.html
Work Name: build_kerberos-shared_kerberos-common (Type: Build)
Work ended in a state of : Failed
Elapsed: 1 sec
Command Line: mvn --batch-mode --settings /srv/gump/public/workspace/kerberos-shared/gump_mvn_settings.xml package 
[Working Directory: /srv/gump/public/workspace/kerberos-shared]
CLASSPATH: /usr/lib/jvm/java-6-sun/lib/tools.jar:/srv/gump/public/workspace/directory-shared/asn1/target/shared-asn1-0.9.16-SNAPSHOT.jar:/srv/gump/packages/bouncycastle-jdk14/bcprov-130.jar:/srv/gump/public/workspace/directory-shared/ldap/target/shared-ldap-0.9.16-SNAPSHOT.jar
---------------------------------------------
	at org.apache.maven.cli.MavenCli.main(MavenCli.java:301)
	at sun.reflect.NativeMethodAccessorImpl.invoke0(Native Method)
	at sun.reflect.NativeMethodAccessorImpl.invoke(NativeMethodAccessorImpl.java:39)
	at sun.reflect.DelegatingMethodAccessorImpl.invoke(DelegatingMethodAccessorImpl.java:25)
	at java.lang.reflect.Method.invoke(Method.java:597)
	at org.codehaus.classworlds.Launcher.launchEnhanced(Launcher.java:315)
	at org.codehaus.classworlds.Launcher.launch(Launcher.java:255)
	at org.codehaus.classworlds.Launcher.mainWithExitCode(Launcher.java:430)
	at org.codehaus.classworlds.Launcher.main(Launcher.java:375)
Caused by: org.apache.maven.project.ProjectBuildingException: Cannot find parent: org.apache.directory.server:apacheds-parent for project: null:apacheds-kerberos-shared:jar:null for project null:apacheds-kerberos-shared:jar:null
	at org.apache.maven.project.DefaultMavenProjectBuilder.assembleLineage(DefaultMavenProjectBuilder.java:1369)
	at org.apache.maven.project.DefaultMavenProjectBuilder.buildInternal(DefaultMavenProjectBuilder.java:820)
	at org.apache.maven.project.DefaultMavenProjectBuilder.buildFromSourceFileInternal(DefaultMavenProjectBuilder.java:505)
	at org.apache.maven.project.DefaultMavenProjectBuilder.build(DefaultMavenProjectBuilder.java:197)
	at org.apache.maven.DefaultMaven.getProject(DefaultMaven.java:583)
	at org.apache.maven.DefaultMaven.collectProjects(DefaultMaven.java:461)
	at org.apache.maven.DefaultMaven.getProjects(DefaultMaven.java:365)
	... 11 more
Caused by: org.apache.maven.project.ProjectBuildingException: POM 'org.apache.directory.server:apacheds-parent' not found in repository: Unable to download the artifact from any repository

  org.apache.directory.server:apacheds-parent:pom:1.5.6-SNAPSHOT

from the specified remote repositories:
  gump-central (http://localhost:8192/maven2)

 for project org.apache.directory.server:apacheds-parent
	at org.apache.maven.project.DefaultMavenProjectBuilder.findModelFromRepository(DefaultMavenProjectBuilder.java:602)
	at org.apache.maven.project.DefaultMavenProjectBuilder.assembleLineage(DefaultMavenProjectBuilder.java:1365)
	... 17 more
Caused by: org.apache.maven.artifact.resolver.ArtifactNotFoundException: Unable to download the artifact from any repository

  org.apache.directory.server:apacheds-parent:pom:1.5.6-SNAPSHOT

from the specified remote repositories:
  gump-central (http://localhost:8192/maven2)


	at org.apache.maven.artifact.resolver.DefaultArtifactResolver.resolve(DefaultArtifactResolver.java:212)
	at org.apache.maven.artifact.resolver.DefaultArtifactResolver.resolve(DefaultArtifactResolver.java:74)
	at org.apache.maven.project.DefaultMavenProjectBuilder.findModelFromRepository(DefaultMavenProjectBuilder.java:555)
	... 18 more
Caused by: org.apache.maven.wagon.ResourceDoesNotExistException: Unable to download the artifact from any repository
	at org.apache.maven.artifact.manager.DefaultWagonManager.getArtifact(DefaultWagonManager.java:332)
	at org.apache.maven.artifact.resolver.DefaultArtifactResolver.resolve(DefaultArtifactResolver.java:200)
	... 20 more
[INFO] ------------------------------------------------------------------------
[INFO] Total time: < 1 second
[INFO] Finished at: Tue Oct 27 03:32:16 PST 2009
[INFO] Final Memory: 1M/4M
[INFO] ------------------------------------------------------------------------
---------------------------------------------

To subscribe to this information via syndicated feeds:
- RSS: http://vmgump.apache.org/gump/public/kerberos-shared/kerberos-common/rss.xml
- Atom: http://vmgump.apache.org/gump/public/kerberos-shared/kerberos-common/atom.xml

============================== Gump Tracking Only ===
Produced by Gump version 2.3.
Gump Run 07000027102009, vmgump:vmgump-public:07000027102009
Gump E-mail Identifier (unique within run) #55.

*********************************************************** G U M P
[GUMP@vmgump]: Project ldap-protocol (in module ldap-protocol) failed
To whom it may engage...
        
This is an automated request, but not an unsolicited one. For 
more information please visit http://gump.apache.org/nagged.html, 
and/or contact the folk at general@gump.apache.org.

Project ldap-protocol has an issue affecting its community integration.
This issue affects 1 projects,
 and has been outstanding for 26 runs.
The current state of this project is 'Failed', with reason 'Build Failed'.
For reference only, the following projects are affected by this:
    - ldap-protocol :  Apache Directory Server


Full details are available at:
    http://vmgump.apache.org/gump/public/ldap-protocol/ldap-protocol/index.html

That said, some information snippets are provided here.

The following annotations (debug/informational/warning/error messages) were provided:
 -DEBUG- Sole output [apacheds-protocol-ldap-1.5.6-SNAPSHOT.jar] identifier set to project name
 -DEBUG- (Gump generated) Maven2 Settings in: /srv/gump/public/workspace/ldap-protocol/gump_mvn_settings.xml
 -INFO- Failed with reason build failed
 -DEBUG- Maven POM in: /srv/gump/public/workspace/ldap-protocol/pom.xml
 -INFO- Project Reports in: /srv/gump/public/workspace/ldap-protocol/target/test-reports
 -WARNING- No directory [/srv/gump/public/workspace/ldap-protocol/target/test-reports]
 -INFO- Failed to extract fallback artifacts from Gump Repository



The following work was performed:
http://vmgump.apache.org/gump/public/ldap-protocol/ldap-protocol/gump_work/build_ldap-protocol_ldap-protocol.html
Work Name: build_ldap-protocol_ldap-protocol (Type: Build)
Work ended in a state of : Failed
Elapsed: 1 sec
Command Line: mvn --batch-mode --settings /srv/gump/public/workspace/ldap-protocol/gump_mvn_settings.xml install 
[Working Directory: /srv/gump/public/workspace/ldap-protocol]
CLASSPATH: /usr/lib/jvm/java-6-sun/lib/tools.jar:/srv/gump/public/workspace/directory-shared/asn1-codec/target/shared-asn1-codec-0.9.16-SNAPSHOT.jar:/srv/gump/public/workspace/directory-shared/ldap/target/shared-ldap-0.9.16-SNAPSHOT.jar:/srv/gump/public/workspace/mina/transport-apr/target/mina-transport-apr-2.0.0-RC2-SNAPSHOT.jar:/srv/gump/public/workspace/mina/integration-ognl/target/mina-integration-ognl-2.0.0-RC2-SNAPSHOT.jar:/srv/gump/public/workspace/mina/integration-jmx/target/mina-integration-jmx-2.0.0-RC2-SNAPSHOT.jar:/srv/gump/public/workspace/mina/statemachine/target/mina-statemachine-2.0.0-RC2-SNAPSHOT.jar:/srv/gump/public/workspace/mina/filter-compression/target/mina-filter-compression-2.0.0-RC2-SNAPSHOT.jar:/srv/gump/public/workspace/mina/integration-beans/target/mina-integration-beans-2.0.0-RC2-SNAPSHOT.jar:/srv/gump/public/workspace/mina/core/target/mina-core-2.0.0-RC2-SNAPSHOT.jar
---------------------------------------------
	at org.apache.maven.cli.MavenCli.main(MavenCli.java:301)
	at sun.reflect.NativeMethodAccessorImpl.invoke0(Native Method)
	at sun.reflect.NativeMethodAccessorImpl.invoke(NativeMethodAccessorImpl.java:39)
	at sun.reflect.DelegatingMethodAccessorImpl.invoke(DelegatingMethodAccessorImpl.java:25)
	at java.lang.reflect.Method.invoke(Method.java:597)
	at org.codehaus.classworlds.Launcher.launchEnhanced(Launcher.java:315)
	at org.codehaus.classworlds.Launcher.launch(Launcher.java:255)
	at org.codehaus.classworlds.Launcher.mainWithExitCode(Launcher.java:430)
	at org.codehaus.classworlds.Launcher.main(Launcher.java:375)
Caused by: org.apache.maven.project.ProjectBuildingException: Cannot find parent: org.apache.directory.server:apacheds-parent for project: null:apacheds-protocol-ldap:jar:null for project null:apacheds-protocol-ldap:jar:null
	at org.apache.maven.project.DefaultMavenProjectBuilder.assembleLineage(DefaultMavenProjectBuilder.java:1369)
	at org.apache.maven.project.DefaultMavenProjectBuilder.buildInternal(DefaultMavenProjectBuilder.java:820)
	at org.apache.maven.project.DefaultMavenProjectBuilder.buildFromSourceFileInternal(DefaultMavenProjectBuilder.java:505)
	at org.apache.maven.project.DefaultMavenProjectBuilder.build(DefaultMavenProjectBuilder.java:197)
	at org.apache.maven.DefaultMaven.getProject(DefaultMaven.java:583)
	at org.apache.maven.DefaultMaven.collectProjects(DefaultMaven.java:461)
	at org.apache.maven.DefaultMaven.getProjects(DefaultMaven.java:365)
	... 11 more
Caused by: org.apache.maven.project.ProjectBuildingException: POM 'org.apache.directory.server:apacheds-parent' not found in repository: Unable to download the artifact from any repository

  org.apache.directory.server:apacheds-parent:pom:1.5.6-SNAPSHOT

from the specified remote repositories:
  gump-central (http://localhost:8192/maven2)

 for project org.apache.directory.server:apacheds-parent
	at org.apache.maven.project.DefaultMavenProjectBuilder.findModelFromRepository(DefaultMavenProjectBuilder.java:602)
	at org.apache.maven.project.DefaultMavenProjectBuilder.assembleLineage(DefaultMavenProjectBuilder.java:1365)
	... 17 more
Caused by: org.apache.maven.artifact.resolver.ArtifactNotFoundException: Unable to download the artifact from any repository

  org.apache.directory.server:apacheds-parent:pom:1.5.6-SNAPSHOT

from the specified remote repositories:
  gump-central (http://localhost:8192/maven2)


	at org.apache.maven.artifact.resolver.DefaultArtifactResolver.resolve(DefaultArtifactResolver.java:212)
	at org.apache.maven.artifact.resolver.DefaultArtifactResolver.resolve(DefaultArtifactResolver.java:74)
	at org.apache.maven.project.DefaultMavenProjectBuilder.findModelFromRepository(DefaultMavenProjectBuilder.java:555)
	... 18 more
Caused by: org.apache.maven.wagon.ResourceDoesNotExistException: Unable to download the artifact from any repository
	at org.apache.maven.artifact.manager.DefaultWagonManager.getArtifact(DefaultWagonManager.java:332)
	at org.apache.maven.artifact.resolver.DefaultArtifactResolver.resolve(DefaultArtifactResolver.java:200)
	... 20 more
[INFO] ------------------------------------------------------------------------
[INFO] Total time: < 1 second
[INFO] Finished at: Tue Oct 27 03:32:22 PST 2009
[INFO] Final Memory: 1M/4M
[INFO] ------------------------------------------------------------------------
---------------------------------------------

To subscribe to this information via syndicated feeds:
- RSS: http://vmgump.apache.org/gump/public/ldap-protocol/ldap-protocol/rss.xml
- Atom: http://vmgump.apache.org/gump/public/ldap-protocol/ldap-protocol/atom.xml

============================== Gump Tracking Only ===
Produced by Gump version 2.3.
Gump Run 07000027102009, vmgump:vmgump-public:07000027102009
Gump E-mail Identifier (unique within run) #56.

*********************************************************** G U M P
[GUMP@vmgump]: Project apacheds-shared-test (in module apacheds) failed
To whom it may engage...
        
This is an automated request, but not an unsolicited one. For 
more information please visit http://gump.apache.org/nagged.html, 
and/or contact the folk at general@gump.apache.org.

Project apacheds-shared-test has an issue affecting its community integration.
This issue affects 1 projects,
 and has been outstanding for 21 runs.
The current state of this project is 'Failed', with reason 'Build Failed'.
For reference only, the following projects are affected by this:
    - apacheds-shared-test :  Apache Directory Server


Full details are available at:
    http://vmgump.apache.org/gump/public/apacheds/apacheds-shared-test/index.html

That said, some information snippets are provided here.

The following annotations (debug/informational/warning/error messages) were provided:
 -WARNING- Overriding Maven2 settings: [/srv/gump/public/workspace/apacheds/gump_mvn_settings.xml]
 -DEBUG- (Gump generated) Maven2 Settings in: /srv/gump/public/workspace/apacheds/gump_mvn_settings.xml
 -INFO- Failed with reason build failed
 -DEBUG- Maven POM in: /srv/gump/public/workspace/apacheds/pom.xml
 -INFO- Project Reports in: /srv/gump/public/workspace/apacheds/shared/target/test-reports
 -WARNING- No directory [/srv/gump/public/workspace/apacheds/shared/target/test-reports]



The following work was performed:
http://vmgump.apache.org/gump/public/apacheds/apacheds-shared-test/gump_work/build_apacheds_apacheds-shared-test.html
Work Name: build_apacheds_apacheds-shared-test (Type: Build)
Work ended in a state of : Failed
Elapsed: 50 secs
Command Line: mvn --batch-mode --settings /srv/gump/public/workspace/apacheds/gump_mvn_settings.xml install 
[Working Directory: /srv/gump/public/workspace/apacheds]
CLASSPATH: /usr/lib/jvm/java-6-sun/lib/tools.jar
---------------------------------------------
Running org.apache.directory.shared.dsmlv2.extendedRequest.ExtendedRequestTest
Tests run: 14, Failures: 0, Errors: 1, Skipped: 0, Time elapsed: 0.045 sec <<< FAILURE!
Running org.apache.directory.shared.dsmlv2.delResponse.DelResponseTest
Tests run: 18, Failures: 0, Errors: 1, Skipped: 0, Time elapsed: 0.037 sec <<< FAILURE!
Running org.apache.directory.shared.dsmlv2.errorResponse.ErrorResponseTest
Tests run: 14, Failures: 0, Errors: 1, Skipped: 0, Time elapsed: 0.031 sec <<< FAILURE!
Running org.apache.directory.shared.dsmlv2.delRequest.DelRequestTest
Tests run: 10, Failures: 0, Errors: 0, Skipped: 0, Time elapsed: 0.019 sec
Running org.apache.directory.shared.dsmlv2.batchRequest.BatchRequestTest
Tests run: 22, Failures: 0, Errors: 0, Skipped: 0, Time elapsed: 0.041 sec
Running org.apache.directory.shared.dsmlv2.searchResponse.searchResultDone.SearchResultDoneTest
Tests run: 18, Failures: 0, Errors: 1, Skipped: 0, Time elapsed: 0.035 sec <<< FAILURE!

Results :

Tests in error: 
  testResponseWithEmptyErrorMessage(org.apache.directory.shared.dsmlv2.addResponse.AddResponseTest)
  testResponseWithEmptyErrorMessage(org.apache.directory.shared.dsmlv2.authResponse.AuthResponseTest)
  testResponseWithEmptyErrorMessage(org.apache.directory.shared.dsmlv2.compareResponse.CompareResponseTest)
  testResponseWithEmptyErrorMessage(org.apache.directory.shared.dsmlv2.modDNResponse.ModifyDNResponseTest)
  testRequestWith1AssertionEmptyValue(org.apache.directory.shared.dsmlv2.compareRequest.CompareRequestTest)
  testResponseWithEmptyErrorMessage(org.apache.directory.shared.dsmlv2.extendedResponse.ExtendedResponseTest)
  testRequestWithApproxMatchFilterEmptyValue(org.apache.directory.shared.dsmlv2.searchRequest.SearchRequestTest)
  testRequestWithGreaterOrEqualFilterEmptyValue(org.apache.directory.shared.dsmlv2.searchRequest.SearchRequestTest)
  testRequestWithLessOrEqualFilterEmptyValue(org.apache.directory.shared.dsmlv2.searchRequest.SearchRequestTest)
  testRequestWithEqualityMatchFilterWithEmptyValue(org.apache.directory.shared.dsmlv2.searchRequest.SearchRequestTest)
  testRequestWithExtensibleMatchWithEmptyValue(org.apache.directory.shared.dsmlv2.searchRequest.SearchRequestTest)
  testRequestWithSubstrings1EmptyInitial(org.apache.directory.shared.dsmlv2.searchRequest.SearchRequestTest)
  testRequestWithSubstrings1EmptyFinal(org.apache.directory.shared.dsmlv2.searchRequest.SearchRequestTest)
  testResponseWithEmptyErrorMessage(org.apache.directory.shared.dsmlv2.modifyResponse.ModifyResponseTest)
  testRequestWithEmptyRequestValue(org.apache.directory.shared.dsmlv2.extendedRequest.ExtendedRequestTest)
  testResponseWithEmptyErrorMessage(org.apache.directory.shared.dsmlv2.delResponse.DelResponseTest)
  testResponseWithEmptyMessage(org.apache.directory.shared.dsmlv2.errorResponse.ErrorResponseTest)
  testResponseWithEmptyErrorMessage(org.apache.directory.shared.dsmlv2.searchResponse.searchResultDone.SearchResultDoneTest)

Tests run: 460, Failures: 0, Errors: 18, Skipped: 0

[INFO] ------------------------------------------------------------------------
[ERROR] BUILD FAILURE
[INFO] ------------------------------------------------------------------------
[INFO] There are test failures.

Please refer to /srv/gump/public/workspace/apacheds/shared/dsml-parser/target/surefire-reports for the individual test results.
[INFO] ------------------------------------------------------------------------
[INFO] For more information, run Maven with the -e switch
[INFO] ------------------------------------------------------------------------
[INFO] Total time: 49 seconds
[INFO] Finished at: Tue Oct 27 03:43:28 PST 2009
[INFO] Final Memory: 30M/54M
[INFO] ------------------------------------------------------------------------
---------------------------------------------

To subscribe to this information via syndicated feeds:
- RSS: http://vmgump.apache.org/gump/public/apacheds/apacheds-shared-test/rss.xml
- Atom: http://vmgump.apache.org/gump/public/apacheds/apacheds-shared-test/atom.xml

============================== Gump Tracking Only ===
Produced by Gump version 2.3.
Gump Run 07000027102009, vmgump:vmgump-public:07000027102009
Gump E-mail Identifier (unique within run) #57.

*********************************************************** G U M P
[GUMP@vmgump]: Project maven-directory-plugin (in module apacheds) failed
To whom it may engage...
        
This is an automated request, but not an unsolicited one. For 
more information please visit http://gump.apache.org/nagged.html, 
and/or contact the folk at general@gump.apache.org.

Project maven-directory-plugin has an issue affecting its community integration.
This issue affects 3 projects,
 and has been outstanding for 21 runs.
The current state of this project is 'Failed', with reason 'Missing Build Outputs'.
For reference only, the following projects are affected by this:
    - apacheds-core :  Apache Directory Server
    - apacheds-main :  Apache Directory Server
    - maven-directory-plugin :  Apache Directory Server


Full details are available at:
    http://vmgump.apache.org/gump/public/apacheds/maven-directory-plugin/index.html

That said, some information snippets are provided here.

The following annotations (debug/informational/warning/error messages) were provided:
 -INFO- Failed with reason missing build outputs
 -ERROR- Missing Output: /srv/gump/public/workspace/apacheds/core-plugin/target/apacheds-core-plugin-1.5.6-SNAPSHOT.jar
 -ERROR- No such directory (where output is expected) : /srv/gump/public/workspace/apacheds/core-plugin/target
 -INFO- Failed to extract fallback artifacts from Gump Repository

To subscribe to this information via syndicated feeds:
- RSS: http://vmgump.apache.org/gump/public/apacheds/maven-directory-plugin/rss.xml
- Atom: http://vmgump.apache.org/gump/public/apacheds/maven-directory-plugin/atom.xml

============================== Gump Tracking Only ===
Produced by Gump version 2.3.
Gump Run 07000027102009, vmgump:vmgump-public:07000027102009
Gump E-mail Identifier (unique within run) #61.


--
Apache Gump
http://gump.apache.org/ [Instance: vmgump]

---------------------------------------------------------------------
To unsubscribe, e-mail: general-unsubscribe@gump.apache.org
For additional commands, e-mail: general-help@gump.apache.org


Mime
View raw message