gump-general mailing list archives

Site index · List index
Message view « Date » · « Thread »
Top « Date » · « Thread »
From g...@vmgump.apache.org
Subject BATCH: All dressed up, with nowhere to go...
Date Mon, 21 Sep 2009 07:37:00 GMT
Dear Gumpmeisters,
            
The following 32 notifys should have been sent

*********************************************************** G U M P
[GUMP@vmgump]: Project nant (in module nant) failed
[GUMP@vmgump]: Project gsbase (in module gsbase) failed
[GUMP@vmgump]: Project gsbase-test (in module gsbase) failed
[GUMP@vmgump]: Module apr-util success, but with warnings.
[GUMP@vmgump]: Module jdom success, but with warnings.
[GUMP@vmgump]: Project jmock2 (in module jmock2) failed
[GUMP@vmgump]: Project apr-iconv-configure (in module apr-iconv) failed
[GUMP@vmgump]: Project derby (in module db-derby) failed
[GUMP@vmgump]: Project dotnet-antlib-test (in module ant-antlibs) failed
[GUMP@vmgump]: Project emma (in module emma) failed
[GUMP@vmgump]: Project logging-log4cxx-configure (in module logging-log4cxx) failed
[GUMP@vmgump]: Project jython (in module jython) failed
[GUMP@vmgump]: Project authx-script-test (in module authx) failed
[GUMP@vmgump]: Project jtidy-cvs (in module jtidy) failed
[GUMP@vmgump]: Project slf4j-test (in module slf4j) failed
[GUMP@vmgump]: Module tomcat-jasper_tc6 success, but with warnings.
[GUMP@vmgump]: Project xml-security-tests (in module xml-security) failed
[GUMP@vmgump]: Project JacORB-idllib (in module JacORB) failed
[GUMP@vmgump]: Project jetty-test (in module jetty) failed
[GUMP@vmgump]: Project commons-jci (in module apache-commons) failed
[GUMP@vmgump]: Module turbine-fulcrum success, but with warnings.
[GUMP@vmgump]: Project invicta (in module invicta) failed
[GUMP@vmgump]: Project ws-commons-axiom-test (in module ws-axis2-commons) failed
[GUMP@vmgump]: Project ws-axis2 (in module ws-axis2) failed
[GUMP@vmgump]: Project kerberos-common (in module kerberos-shared) failed
[GUMP@vmgump]: Project naming-config-test (in module directory-naming) failed
[GUMP@vmgump]: Project tapestry (in module tapestry) failed
[GUMP@vmgump]: Project maven-directory-plugin (in module apacheds) failed
[GUMP@vmgump]: Project cocoon (in module cocoon) failed
[GUMP@vmgump]: Project portals-bridges-velocity (in module portals-bridges) failed
[GUMP@vmgump]: Project portals-pluto-portal-1.0 (in module portals-pluto-1.0) failed
[GUMP@vmgump]: Project authx-example (in module authx) failed
*********************************************************** G U M P
[GUMP@vmgump]: Project nant (in module nant) failed
To whom it may engage...
        
This is an automated request, but not an unsolicited one. For 
more information please visit http://gump.apache.org/nagged.html, 
and/or contact the folk at general@gump.apache.org.

Project nant has an issue affecting its community integration.
This issue affects 1 projects,
 and has been outstanding for 32 runs.
The current state of this project is 'Failed', with reason 'Build Failed'.
For reference only, the following projects are affected by this:
    - nant :  NAnt is a free .NET build tool. In theory it is kind of like...


Full details are available at:
    http://vmgump.apache.org/gump/public/nant/nant/index.html

That said, some information snippets are provided here.

The following annotations (debug/informational/warning/error messages) were provided:
 -INFO- Failed with reason build failed



The following work was performed:
http://vmgump.apache.org/gump/public/nant/nant/gump_work/build_nant_nant.html
Work Name: build_nant_nant (Type: Build)
Work ended in a state of : Failed
Elapsed: 2 secs
Command Line: make 
[Working Directory: /srv/gump/public/workspace/nant]
---------------------------------------------
mkdir -p bootstrap
cp -R lib/ bootstrap/lib
# Mono loads log4net before privatebinpath is set-up, so we need this in the same directory
# as NAnt.exe
cp lib/common/neutral/log4net.dll bootstrap
cp src/NAnt.Console/App.config bootstrap/NAnt.exe.config
mcs -target:exe -define:MONO -out:bootstrap/NAnt.exe -r:bootstrap/log4net.dll \
		-recurse:src/NAnt.Console/*.cs src/CommonAssemblyInfo.cs
resgen  src/NAnt.Core/Resources/Strings.resx bootstrap/NAnt.Core.Resources.Strings.resources
make: resgen: Command not found
make: *** [bootstrap/NAnt.Core.dll] Error 127
---------------------------------------------

To subscribe to this information via syndicated feeds:
- RSS: http://vmgump.apache.org/gump/public/nant/nant/rss.xml
- Atom: http://vmgump.apache.org/gump/public/nant/nant/atom.xml

============================== Gump Tracking Only ===
Produced by Gump version 2.3.
Gump Run 13000021092009, vmgump:vmgump-public:13000021092009
Gump E-mail Identifier (unique within run) #2.

*********************************************************** G U M P
[GUMP@vmgump]: Project gsbase (in module gsbase) failed
To whom it may engage...
        
This is an automated request, but not an unsolicited one. For 
more information please visit http://gump.apache.org/nagged.html, 
and/or contact the folk at general@gump.apache.org.

Project gsbase has an issue affecting its community integration.
This issue affects 2 projects,
 and has been outstanding for 58 runs.
The current state of this project is 'Failed', with reason 'Build Failed'.
For reference only, the following projects are affected by this:
    - gsbase :  A collection of java utility classes
    - htmlunit :  A tool for testing web based applications


Full details are available at:
    http://vmgump.apache.org/gump/public/gsbase/gsbase/index.html

That said, some information snippets are provided here.

The following annotations (debug/informational/warning/error messages) were provided:
 -DEBUG- Sole output [gsbase-21092009.jar] identifier set to project name
 -DEBUG- (Gump generated) Maven Properties in: /srv/gump/public/workspace/gsbase/build.properties
 -INFO- Failed with reason build failed
 -DEBUG- Maven POM in: /srv/gump/public/workspace/gsbase/project.xml
 -DEBUG- Maven project properties in: /srv/gump/public/workspace/gsbase/project.properties
 -INFO- Failed to extract fallback artifacts from Gump Repository



The following work was performed:
http://vmgump.apache.org/gump/public/gsbase/gsbase/gump_work/build_gsbase_gsbase.html
Work Name: build_gsbase_gsbase (Type: Build)
Work ended in a state of : Failed
Elapsed: 9 secs
Command Line: maven --offline jar 
[Working Directory: /srv/gump/public/workspace/gsbase]
CLASSPATH: /usr/lib/jvm/java-6-sun/lib/tools.jar:/srv/gump/public/workspace/gsbase/target/classes:/srv/gump/public/workspace/junit/dist/junit-21092009.jar:/srv/gump/packages/junitperf-1.8/lib/junitperf.jar
---------------------------------------------
| |\/| / _` \ V / -_) ' \  ~ intelligent projects ~
|_|  |_\__,_|\_/\___|_||_|  v. 1.0.2

build:start:

java:prepare-filesystem:
    [mkdir] Created dir: /srv/gump/public/workspace/gsbase/target/classes

java:compile:
    [echo] Compiling to /srv/gump/public/workspace/gsbase/target/classes
    [echo] 
==========================================================

  NOTE: Targetting JVM 1.6, classes
  will not run on earlier JVMs

==========================================================
          
    [javac] Compiling 66 source files to /srv/gump/public/workspace/gsbase/target/classes
/srv/gump/public/workspace/gsbase/src/java/com/gargoylesoftware/base/resource/jdbc/StatementWrapper.java:65: com.gargoylesoftware.base.resource.jdbc.StatementWrapper is not abstract and does not override abstract method isPoolable() in java.sql.Statement
public class StatementWrapper implements Statement {
       ^
/srv/gump/public/workspace/gsbase/src/java/com/gargoylesoftware/base/resource/jdbc/PreparedStatementWrapper.java:64: com.gargoylesoftware.base.resource.jdbc.PreparedStatementWrapper is not abstract and does not override abstract method setNClob(int,java.io.Reader) in java.sql.PreparedStatement
public class PreparedStatementWrapper
       ^
/srv/gump/public/workspace/gsbase/src/java/com/gargoylesoftware/base/resource/jdbc/ConnectionWrapper.java:77: com.gargoylesoftware.base.resource.jdbc.ConnectionWrapper is not abstract and does not override abstract method createStruct(java.lang.String,java.lang.Object[]) in java.sql.Connection
public final class ConnectionWrapper implements Connection, ManagedResource {
             ^
/srv/gump/public/workspace/gsbase/src/java/com/gargoylesoftware/base/resource/jdbc/CallableStatementWrapper.java:81: com.gargoylesoftware.base.resource.jdbc.CallableStatementWrapper is not abstract and does not override abstract method setNClob(java.lang.String,java.io.Reader) in java.sql.CallableStatement
public final class CallableStatementWrapper
             ^
/srv/gump/public/workspace/gsbase/src/java/com/gargoylesoftware/base/resource/jdbc/DatabaseMetaDataWrapper.java:54: com.gargoylesoftware.base.resource.jdbc.DatabaseMetaDataWrapper is not abstract and does not override abstract method getFunctionColumns(java.lang.String,java.lang.String,java.lang.String,java.lang.String) in java.sql.DatabaseMetaData
public final class DatabaseMetaDataWrapper implements DatabaseMetaData {
             ^
/srv/gump/public/workspace/gsbase/src/java/com/gargoylesoftware/base/resource/jdbc/ResultSetWrapper.java:150: com.gargoylesoftware.base.resource.jdbc.ResultSetWrapper is not abstract and does not override abstract method updateNClob(java.lang.String,java.io.Reader) in java.sql.ResultSet
public final class ResultSetWrapper implements ResultSet {
             ^
Note: Some input files use unchecked or unsafe operations.
Note: Recompile with -Xlint:unchecked for details.
6 errors

BUILD FAILED
File...... /home/gump/.maven/cache/maven-java-plugin-1.5/plugin.jelly
Element... ant:javac
Line...... 63
Column.... 48
Compile failed; see the compiler error output for details.
Total time: 8 seconds
Finished at: Mon Sep 21 01:21:03 PDT 2009

---------------------------------------------

To subscribe to this information via syndicated feeds:
- RSS: http://vmgump.apache.org/gump/public/gsbase/gsbase/rss.xml
- Atom: http://vmgump.apache.org/gump/public/gsbase/gsbase/atom.xml

============================== Gump Tracking Only ===
Produced by Gump version 2.3.
Gump Run 13000021092009, vmgump:vmgump-public:13000021092009
Gump E-mail Identifier (unique within run) #3.

*********************************************************** G U M P
[GUMP@vmgump]: Project gsbase-test (in module gsbase) failed
To whom it may engage...
        
This is an automated request, but not an unsolicited one. For 
more information please visit http://gump.apache.org/nagged.html, 
and/or contact the folk at general@gump.apache.org.

Project gsbase-test has an issue affecting its community integration.
This issue affects 1 projects,
 and has been outstanding for 58 runs.
The current state of this project is 'Failed', with reason 'Build Failed'.
For reference only, the following projects are affected by this:
    - gsbase-test :  A collection of java utility classes


Full details are available at:
    http://vmgump.apache.org/gump/public/gsbase/gsbase-test/index.html

That said, some information snippets are provided here.

The following annotations (debug/informational/warning/error messages) were provided:
 -WARNING- Overriding Maven properties: [/srv/gump/public/workspace/gsbase/build.properties]
 -DEBUG- (Gump generated) Maven Properties in: /srv/gump/public/workspace/gsbase/build.properties
 -INFO- Failed with reason build failed
 -DEBUG- Maven POM in: /srv/gump/public/workspace/gsbase/project.xml
 -DEBUG- Maven project properties in: /srv/gump/public/workspace/gsbase/project.properties



The following work was performed:
http://vmgump.apache.org/gump/public/gsbase/gsbase-test/gump_work/build_gsbase_gsbase-test.html
Work Name: build_gsbase_gsbase-test (Type: Build)
Work ended in a state of : Failed
Elapsed: 7 secs
Command Line: maven --offline jar 
[Working Directory: /srv/gump/public/workspace/gsbase]
CLASSPATH: /usr/lib/jvm/java-6-sun/lib/tools.jar:/srv/gump/public/workspace/gsbase/target/classes:/srv/gump/public/workspace/junit/dist/junit-21092009.jar:/srv/gump/packages/junitperf-1.8/lib/junitperf.jar
---------------------------------------------
|  \/  |__ _Apache__ ___
| |\/| / _` \ V / -_) ' \  ~ intelligent projects ~
|_|  |_\__,_|\_/\___|_||_|  v. 1.0.2

build:start:

java:prepare-filesystem:

java:compile:
    [echo] Compiling to /srv/gump/public/workspace/gsbase/target/classes
    [echo] 
==========================================================

  NOTE: Targetting JVM 1.6, classes
  will not run on earlier JVMs

==========================================================
          
    [javac] Compiling 60 source files to /srv/gump/public/workspace/gsbase/target/classes
/srv/gump/public/workspace/gsbase/src/java/com/gargoylesoftware/base/resource/jdbc/StatementWrapper.java:65: com.gargoylesoftware.base.resource.jdbc.StatementWrapper is not abstract and does not override abstract method isPoolable() in java.sql.Statement
public class StatementWrapper implements Statement {
       ^
/srv/gump/public/workspace/gsbase/src/java/com/gargoylesoftware/base/resource/jdbc/PreparedStatementWrapper.java:64: com.gargoylesoftware.base.resource.jdbc.PreparedStatementWrapper is not abstract and does not override abstract method setNClob(int,java.io.Reader) in java.sql.PreparedStatement
public class PreparedStatementWrapper
       ^
/srv/gump/public/workspace/gsbase/src/java/com/gargoylesoftware/base/resource/jdbc/ConnectionWrapper.java:77: com.gargoylesoftware.base.resource.jdbc.ConnectionWrapper is not abstract and does not override abstract method createStruct(java.lang.String,java.lang.Object[]) in java.sql.Connection
public final class ConnectionWrapper implements Connection, ManagedResource {
             ^
/srv/gump/public/workspace/gsbase/src/java/com/gargoylesoftware/base/resource/jdbc/CallableStatementWrapper.java:81: com.gargoylesoftware.base.resource.jdbc.CallableStatementWrapper is not abstract and does not override abstract method setNClob(java.lang.String,java.io.Reader) in java.sql.CallableStatement
public final class CallableStatementWrapper
             ^
/srv/gump/public/workspace/gsbase/src/java/com/gargoylesoftware/base/resource/jdbc/DatabaseMetaDataWrapper.java:54: com.gargoylesoftware.base.resource.jdbc.DatabaseMetaDataWrapper is not abstract and does not override abstract method getFunctionColumns(java.lang.String,java.lang.String,java.lang.String,java.lang.String) in java.sql.DatabaseMetaData
public final class DatabaseMetaDataWrapper implements DatabaseMetaData {
             ^
/srv/gump/public/workspace/gsbase/src/java/com/gargoylesoftware/base/resource/jdbc/ResultSetWrapper.java:150: com.gargoylesoftware.base.resource.jdbc.ResultSetWrapper is not abstract and does not override abstract method updateNClob(java.lang.String,java.io.Reader) in java.sql.ResultSet
public final class ResultSetWrapper implements ResultSet {
             ^
Note: Some input files use unchecked or unsafe operations.
Note: Recompile with -Xlint:unchecked for details.
6 errors

BUILD FAILED
File...... /home/gump/.maven/cache/maven-java-plugin-1.5/plugin.jelly
Element... ant:javac
Line...... 63
Column.... 48
Compile failed; see the compiler error output for details.
Total time: 6 seconds
Finished at: Mon Sep 21 01:23:34 PDT 2009

---------------------------------------------

To subscribe to this information via syndicated feeds:
- RSS: http://vmgump.apache.org/gump/public/gsbase/gsbase-test/rss.xml
- Atom: http://vmgump.apache.org/gump/public/gsbase/gsbase-test/atom.xml

============================== Gump Tracking Only ===
Produced by Gump version 2.3.
Gump Run 13000021092009, vmgump:vmgump-public:13000021092009
Gump E-mail Identifier (unique within run) #4.

*********************************************************** G U M P
[GUMP@vmgump]: Module apr-util success, but with warnings.
To whom it may engage...
        
This is an automated request, but not an unsolicited one. For 
more information please visit http://gump.apache.org/nagged.html, 
and/or contact the folk at general@gump.apache.org.

Module apr-util contains errors.
The current state of this module is 'Success'.

Full details are available at:
    http://vmgump.apache.org/gump/public/apr-util/index.html

That said, some information snippets are provided here.

The following annotations (debug/informational/warning/error messages) were provided:
 -ERROR- *** Failed to update from source control.Stale contents ***



The following work was performed:
http://vmgump.apache.org/gump/public/apr-util/gump_work/update_apr-util.html
Work Name: update_apr-util (Type: Update)
Work ended in a state of : Failed
Elapsed: 14 secs
Command Line: svn --quiet update --non-interactive apr-util 
[Working Directory: /srv/gump/public/workspace/cvs]
---------------------------------------------
svn: Target path '/apr/apr-util/trunk' does not exist
---------------------------------------------

To subscribe to this information via syndicated feeds:
- RSS: http://vmgump.apache.org/gump/public/apr-util/rss.xml
- Atom: http://vmgump.apache.org/gump/public/apr-util/atom.xml

============================== Gump Tracking Only ===
Produced by Gump version 2.3.
Gump Run 13000021092009, vmgump:vmgump-public:13000021092009
Gump E-mail Identifier (unique within run) #5.

*********************************************************** G U M P
[GUMP@vmgump]: Module jdom success, but with warnings.
To whom it may engage...
        
This is an automated request, but not an unsolicited one. For 
more information please visit http://gump.apache.org/nagged.html, 
and/or contact the folk at general@gump.apache.org.

Module jdom contains errors.
The current state of this module is 'Success'.

Full details are available at:
    http://vmgump.apache.org/gump/public/jdom/index.html

That said, some information snippets are provided here.

The following annotations (debug/informational/warning/error messages) were provided:
 -ERROR- *** Failed to update from source control.Stale contents ***



The following work was performed:
http://vmgump.apache.org/gump/public/jdom/gump_work/update_jdom.html
Work Name: update_jdom (Type: Update)
Work ended in a state of : Failed
Elapsed: 3 mins 9 secs
Command Line: cvs -q -z3 -d :pserver:anonymous@cvs.jdom.org:/home/cvspublic update -P -d 
[Working Directory: /srv/gump/public/workspace/cvs/jdom]
---------------------------------------------
cvs [update aborted]: connect to cvs.jdom.org(65.212.180.182):2401 failed: Connection timed out
---------------------------------------------

To subscribe to this information via syndicated feeds:
- RSS: http://vmgump.apache.org/gump/public/jdom/rss.xml
- Atom: http://vmgump.apache.org/gump/public/jdom/atom.xml

============================== Gump Tracking Only ===
Produced by Gump version 2.3.
Gump Run 13000021092009, vmgump:vmgump-public:13000021092009
Gump E-mail Identifier (unique within run) #6.

*********************************************************** G U M P
[GUMP@vmgump]: Project jmock2 (in module jmock2) failed
To whom it may engage...
        
This is an automated request, but not an unsolicited one. For 
more information please visit http://gump.apache.org/nagged.html, 
and/or contact the folk at general@gump.apache.org.

Project jmock2 has an issue affecting its community integration.
This issue affects 1 projects,
 and has been outstanding for 58 runs.
The current state of this project is 'Failed', with reason 'Build Failed'.
For reference only, the following projects are affected by this:
    - jmock2 :  jMock is a library for testing Java code using mock objects.


Full details are available at:
    http://vmgump.apache.org/gump/public/jmock2/jmock2/index.html

That said, some information snippets are provided here.

The following annotations (debug/informational/warning/error messages) were provided:
 -INFO- Failed with reason build failed
 -INFO- Failed to extract fallback artifacts from Gump Repository



The following work was performed:
http://vmgump.apache.org/gump/public/jmock2/jmock2/gump_work/build_jmock2_jmock2.html
Work Name: build_jmock2_jmock2 (Type: Build)
Work ended in a state of : Failed
Elapsed: 5 secs
Command Line: /usr/lib/jvm/java-6-sun/bin/java -Djava.awt.headless=true -Xbootclasspath/p:/srv/gump/public/workspace/xml-xerces2/build/xercesImpl.jar:/srv/gump/public/workspace/xml-commons/java/external/build/xml-apis.jar org.apache.tools.ant.Main -Dgump.merge=/srv/gump/public/gump/work/merge.xml -Dbuild.sysclasspath=only -Dversion=21092009 
[Working Directory: /srv/gump/public/workspace/jmock2]
CLASSPATH: /usr/lib/jvm/java-6-sun/lib/tools.jar:/srv/gump/public/workspace/jmock2/build/classes:/srv/gump/public/workspace/jmock2/lib/objenesis-1.0.jar:/srv/gump/public/workspace/ant/dist/lib/ant-jmf.jar:/srv/gump/public/workspace/ant/dist/lib/ant-swing.jar:/srv/gump/public/workspace/ant/dist/lib/ant-apache-resolver.jar:/srv/gump/public/workspace/ant/dist/lib/ant-apache-xalan2.jar:/srv/gump/public/workspace/ant/dist/lib/ant-trax.jar:/srv/gump/public/workspace/ant/dist/lib/ant-junit.jar:/srv/gump/public/workspace/ant/dist/lib/ant-launcher.jar:/srv/gump/public/workspace/ant/dist/lib/ant-nodeps.jar:/srv/gump/public/workspace/ant/dist/lib/ant.jar:/srv/gump/packages/bsh-2.0b4/bsh-commands-2.0b4.jar:/srv/gump/packages/bsh-2.0b4/bsh-classpath-2.0b4.jar:/srv/gump/packages/bsh-2.0b4/bsh-core-2.0b4.jar:/srv/gump/packages/bsh-2.0b4/bsh-bsf-2.0b4.jar:/srv/gump/packages/bsh-2.0b4/bsh-2.0b4.jar:/srv/gump/packages/bsh-2.0b4/bsh-reflect-2.0b4.jar:/srv/gump/packages/bsh-2.0b4/bsh-util-2.0b4.
 jar:/srv/gump/packages/cglib/cglib-nodep-2.1_3.jar:/srv/gump/public/workspace/hamcrest/hamcrest-java/build/hamcrest-core-21092009.jar:/srv/gump/public/workspace/hamcrest/hamcrest-java/build/hamcrest-library-21092009.jar:/srv/gump/public/workspace/junit/dist/junit-21092009.jar:/srv/gump/packages/junit3.8.1/junit.jar:/srv/gump/public/workspace/xml-commons/java/external/build/xml-apis-ext.jar
---------------------------------------------
    [javac] location: class org.jmock.test.unit.lib.CurrentStateMatcherTest
    [javac]         assertTrue("should match", isNotCurrently("S").matches(stateMachine));
    [javac]         ^
    [javac] /srv/gump/public/workspace/jmock2/test/org/jmock/test/unit/lib/CurrentStateMatcherTest.java:38: cannot find symbol
    [javac] symbol  : method assertTrue(java.lang.String,boolean)
    [javac] location: class org.jmock.test.unit.lib.CurrentStateMatcherTest
    [javac]         assertTrue("should not match", !isCurrentlyS.matches(null));
    [javac]         ^
    [javac] /srv/gump/public/workspace/jmock2/test/org/jmock/test/unit/lib/CurrentStateMatcherTest.java:42: cannot find symbol
    [javac] symbol  : method assertTrue(java.lang.String,boolean)
    [javac] location: class org.jmock.test.unit.lib.CurrentStateMatcherTest
    [javac]         assertTrue("should not match", !isCurrentlyS.matches("something else"));
    [javac]         ^
    [javac] /srv/gump/public/workspace/jmock2/test/org/jmock/test/unit/lib/CurrentStateMatcherTest.java:46: cannot find symbol
    [javac] symbol  : method assertEquals(java.lang.String,java.lang.String)
    [javac] location: class org.jmock.test.unit.lib.CurrentStateMatcherTest
    [javac]         assertEquals("a state machine that is S", asString(isCurrently("S")));
    [javac]         ^
    [javac] /srv/gump/public/workspace/jmock2/test/org/jmock/test/unit/lib/CurrentStateMatcherTest.java:47: cannot find symbol
    [javac] symbol  : method assertEquals(java.lang.String,java.lang.String)
    [javac] location: class org.jmock.test.unit.lib.CurrentStateMatcherTest
    [javac]         assertEquals("a state machine that is not S", asString(isNotCurrently("S")));
    [javac]         ^
    [javac] /srv/gump/public/workspace/jmock2/test/org/jmock/test/unit/lib/CurrentStateMatcherTest.java:53: cannot find symbol
    [javac] symbol  : method assertMismatchDescription(java.lang.String,org.hamcrest.Matcher<org.jmock.States>,org.jmock.States)
    [javac] location: class org.jmock.test.unit.lib.CurrentStateMatcherTest
    [javac]         assertMismatchDescription("was not S", isCurrently("S"), stateMachine);
    [javac]         ^
    [javac] /srv/gump/public/workspace/jmock2/test/org/jmock/test/unit/lib/CurrentStateMatcherTest.java:56: method does not override or implement a method from a supertype
    [javac]     @Override
    [javac]     ^
    [javac] /srv/gump/public/workspace/jmock2/test/org/jmock/test/unit/support/SyntheticEmptyInterfaceClassLoader.java:35: cannot find symbol
    [javac] symbol  : variable COMPUTE_MAXS
    [javac] location: class net.sf.cglib.asm.ClassWriter
    [javac]         ClassWriter writer = new ClassWriter(ClassWriter.COMPUTE_MAXS);
    [javac]                                                         ^
    [javac] /srv/gump/public/workspace/jmock2/test/org/jmock/test/unit/support/SyntheticEmptyInterfaceClassLoader.java:35: internal error; cannot instantiate ClassWriter(boolean) at net.sf.cglib.asm.ClassWriter to ()
    [javac]         ClassWriter writer = new ClassWriter(ClassWriter.COMPUTE_MAXS);
    [javac]                              ^
    [javac] /srv/gump/public/workspace/jmock2/test/org/jmock/test/unit/support/SyntheticEmptyInterfaceClassLoader.java:36: visit(int,int,java.lang.String,java.lang.String,java.lang.String[],java.lang.String) in net.sf.cglib.asm.ClassWriter cannot be applied to (int,int,java.lang.String,<nulltype>,java.lang.String,<nulltype>)
    [javac]                 writer.visit(CLASS_FORMAT_VERSION,
    [javac]                       ^
    [javac] Note: /srv/gump/public/workspace/jmock2/src/org/jmock/integration/junit4/JMock.java uses or overrides a deprecated API.
    [javac] Note: Recompile with -Xlint:deprecation for details.
    [javac] 21 errors

BUILD FAILED
/srv/gump/public/workspace/jmock2/build.xml:61: Compile failed; see the compiler error output for details.

Total time: 4 seconds
---------------------------------------------

To subscribe to this information via syndicated feeds:
- RSS: http://vmgump.apache.org/gump/public/jmock2/jmock2/rss.xml
- Atom: http://vmgump.apache.org/gump/public/jmock2/jmock2/atom.xml

============================== Gump Tracking Only ===
Produced by Gump version 2.3.
Gump Run 13000021092009, vmgump:vmgump-public:13000021092009
Gump E-mail Identifier (unique within run) #9.

*********************************************************** G U M P
[GUMP@vmgump]: Project apr-iconv-configure (in module apr-iconv) failed
To whom it may engage...
        
This is an automated request, but not an unsolicited one. For 
more information please visit http://gump.apache.org/nagged.html, 
and/or contact the folk at general@gump.apache.org.

Project apr-iconv-configure has an issue affecting its community integration.
This issue affects 2 projects,
 and has been outstanding for 115 runs.
The current state of this project is 'Failed', with reason 'Build Failed'.
For reference only, the following projects are affected by this:
    - apr-iconv-configure :  Apache Portable Runtime
    - apr-iconv-make :  Apache Portable Runtime


Full details are available at:
    http://vmgump.apache.org/gump/public/apr-iconv/apr-iconv-configure/index.html

That said, some information snippets are provided here.

The following annotations (debug/informational/warning/error messages) were provided:
 -INFO- Failed with reason build failed



The following work was performed:
http://vmgump.apache.org/gump/public/apr-iconv/apr-iconv-configure/gump_work/buildscript_apr-iconv_apr-iconv-configure.html
Work Name: buildscript_apr-iconv_apr-iconv-configure (Type: Build)
Work ended in a state of : Failed
Elapsed: 1 sec
Command Line: /srv/gump/public/workspace/apr-iconv/configure --with-apr=/srv/gump/public/workspace/apr/dest-21092009 --prefix=/srv/gump/public/workspace/apr-iconv/dest-21092009 
[Working Directory: /srv/gump/public/workspace/apr-iconv]
---------------------------------------------
checking for gawk... no
checking for mawk... mawk
checking for a BSD-compatible install... /usr/bin/install -c
checking for APR... configure: error: the --with-apr parameter is incorrect. It must specify an install prefix, a build directory, or an apr-config file.
---------------------------------------------

To subscribe to this information via syndicated feeds:
- RSS: http://vmgump.apache.org/gump/public/apr-iconv/apr-iconv-configure/rss.xml
- Atom: http://vmgump.apache.org/gump/public/apr-iconv/apr-iconv-configure/atom.xml

============================== Gump Tracking Only ===
Produced by Gump version 2.3.
Gump Run 13000021092009, vmgump:vmgump-public:13000021092009
Gump E-mail Identifier (unique within run) #11.

*********************************************************** G U M P
[GUMP@vmgump]: Project derby (in module db-derby) failed
To whom it may engage...
        
This is an automated request, but not an unsolicited one. For 
more information please visit http://gump.apache.org/nagged.html, 
and/or contact the folk at general@gump.apache.org.

Project derby has an issue affecting its community integration.
This issue affects 1 projects,
 and has been outstanding for 25 runs.
The current state of this project is 'Failed', with reason 'Build Failed'.
For reference only, the following projects are affected by this:
    - derby :  Apache Derby, 100% Java relational database.


Full details are available at:
    http://vmgump.apache.org/gump/public/db-derby/derby/index.html

That said, some information snippets are provided here.

The following annotations (debug/informational/warning/error messages) were provided:
 -INFO- Failed with reason build failed
 -INFO- Failed to extract fallback artifacts from Gump Repository



The following work was performed:
http://vmgump.apache.org/gump/public/db-derby/derby/gump_work/build_db-derby_derby.html
Work Name: build_db-derby_derby (Type: Build)
Work ended in a state of : Failed
Elapsed: 39 secs
Command Line: /usr/lib/jvm/java-6-sun/bin/java -Djava.awt.headless=true -Xbootclasspath/p:/srv/gump/public/workspace/xml-commons/java/external/build/xml-apis.jar:/srv/gump/public/workspace/xml-xerces2/build/xercesImpl.jar:/srv/gump/public/workspace/xml-xalan/build/serializer.jar:/srv/gump/public/workspace/xml-xalan/build/xalan-unbundled.jar org.apache.tools.ant.Main -Dgump.merge=/srv/gump/public/gump/work/merge.xml -Dbuild.sysclasspath=only -Dsane=false gump_all 
[Working Directory: /srv/gump/public/workspace/db-derby]
CLASSPATH: /usr/lib/jvm/java-6-sun/lib/tools.jar:/srv/gump/public/workspace/db-derby/classes:/srv/gump/public/workspace/ant/dist/lib/ant-jmf.jar:/srv/gump/public/workspace/ant/dist/lib/ant-swing.jar:/srv/gump/public/workspace/ant/dist/lib/ant-apache-resolver.jar:/srv/gump/public/workspace/ant/dist/lib/ant-apache-xalan2.jar:/srv/gump/public/workspace/ant/dist/lib/ant-trax.jar:/srv/gump/public/workspace/ant/dist/lib/ant-junit.jar:/srv/gump/public/workspace/ant/dist/lib/ant-launcher.jar:/srv/gump/public/workspace/ant/dist/lib/ant-nodeps.jar:/srv/gump/public/workspace/ant/dist/lib/ant.jar:/srv/gump/public/workspace/xml-commons/java/external/build/xml-apis-ext.jar:/srv/gump/public/workspace/jakarta-servletapi-5/jsr154/dist/lib/servlet-api.jar:/srv/gump/public/workspace/jakarta-oro/jakarta-oro-21092009.jar:/srv/gump/packages/javacc-3.1/bin/lib/javacc.jar:/srv/gump/public/workspace/junit/dist/junit-21092009.jar
---------------------------------------------
engine_169:

compile_reference:
    [javac] Compiling 11 source files to /srv/gump/public/workspace/db-derby/classes
    [javac] Compiling 2 source files to /srv/gump/public/workspace/db-derby/classes

compile_authentication:
    [javac] Compiling 2 source files to /srv/gump/public/workspace/db-derby/classes

authentication:

compile_security:
    [javac] Compiling 2 source files to /srv/gump/public/workspace/db-derby/classes

security:

compile_mbeans:
    [javac] Compiling 4 source files to /srv/gump/public/workspace/db-derby/classes

compile_io:

storage:

compile_iapi_error_jsr169:

compile_reference:
    [javac] Compiling 2 source files to /srv/gump/public/workspace/db-derby/classes

compile_util:

compile_types:
    [javac] Compiling 1 source file to /srv/gump/public/workspace/db-derby/classes
    [javac] /srv/gump/public/workspace/db-derby/java/engine/org/apache/derby/impl/jdbc/EmbedStatement.java:60: org.apache.derby.impl.jdbc.EmbedStatement is not abstract and does not override abstract method isWrapperFor(java.lang.Class) in java.sql.Wrapper
    [javac] public class EmbedStatement extends ConnectionChild
    [javac]        ^
    [javac] /srv/gump/public/workspace/db-derby/java/engine/org/apache/derby/impl/jdbc/EmbedResultSetMetaData.java:59: org.apache.derby.impl.jdbc.EmbedResultSetMetaData is not abstract and does not override abstract method isWrapperFor(java.lang.Class) in java.sql.Wrapper
    [javac] public class EmbedResultSetMetaData
    [javac]        ^
    [javac] /srv/gump/public/workspace/db-derby/java/engine/org/apache/derby/impl/jdbc/EmbedDatabaseMetaData.java:88: org.apache.derby.impl.jdbc.EmbedDatabaseMetaData is not abstract and does not override abstract method autoCommitFailureClosesAllResultSets() in java.sql.DatabaseMetaData
    [javac] public class EmbedDatabaseMetaData extends ConnectionChild 
    [javac]        ^
    [javac] 3 errors

BUILD FAILED
/srv/gump/public/workspace/db-derby/build.xml:452: The following error occurred while executing this line:
/srv/gump/public/workspace/db-derby/java/engine/build.xml:79: The following error occurred while executing this line:
/srv/gump/public/workspace/db-derby/java/engine/org/apache/derby/iapi/build.xml:65: The following error occurred while executing this line:
/srv/gump/public/workspace/db-derby/java/engine/org/apache/derby/iapi/types/build.xml:53: Compile failed; see the compiler error output for details.

Total time: 38 seconds
---------------------------------------------

To subscribe to this information via syndicated feeds:
- RSS: http://vmgump.apache.org/gump/public/db-derby/derby/rss.xml
- Atom: http://vmgump.apache.org/gump/public/db-derby/derby/atom.xml

============================== Gump Tracking Only ===
Produced by Gump version 2.3.
Gump Run 13000021092009, vmgump:vmgump-public:13000021092009
Gump E-mail Identifier (unique within run) #12.

*********************************************************** G U M P
[GUMP@vmgump]: Project dotnet-antlib-test (in module ant-antlibs) failed
To whom it may engage...
        
This is an automated request, but not an unsolicited one. For 
more information please visit http://gump.apache.org/nagged.html, 
and/or contact the folk at general@gump.apache.org.

Project dotnet-antlib-test has an issue affecting its community integration.
This issue affects 1 projects,
 and has been outstanding for 58 runs.
The current state of this project is 'Failed', with reason 'Build Failed'.
For reference only, the following projects are affected by this:
    - dotnet-antlib-test :  Task and Type Libraries for Apache Ant


Full details are available at:
    http://vmgump.apache.org/gump/public/ant-antlibs/dotnet-antlib-test/index.html

That said, some information snippets are provided here.

The following annotations (debug/informational/warning/error messages) were provided:
 -INFO- Failed with reason build failed



The following work was performed:
http://vmgump.apache.org/gump/public/ant-antlibs/dotnet-antlib-test/gump_work/build_ant-antlibs_dotnet-antlib-test.html
Work Name: build_ant-antlibs_dotnet-antlib-test (Type: Build)
Work ended in a state of : Failed
Elapsed: 10 secs
Command Line: /usr/lib/jvm/java-6-sun/bin/java -Djava.awt.headless=true -Xbootclasspath/p:/srv/gump/public/workspace/xml-xerces2/build/xercesImpl.jar:/srv/gump/public/workspace/xml-commons/java/external/build/xml-apis.jar org.apache.tools.ant.Main -Dgump.merge=/srv/gump/public/gump/work/merge.xml -Dbuild.sysclasspath=only -Dant-testutil.jar=/srv/gump/public/workspace/ant/build/lib/ant-testutil.jar test 
[Working Directory: /srv/gump/public/workspace/ant-antlibs/dotnet]
CLASSPATH: /usr/lib/jvm/java-6-sun/lib/tools.jar:/srv/gump/public/workspace/ant-antlibs/dotnet/build/test-classes:/srv/gump/public/workspace/ant/dist/lib/ant-jmf.jar:/srv/gump/public/workspace/ant/dist/lib/ant-swing.jar:/srv/gump/public/workspace/ant/dist/lib/ant-apache-resolver.jar:/srv/gump/public/workspace/ant/dist/lib/ant-apache-xalan2.jar:/srv/gump/public/workspace/ant/dist/lib/ant-trax.jar:/srv/gump/public/workspace/ant/dist/lib/ant-junit.jar:/srv/gump/public/workspace/ant/dist/lib/ant-launcher.jar:/srv/gump/public/workspace/ant/dist/lib/ant-nodeps.jar:/srv/gump/public/workspace/ant/dist/lib/ant.jar:/srv/gump/public/workspace/ant-antlibs/antunit/build/ant-antunit-21092009.jar:/srv/gump/public/workspace/ant-antlibs/dotnet/build/ant-dotnet-21092009.jar:/srv/gump/public/workspace/xml-commons/java/external/build/xml-apis-ext.jar
---------------------------------------------
[au:antunit] 	at line 96, column 37
[au:antunit] 	Message: Needed .net apps are missing
[au:antunit] 	took 0.006 sec
[au:antunit] Target: testBothSrc  caused an ERROR
[au:antunit] 	at line 96, column 37
[au:antunit] 	Message: Needed .net apps are missing
[au:antunit] 	took 0.014 sec
[au:antunit] Target: testSchemaFileMustHaveOneOptionOnly  caused an ERROR
[au:antunit] 	at line 96, column 37
[au:antunit] 	Message: Needed .net apps are missing
[au:antunit] 	took 0.01 sec
[au:antunit] Target: testLocalWsdl  caused an ERROR
[au:antunit] 	at line 96, column 37
[au:antunit] 	Message: Needed .net apps are missing
[au:antunit] 	took 0.013 sec
[au:antunit] Target: testSrcIsDir  caused an ERROR
[au:antunit] 	at line 96, column 37
[au:antunit] 	Message: Needed .net apps are missing
[au:antunit] 	took 0.003 sec
[au:antunit] Target: testLocalWsdlServerVB  caused an ERROR
[au:antunit] 	at line 96, column 37
[au:antunit] 	Message: Needed .net apps are missing
[au:antunit] 	took 0.004 sec
[au:antunit] Target: testLocalWsdlServer  caused an ERROR
[au:antunit] 	at line 96, column 37
[au:antunit] 	Message: Needed .net apps are missing
[au:antunit] 	took 0.008 sec
[au:antunit] Target: testNoSrc  caused an ERROR
[au:antunit] 	at line 96, column 37
[au:antunit] 	Message: Needed .net apps are missing
[au:antunit] 	took 0.008 sec
[au:antunit] Target: testSchemaFileMustExist  caused an ERROR
[au:antunit] 	at line 96, column 37
[au:antunit] 	Message: Needed .net apps are missing
[au:antunit] 	took 0.011 sec
[au:antunit] Target: testInvalidExtraOpsVB  caused an ERROR
[au:antunit] 	at line 96, column 37
[au:antunit] 	Message: Needed .net apps are missing
[au:antunit] 	took 0.012 sec
[au:antunit] Target: testDestIsDir  caused an ERROR
[au:antunit] 	at line 96, column 37
[au:antunit] 	Message: Needed .net apps are missing
[au:antunit] 	took 0.005 sec

test:

BUILD FAILED
/srv/gump/public/workspace/ant-antlibs/dotnet/common/build.xml:223: At least one AntUnit test has failed.

Total time: 10 seconds
---------------------------------------------

To subscribe to this information via syndicated feeds:
- RSS: http://vmgump.apache.org/gump/public/ant-antlibs/dotnet-antlib-test/rss.xml
- Atom: http://vmgump.apache.org/gump/public/ant-antlibs/dotnet-antlib-test/atom.xml

============================== Gump Tracking Only ===
Produced by Gump version 2.3.
Gump Run 13000021092009, vmgump:vmgump-public:13000021092009
Gump E-mail Identifier (unique within run) #13.

*********************************************************** G U M P
[GUMP@vmgump]: Project emma (in module emma) failed
To whom it may engage...
        
This is an automated request, but not an unsolicited one. For 
more information please visit http://gump.apache.org/nagged.html, 
and/or contact the folk at general@gump.apache.org.

Project emma has an issue affecting its community integration.
This issue affects 1 projects,
 and has been outstanding for 492 runs.
The current state of this project is 'Failed', with reason 'Build Failed'.
For reference only, the following projects are affected by this:
    - emma :  code coverage tool


Full details are available at:
    http://vmgump.apache.org/gump/public/emma/emma/index.html

That said, some information snippets are provided here.

The following annotations (debug/informational/warning/error messages) were provided:
 -INFO- Failed with reason build failed
 -INFO- Failed to extract fallback artifacts from Gump Repository



The following work was performed:
http://vmgump.apache.org/gump/public/emma/emma/gump_work/build_emma_emma.html
Work Name: build_emma_emma (Type: Build)
Work ended in a state of : Failed
Elapsed: 6 secs
Command Line: /usr/lib/jvm/java-6-sun/bin/java -Djava.awt.headless=true -Xbootclasspath/p:/srv/gump/public/workspace/xml-commons/java/external/build/xml-apis.jar:/srv/gump/public/workspace/xml-xerces2/build/xercesImpl.jar org.apache.tools.ant.Main -Dgump.merge=/srv/gump/public/gump/work/merge.xml -Dbuild.sysclasspath=only -Dapp.short.name=emma-21092009 
[Working Directory: /srv/gump/public/workspace/emma]
CLASSPATH: /usr/lib/jvm/java-6-sun/lib/tools.jar:/srv/gump/public/workspace/emma/out/core/classes:/srv/gump/public/workspace/emma/out/ant/classes:/srv/gump/public/workspace/emma/lib/internal/stamptool.jar:/srv/gump/public/workspace/ant/dist/lib/ant-jmf.jar:/srv/gump/public/workspace/ant/dist/lib/ant-swing.jar:/srv/gump/public/workspace/ant/dist/lib/ant-apache-resolver.jar:/srv/gump/public/workspace/ant/dist/lib/ant-apache-xalan2.jar:/srv/gump/public/workspace/ant/dist/lib/ant-trax.jar:/srv/gump/public/workspace/ant/dist/lib/ant-junit.jar:/srv/gump/public/workspace/ant/dist/lib/ant-launcher.jar:/srv/gump/public/workspace/ant/dist/lib/ant-nodeps.jar:/srv/gump/public/workspace/ant/dist/lib/ant.jar:/srv/gump/public/workspace/xml-commons/java/external/build/xml-apis-ext.jar
---------------------------------------------
timestamp:

-pre-compile:

core.bootstrap.compile:
    [javac] Compiling 2 source files to /srv/gump/public/workspace/emma/out/core/classes
    [javac] 
    [javac]           WARNING
    [javac] 
    [javac] The -source switch defaults to 1.5 in JDK 1.5 and 1.6.
    [javac] If you specify -target 1.2 you now must also specify -source 1.2.
    [javac] Ant will implicitly add -source 1.2 for you.  Please change your build file.

core.java14.compile:
    [javac] Compiling 1 source file to /srv/gump/public/workspace/emma/out/core/classes
    [javac] 
    [javac]           WARNING
    [javac] 
    [javac] The -source switch defaults to 1.5 in JDK 1.5 and 1.6.
    [javac] If you specify -target 1.2 you now must also specify -source 1.2.
    [javac] Ant will implicitly add -source 1.2 for you.  Please change your build file.

core.java13.compile:
    [javac] Compiling 1 source file to /srv/gump/public/workspace/emma/out/core/classes
    [javac] 
    [javac]           WARNING
    [javac] 
    [javac] The -source switch defaults to 1.5 in JDK 1.5 and 1.6.
    [javac] If you specify -target 1.2 you now must also specify -source 1.2.
    [javac] Ant will implicitly add -source 1.2 for you.  Please change your build file.

core.compile:
    [javac] Compiling 175 source files to /srv/gump/public/workspace/emma/out/core/classes
    [javac] 
    [javac]           WARNING
    [javac] 
    [javac] The -source switch defaults to 1.5 in JDK 1.5 and 1.6.
    [javac] If you specify -target 1.2 you now must also specify -source 1.2.
    [javac] Ant will implicitly add -source 1.2 for you.  Please change your build file.
    [javac] /srv/gump/public/workspace/emma/core/java12/com/vladium/emma/run/InstrClassLoader.java:346: reference to CodeSource is ambiguous, both method CodeSource(java.net.URL,java.security.cert.Certificate[]) in java.security.CodeSource and method CodeSource(java.net.URL,java.security.CodeSigner[]) in java.security.CodeSource match
    [javac]         final CodeSource csrc = new CodeSource (srcURL, null);
    [javac]                                 ^
    [javac] Note: Some input files use or override a deprecated API.
    [javac] Note: Recompile with -Xlint:deprecation for details.
    [javac] 1 error

BUILD FAILED
/srv/gump/public/workspace/emma/build.xml:297: Compile failed; see the compiler error output for details.

Total time: 5 seconds
---------------------------------------------

To subscribe to this information via syndicated feeds:
- RSS: http://vmgump.apache.org/gump/public/emma/emma/rss.xml
- Atom: http://vmgump.apache.org/gump/public/emma/emma/atom.xml

============================== Gump Tracking Only ===
Produced by Gump version 2.3.
Gump Run 13000021092009, vmgump:vmgump-public:13000021092009
Gump E-mail Identifier (unique within run) #15.

*********************************************************** G U M P
[GUMP@vmgump]: Project logging-log4cxx-configure (in module logging-log4cxx) failed
To whom it may engage...
        
This is an automated request, but not an unsolicited one. For 
more information please visit http://gump.apache.org/nagged.html, 
and/or contact the folk at general@gump.apache.org.

Project logging-log4cxx-configure has an issue affecting its community integration.
This issue affects 3 projects,
 and has been outstanding for 115 runs.
The current state of this project is 'Failed', with reason 'Build Failed'.
For reference only, the following projects are affected by this:
    - logging-log4cxx-configure :  Apache log4cxx
    - logging-log4cxx-make :  Apache log4cxx
    - logging-log4cxx-make-install :  Apache log4cxx


Full details are available at:
    http://vmgump.apache.org/gump/public/logging-log4cxx/logging-log4cxx-configure/index.html

That said, some information snippets are provided here.

The following annotations (debug/informational/warning/error messages) were provided:
 -DEBUG- Dependency on apr-make-install exists, no need to add for property --with-apr.
 -DEBUG- Dependency on apr-util-make-install exists, no need to add for property --with-apr-util.
 -INFO- Failed with reason build failed



The following work was performed:
http://vmgump.apache.org/gump/public/logging-log4cxx/logging-log4cxx-configure/gump_work/buildscript_logging-log4cxx_logging-log4cxx-configure.html
Work Name: buildscript_logging-log4cxx_logging-log4cxx-configure (Type: Build)
Work ended in a state of : Failed
Elapsed: 26 secs
Command Line: /srv/gump/public/workspace/logging-log4cxx/configure --with-apr-util=/srv/gump/public/workspace/apr-util --with-apr=/srv/gump/public/workspace/apr --prefix=/srv/gump/public/workspace/logging-log4cxx/dest-21092009 
[Working Directory: /srv/gump/public/workspace/logging-log4cxx]
---------------------------------------------
checking for f95... no
checking for fort... no
checking for ifort... no
checking for ifc... no
checking for efc... no
checking for pgf95... no
checking for lf95... no
checking for ftn... no
checking whether we are using the GNU Fortran 77 compiler... no
checking whether  accepts -g... no
checking the maximum length of command line arguments... 98304
checking command to parse /usr/bin/nm -B output from ccache gcc object... ok
checking for objdir... .libs
checking for ar... ar
checking for ranlib... ranlib
checking for strip... strip
checking if ccache gcc supports -fno-rtti -fno-exceptions... no
checking for ccache gcc option to produce PIC... -fPIC
checking if ccache gcc PIC flag -fPIC works... yes
checking if ccache gcc static flag -static works... yes
checking if ccache gcc supports -c -o file.o... yes
checking whether the ccache gcc linker (/usr/bin/ld) supports shared libraries... yes
checking whether -lc should be explicitly linked in... no
checking dynamic linker characteristics... GNU/Linux ld.so
checking how to hardcode library paths into programs... immediate
checking whether stripping libraries is possible... yes
checking if libtool supports shared libraries... yes
checking whether to build shared libraries... yes
checking whether to build static libraries... yes
configure: creating libtool
appending configuration tag "CXX" to libtool
checking for ld used by ccache g++... /usr/bin/ld
checking if the linker (/usr/bin/ld) is GNU ld... yes
checking whether the ccache g++ linker (/usr/bin/ld) supports shared libraries... yes
checking for ccache g++ option to produce PIC... -fPIC
checking if ccache g++ PIC flag -fPIC works... yes
checking if ccache g++ static flag -static works... yes
checking if ccache g++ supports -c -o file.o... yes
checking whether the ccache g++ linker (/usr/bin/ld) supports shared libraries... yes
checking dynamic linker characteristics... GNU/Linux ld.so
(cached) (cached) checking how to hardcode library paths into programs... immediate
appending configuration tag "F77" to libtool
checking for a BSD-compatible install... /usr/bin/install -c
checking whether make sets $(MAKE)... (cached) yes
checking whether we are using the GNU C++ compiler... (cached) yes
checking whether ccache g++ accepts -g... (cached) yes
checking dependency style of ccache g++... (cached) gcc3
checking how to run the C++ preprocessor... ccache g++ -E
checking for doxygen... no
checking for APR... configure: error: the --with-apr parameter is incorrect. It must specify an install prefix, a build directory, or an apr-config file.
---------------------------------------------

To subscribe to this information via syndicated feeds:
- RSS: http://vmgump.apache.org/gump/public/logging-log4cxx/logging-log4cxx-configure/rss.xml
- Atom: http://vmgump.apache.org/gump/public/logging-log4cxx/logging-log4cxx-configure/atom.xml

============================== Gump Tracking Only ===
Produced by Gump version 2.3.
Gump Run 13000021092009, vmgump:vmgump-public:13000021092009
Gump E-mail Identifier (unique within run) #16.

*********************************************************** G U M P
[GUMP@vmgump]: Project jython (in module jython) failed
To whom it may engage...
        
This is an automated request, but not an unsolicited one. For 
more information please visit http://gump.apache.org/nagged.html, 
and/or contact the folk at general@gump.apache.org.

Project jython has an issue affecting its community integration.
This issue affects 2 projects,
 and has been outstanding for 121 runs.
The current state of this project is 'Failed', with reason 'Build Failed'.
For reference only, the following projects are affected by this:
    - antbook-sections :  Examples to go with Java Development with Ant
    - jython :  Java Python


Full details are available at:
    http://vmgump.apache.org/gump/public/jython/jython/index.html

That said, some information snippets are provided here.

The following annotations (debug/informational/warning/error messages) were provided:
 -DEBUG- Sole output [jython.jar] identifier set to project name
 -INFO- Failed with reason build failed
 -INFO- Failed to extract fallback artifacts from Gump Repository



The following work was performed:
http://vmgump.apache.org/gump/public/jython/jython/gump_work/build_jython_jython.html
Work Name: build_jython_jython (Type: Build)
Work ended in a state of : Failed
Elapsed: 36 secs
Command Line: /usr/lib/jvm/java-6-sun/bin/java -Djava.awt.headless=true -Xbootclasspath/p:/srv/gump/public/workspace/xml-commons/java/external/build/xml-apis.jar:/srv/gump/public/workspace/xml-xerces2/build/xercesImpl.jar org.apache.tools.ant.Main -Dgump.merge=/srv/gump/public/gump/work/merge.xml -Dbuild.sysclasspath=only -DdistDir=dist -DoutputDir=build jar 
[Working Directory: /srv/gump/public/workspace/jython]
CLASSPATH: /usr/lib/jvm/java-6-sun/lib/tools.jar:/srv/gump/public/workspace/jython/build/classes:/srv/gump/public/workspace/jython/extlibs/constantine-0.4.jar:/srv/gump/public/workspace/jython/extlibs/jna.jar:/srv/gump/public/workspace/jython/extlibs/jna-posix.jar:/srv/gump/public/workspace/jython/extlibs/libreadline-java-0.8.jar:/srv/gump/public/workspace/ant/dist/lib/ant-jmf.jar:/srv/gump/public/workspace/ant/dist/lib/ant-swing.jar:/srv/gump/public/workspace/ant/dist/lib/ant-apache-resolver.jar:/srv/gump/public/workspace/ant/dist/lib/ant-apache-xalan2.jar:/srv/gump/public/workspace/ant/dist/lib/ant-trax.jar:/srv/gump/public/workspace/ant/dist/lib/ant-junit.jar:/srv/gump/public/workspace/ant/dist/lib/ant-launcher.jar:/srv/gump/public/workspace/ant/dist/lib/ant-nodeps.jar:/srv/gump/public/workspace/ant/dist/lib/ant.jar:/srv/gump/packages/junit3.8.1/junit.jar:/srv/gump/public/workspace/xml-commons/java/build/resolver.jar:/srv/gump/packages/antlr/antlr-3.1.3.jar:/srv/gump/publi
 c/workspace/asm/output/dist/lib/asm-analysis-21092009.jar:/srv/gump/public/workspace/asm/output/dist/lib/asm-util-21092009.jar:/srv/gump/public/workspace/asm/output/dist/lib/asm-xml-21092009.jar:/srv/gump/public/workspace/asm/output/dist/lib/asm-commons-21092009.jar:/srv/gump/public/workspace/asm/output/dist/lib/asm-21092009.jar:/srv/gump/public/workspace/asm/output/dist/lib/asm-tree-21092009.jar:/srv/gump/public/workspace/jakarta-servletapi-5/jsr154/dist/lib/servlet-api.jar:/srv/gump/public/workspace/jline/target/jline-0.9.95-SNAPSHOT.jar:/srv/gump/public/workspace/xml-commons/java/external/build/xml-apis-ext.jar
---------------------------------------------
    [javac] 1 warning
    [javac] Compiling 75 source files to /srv/gump/public/workspace/jython/build/classes
    [javac] warning: [path] bad path element "/srv/gump/public/workspace/asm/output/dist/lib/asm-attrs-21092009.jar": no such file or directory
    [javac] Note: /srv/gump/public/workspace/jython/tests/java/javatests/PySetInJavaTest.java uses unchecked or unsafe operations.
    [javac] Note: Recompile with -Xlint:unchecked for details.
    [javac] 1 warning
    [javac] Compiling 1 source file to /srv/gump/public/workspace/jython/tests/data/initializer
    [javac] warning: [path] bad path element "/srv/gump/public/workspace/asm/output/dist/lib/asm-attrs-21092009.jar": no such file or directory
    [javac] 1 warning
     [copy] Copying 1 file to /srv/gump/public/workspace/jython/build/classes/org/python/modules
     [copy] Copying 2 files to /srv/gump/public/workspace/jython/build/classes
     [copy] Copying 1 file to /srv/gump/public/workspace/jython/build/classes/META-INF/services

expose:
   [expose] Exposing 160 classes

BUILD FAILED
/srv/gump/public/workspace/jython/build.xml:559: java.lang.RuntimeException: java.lang.ClassNotFoundException: org.python.core.PyObject
	at org.objectweb.asm.ClassWriter.getCommonSuperClass(Unknown Source)
	at org.objectweb.asm.ClassWriter.a(Unknown Source)
	at org.objectweb.asm.Frame.a(Unknown Source)
	at org.objectweb.asm.Frame.a(Unknown Source)
	at org.objectweb.asm.MethodWriter.visitMaxs(Unknown Source)
	at org.python.expose.generate.Exposer.endMethod(Exposer.java:213)
	at org.python.expose.generate.DescriptorExposer.generateMethodGetter(DescriptorExposer.java:145)
	at org.python.expose.generate.DescriptorExposer.generate(DescriptorExposer.java:108)
	at org.python.expose.generate.Exposer.generate(Exposer.java:107)
	at org.python.expose.generate.ExposeTask.generate(ExposeTask.java:71)
	at org.python.expose.generate.ExposeTask.expose(ExposeTask.java:59)
	at org.python.expose.generate.ExposeTask.process(ExposeTask.java:39)
	at org.python.util.GlobMatchingTask.execute(GlobMatchingTask.java:70)
	at org.apache.tools.ant.UnknownElement.execute(UnknownElement.java:291)
	at sun.reflect.NativeMethodAccessorImpl.invoke0(Native Method)
	at sun.reflect.NativeMethodAccessorImpl.invoke(NativeMethodAccessorImpl.java:39)
	at sun.reflect.DelegatingMethodAccessorImpl.invoke(DelegatingMethodAccessorImpl.java:25)
	at java.lang.reflect.Method.invoke(Method.java:597)
	at org.apache.tools.ant.dispatch.DispatchUtils.execute(DispatchUtils.java:106)
	at org.apache.tools.ant.Task.perform(Task.java:348)
	at org.apache.tools.ant.Target.execute(Target.java:390)
	at org.apache.tools.ant.Target.performTasks(Target.java:411)
	at org.apache.tools.ant.Project.executeSortedTargets(Project.java:1360)
	at org.apache.tools.ant.Project.executeTarget(Project.java:1329)
	at org.apache.tools.ant.helper.DefaultExecutor.executeTargets(DefaultExecutor.java:41)
	at org.apache.tools.ant.Project.executeTargets(Project.java:1212)
	at org.apache.tools.ant.Main.runBuild(Main.java:775)
	at org.apache.tools.ant.Main.startAnt(Main.java:217)
	at org.apache.tools.ant.Main.start(Main.java:179)
	at org.apache.tools.ant.Main.main(Main.java:268)

Total time: 35 seconds
---------------------------------------------

To subscribe to this information via syndicated feeds:
- RSS: http://vmgump.apache.org/gump/public/jython/jython/rss.xml
- Atom: http://vmgump.apache.org/gump/public/jython/jython/atom.xml

============================== Gump Tracking Only ===
Produced by Gump version 2.3.
Gump Run 13000021092009, vmgump:vmgump-public:13000021092009
Gump E-mail Identifier (unique within run) #17.

*********************************************************** G U M P
[GUMP@vmgump]: Project authx-script-test (in module authx) failed
To whom it may engage...
        
This is an automated request, but not an unsolicited one. For 
more information please visit http://gump.apache.org/nagged.html, 
and/or contact the folk at general@gump.apache.org.

Project authx-script-test has an issue affecting its community integration.
This issue affects 1 projects,
 and has been outstanding for 13 runs.
The current state of this project is 'Failed', with reason 'Build Failed'.
For reference only, the following projects are affected by this:
    - authx-script-test :  Apache Authentication and Authorization Framework


Full details are available at:
    http://vmgump.apache.org/gump/public/authx/authx-script-test/index.html

That said, some information snippets are provided here.

The following annotations (debug/informational/warning/error messages) were provided:
 -DEBUG- Dependency on xml-xerces exists, no need to add for property maven.jar.xercesImpl.
 -DEBUG- Dependency on asm exists, no need to add for property maven.jar.asm-util.
 -DEBUG- Dependency on packaged-jmock exists, no need to add for property maven.jar.jmock.
 -WARNING- Overriding Maven properties: [/srv/gump/public/workspace/authx/script/build.properties]
 -DEBUG- (Gump generated) Maven Properties in: /srv/gump/public/workspace/authx/script/build.properties
 -INFO- Failed with reason build failed
 -DEBUG- Maven POM in: /srv/gump/public/workspace/authx/script/project.xml
 -DEBUG- Maven project properties in: /srv/gump/public/workspace/authx/script/project.properties
 -INFO- Project Reports in: /srv/gump/public/workspace/authx/script/target/test-reports



The following work was performed:
http://vmgump.apache.org/gump/public/authx/authx-script-test/gump_work/build_authx_authx-script-test.html
Work Name: build_authx_authx-script-test (Type: Build)
Work ended in a state of : Failed
Elapsed: 5 secs
Command Line: maven --offline test 
[Working Directory: /srv/gump/public/workspace/authx/script]
CLASSPATH: /usr/lib/jvm/java-6-sun/lib/tools.jar:/srv/gump/public/workspace/asm/output/dist/lib/asm-util-21092009.jar:/srv/gump/public/workspace/authx/core/target/authx-core-21092009.jar:/srv/gump/public/workspace/dom4j/build/dom4j.jar:/srv/gump/packages/groovy-1.0-jsr-03/groovy-1.0-jsr-03.jar:/srv/gump/packages/jmock/jmock-1.0.1.jar:/srv/gump/packages/picocontainer-1.1/picocontainer-1.1.jar:/srv/gump/public/workspace/xml-commons/java/external/build/xml-apis-ext.jar:/srv/gump/public/workspace/authx/script/target/authx-script-21092009.jar
---------------------------------------------
java:prepare-filesystem:

java:compile:
    [echo] Compiling to /srv/gump/public/workspace/authx/script/target/classes

java:jar-resources:

test:prepare-filesystem:

test:test-resources:
Copying 4 files to /srv/gump/public/workspace/authx/script/target/test-classes

test:compile:
    [javac] Compiling 17 source files to /srv/gump/public/workspace/authx/script/target/test-classes

test:test:
    [junit] Running org.apache.authx.script.groovy.GroovyRuleLoaderTest
    [junit] Tests run: 1, Failures: 0, Errors: 1, Time elapsed: 0.081 sec
    [junit] [ERROR] TEST org.apache.authx.script.groovy.GroovyRuleLoaderTest FAILED
    [junit] Running org.apache.authx.script.groovy.GroovyScriptClassLoaderTest
    [junit] Tests run: 2, Failures: 0, Errors: 2, Time elapsed: 0.044 sec
    [junit] [ERROR] TEST org.apache.authx.script.groovy.GroovyScriptClassLoaderTest FAILED
    [junit] Running org.apache.authx.script.xml.Dom4JGroupBuilderTest
    [junit] Tests run: 4, Failures: 0, Errors: 0, Time elapsed: 0.149 sec
    [junit] Running org.apache.authx.script.xml.Dom4JRealmBuilderTest
    [junit] Tests run: 2, Failures: 0, Errors: 0, Time elapsed: 0.134 sec
    [junit] Running org.apache.authx.script.xml.Dom4JRuleSetBuilderTest
    [junit] Tests run: 10, Failures: 0, Errors: 0, Time elapsed: 0.134 sec
    [junit] Running org.apache.authx.script.xml.Dom4JRoleBuilderTest
    [junit] Tests run: 3, Failures: 0, Errors: 0, Time elapsed: 0.171 sec
    [junit] Running org.apache.authx.script.common.PicoContainerFactoryTest
    [junit] Tests run: 2, Failures: 0, Errors: 0, Time elapsed: 0.071 sec
    [junit] Running org.apache.authx.script.common.DynamicRuleProxyTest
    [junit] Tests run: 1, Failures: 0, Errors: 1, Time elapsed: 0.043 sec
    [junit] [ERROR] TEST org.apache.authx.script.common.DynamicRuleProxyTest FAILED
    [junit] Running org.apache.authx.script.common.ScriptedRuleSetBuilderTest
    [junit] Tests run: 1, Failures: 0, Errors: 0, Time elapsed: 0.186 sec
    [junit] Running org.apache.authx.script.common.SmartCachingScriptClassLoaderTest
    [junit] Tests run: 2, Failures: 0, Errors: 2, Time elapsed: 0.036 sec
    [junit] [ERROR] TEST org.apache.authx.script.common.SmartCachingScriptClassLoaderTest FAILED

BUILD FAILED
File...... /home/gump/.maven/cache/maven-test-plugin-1.6.2/plugin.jelly
Element... fail
Line...... 181
Column.... 54
There were test failures.
Total time: 5 seconds
Finished at: Mon Sep 21 03:15:11 PDT 2009

---------------------------------------------

To subscribe to this information via syndicated feeds:
- RSS: http://vmgump.apache.org/gump/public/authx/authx-script-test/rss.xml
- Atom: http://vmgump.apache.org/gump/public/authx/authx-script-test/atom.xml

============================== Gump Tracking Only ===
Produced by Gump version 2.3.
Gump Run 13000021092009, vmgump:vmgump-public:13000021092009
Gump E-mail Identifier (unique within run) #19.

*********************************************************** G U M P
[GUMP@vmgump]: Project jtidy-cvs (in module jtidy) failed
To whom it may engage...
        
This is an automated request, but not an unsolicited one. For 
more information please visit http://gump.apache.org/nagged.html, 
and/or contact the folk at general@gump.apache.org.

Project jtidy-cvs has an issue affecting its community integration.
This issue affects 1 projects,
 and has been outstanding for 36 runs.
The current state of this project is 'Failed', with reason 'Build Failed'.
For reference only, the following projects are affected by this:
    - jtidy-cvs :  HTML Templates


Full details are available at:
    http://vmgump.apache.org/gump/public/jtidy/jtidy-cvs/index.html

That said, some information snippets are provided here.

The following annotations (debug/informational/warning/error messages) were provided:
 -DEBUG- Sole output [jtidy-21092009.jar] identifier set to project name
 -DEBUG- Dependency on xml-apis exists, no need to add for property maven.jar.dom3-xml-apis.
 -DEBUG- (Gump generated) Maven Properties in: /srv/gump/public/workspace/jtidy/build.properties
 -INFO- Failed with reason build failed
 -DEBUG- Maven POM in: /srv/gump/public/workspace/jtidy/project.xml
 -DEBUG- Maven project properties in: /srv/gump/public/workspace/jtidy/project.properties
 -INFO- Failed to extract fallback artifacts from Gump Repository



The following work was performed:
http://vmgump.apache.org/gump/public/jtidy/jtidy-cvs/gump_work/build_jtidy_jtidy-cvs.html
Work Name: build_jtidy_jtidy-cvs (Type: Build)
Work ended in a state of : Failed
Elapsed: 2 secs
Command Line: maven --offline jar 
[Working Directory: /srv/gump/public/workspace/jtidy]
CLASSPATH: /usr/lib/jvm/java-6-sun/lib/tools.jar:/srv/gump/public/workspace/ant/dist/lib/ant-jmf.jar:/srv/gump/public/workspace/ant/dist/lib/ant-swing.jar:/srv/gump/public/workspace/ant/dist/lib/ant-apache-resolver.jar:/srv/gump/public/workspace/ant/dist/lib/ant-apache-xalan2.jar:/srv/gump/public/workspace/ant/dist/lib/ant-trax.jar:/srv/gump/public/workspace/ant/dist/lib/ant-junit.jar:/srv/gump/public/workspace/ant/dist/lib/ant-launcher.jar:/srv/gump/public/workspace/ant/dist/lib/ant-nodeps.jar:/srv/gump/public/workspace/ant/dist/lib/ant.jar:/srv/gump/packages/junit3.8.1/junit.jar:/srv/gump/public/workspace/xml-commons/java/build/resolver.jar:/srv/gump/public/workspace/xml-commons/java/external/build/xml-apis-ext.jar:/srv/gump/public/workspace/apache-commons/logging/target/commons-logging-21092009.jar:/srv/gump/public/workspace/apache-commons/logging/target/commons-logging-api-21092009.jar
---------------------------------------------
	... 33 more
[MethodExpression] Cannot evaluate expression
java.lang.reflect.InvocationTargetException
	at sun.reflect.NativeMethodAccessorImpl.invoke0(Native Method)
	at sun.reflect.NativeMethodAccessorImpl.invoke(NativeMethodAccessorImpl.java:39)
	at sun.reflect.DelegatingMethodAccessorImpl.invoke(DelegatingMethodAccessorImpl.java:25)
	at java.lang.reflect.Method.invoke(Method.java:597)
	at org.apache.commons.betwixt.expression.MethodExpression.evaluate(MethodExpression.java:96)
	at org.apache.commons.betwixt.io.AbstractBeanWriter.writeContent(AbstractBeanWriter.java:658)
	at org.apache.commons.betwixt.io.AbstractBeanWriter.writeRestOfElement(AbstractBeanWriter.java:539)
	at org.apache.commons.betwixt.io.AbstractBeanWriter.write(AbstractBeanWriter.java:481)
	at org.apache.commons.betwixt.io.AbstractBeanWriter.writeContent(AbstractBeanWriter.java:643)
	at org.apache.commons.betwixt.io.AbstractBeanWriter.writeRestOfElement(AbstractBeanWriter.java:539)
	at org.apache.commons.betwixt.io.AbstractBeanWriter.write(AbstractBeanWriter.java:513)
	at org.apache.commons.betwixt.io.AbstractBeanWriter.write(AbstractBeanWriter.java:233)
	at org.apache.commons.betwixt.io.AbstractBeanWriter.writeContent(AbstractBeanWriter.java:630)
	at org.apache.commons.betwixt.io.AbstractBeanWriter.writeRestOfElement(AbstractBeanWriter.java:539)
	at org.apache.commons.betwixt.io.AbstractBeanWriter.write(AbstractBeanWriter.java:513)
	at org.apache.commons.betwixt.io.AbstractBeanWriter.write(AbstractBeanWriter.java:233)
	at org.apache.commons.betwixt.io.AbstractBeanWriter.write(AbstractBeanWriter.java:162)
	at org.apache.commons.betwixt.io.BeanWriter.write(BeanWriter.java:217)
	at org.apache.maven.MavenUtils.getProjectString(MavenUtils.java:432)
	at org.apache.maven.MavenUtils.getInterpolatedPOM(MavenUtils.java:383)
	at org.apache.maven.MavenUtils.getJellyProject(MavenUtils.java:360)
	at org.apache.maven.MavenUtils.getProject(MavenUtils.java:144)
	at org.apache.maven.MavenUtils.getProject(MavenUtils.java:122)
	at org.apache.maven.MavenSession.initializeRootProject(MavenSession.java:232)
	at org.apache.maven.MavenSession.initialize(MavenSession.java:172)
	at org.apache.maven.cli.App.doMain(App.java:475)
	at org.apache.maven.cli.App.main(App.java:1239)
	at sun.reflect.NativeMethodAccessorImpl.invoke0(Native Method)
	at sun.reflect.NativeMethodAccessorImpl.invoke(NativeMethodAccessorImpl.java:39)
	at sun.reflect.DelegatingMethodAccessorImpl.invoke(DelegatingMethodAccessorImpl.java:25)
	at java.lang.reflect.Method.invoke(Method.java:597)
	at com.werken.forehead.Forehead.run(Forehead.java:551)
	at com.werken.forehead.Forehead.main(Forehead.java:581)
Caused by: java.lang.IllegalArgumentException: cvs repository connection string doesn't contain six tokens
	at org.apache.maven.project.Repository.splitSCMConnection(Repository.java:258)
	at org.apache.maven.project.Repository.getScmType(Repository.java:115)
	... 33 more
The build cannot continue because of the following unsatisfied dependencies:

maven-sourceforge-plugin-1.0.jar (try downloading from http://maven-plugins.sourceforge.net)
maven-statcvs-plugin-2.7.jar
maven-xhtml-plugin-1.2.jar (try downloading from http://maven-validator.sourceforge.net)
maven-checkstyle-plugin-2.4.1.jar (try downloading from http://maven.apache.org/reference/plugins/checkstyle)

Total time: 1 seconds
Finished at: Mon Sep 21 03:21:36 PDT 2009

---------------------------------------------

To subscribe to this information via syndicated feeds:
- RSS: http://vmgump.apache.org/gump/public/jtidy/jtidy-cvs/rss.xml
- Atom: http://vmgump.apache.org/gump/public/jtidy/jtidy-cvs/atom.xml

============================== Gump Tracking Only ===
Produced by Gump version 2.3.
Gump Run 13000021092009, vmgump:vmgump-public:13000021092009
Gump E-mail Identifier (unique within run) #22.

*********************************************************** G U M P
[GUMP@vmgump]: Project slf4j-test (in module slf4j) failed
To whom it may engage...
        
This is an automated request, but not an unsolicited one. For 
more information please visit http://gump.apache.org/nagged.html, 
and/or contact the folk at general@gump.apache.org.

Project slf4j-test has an issue affecting its community integration.
This issue affects 1 projects,
 and has been outstanding for 14 runs.
The current state of this project is 'Failed', with reason 'Build Failed'.
For reference only, the following projects are affected by this:
    - slf4j-test :  Simple Logging Facade for Java


Full details are available at:
    http://vmgump.apache.org/gump/public/slf4j/slf4j-test/index.html

That said, some information snippets are provided here.

The following annotations (debug/informational/warning/error messages) were provided:
 -WARNING- Overriding Maven2 settings: [/srv/gump/public/workspace/slf4j/gump_mvn_settings.xml]
 -DEBUG- (Gump generated) Maven2 Settings in: /srv/gump/public/workspace/slf4j/gump_mvn_settings.xml
 -INFO- Failed with reason build failed
 -DEBUG- Maven POM in: /srv/gump/public/workspace/slf4j/pom.xml



The following work was performed:
http://vmgump.apache.org/gump/public/slf4j/slf4j-test/gump_work/build_slf4j_slf4j-test.html
Work Name: build_slf4j_slf4j-test (Type: Build)
Work ended in a state of : Failed
Elapsed: 22 secs
Command Line: mvn --batch-mode --settings /srv/gump/public/workspace/slf4j/gump_mvn_settings.xml package 
[Working Directory: /srv/gump/public/workspace/slf4j]
CLASSPATH: /usr/lib/jvm/java-6-sun/lib/tools.jar:/srv/gump/public/workspace/slf4j/slf4j-migrator/target/slf4j-migrator-1.5.9-SNAPSHOT.jar:/srv/gump/public/workspace/slf4j/slf4j-nop/target/slf4j-nop-1.5.9-SNAPSHOT.jar:/srv/gump/public/workspace/slf4j/log4j-over-slf4j/target/log4j-over-slf4j-1.5.9-SNAPSHOT.jar:/srv/gump/public/workspace/slf4j/slf4j-log4j12/target/slf4j-log4j12-1.5.9-SNAPSHOT.jar:/srv/gump/public/workspace/slf4j/slf4j-jcl/target/slf4j-jcl-1.5.9-SNAPSHOT.jar:/srv/gump/public/workspace/slf4j/slf4j-api/target/slf4j-api-1.5.9-SNAPSHOT.jar:/srv/gump/public/workspace/slf4j/jcl104-over-slf4j/target/jcl104-over-slf4j-1.5.9-SNAPSHOT.jar:/srv/gump/public/workspace/slf4j/slf4j-jdk14/target/slf4j-jdk14-1.5.9-SNAPSHOT.jar:/srv/gump/public/workspace/slf4j/slf4j-simple/target/slf4j-simple-1.5.9-SNAPSHOT.jar:/srv/gump/public/workspace/slf4j/slf4j-ext/target/slf4j-ext-1.5.9-SNAPSHOT.jar:/srv/gump/public/workspace/slf4j/jcl-over-slf4j/target/jcl-over-slf4j-1.5.9-SNAPSHOT.jar:/srv
 /gump/public/workspace/slf4j/jul-to-slf4j/target/jul-to-slf4j-1.5.9-SNAPSHOT.jar
---------------------------------------------
[WARNING] File encoding has not been set, using platform encoding UTF-8, i.e. build is platform dependent!
[WARNING] Using platform encoding (UTF-8 actually) to copy filtered resources, i.e. build is platform dependent!
[INFO] skip non existing resourceDirectory /srv/gump/public/workspace/slf4j/integration/src/main/resources
[INFO] [compiler:compile]
[INFO] Nothing to compile - all classes are up to date
[INFO] [resources:testResources]
[WARNING] Using platform encoding (UTF-8 actually) to copy filtered resources, i.e. build is platform dependent!
[INFO] skip non existing resourceDirectory /srv/gump/public/workspace/slf4j/integration/src/test/resources
[INFO] [compiler:testCompile]
[INFO] Nothing to compile - all classes are up to date
[INFO] [surefire:test]
[INFO] Surefire report directory: /srv/gump/public/workspace/slf4j/integration/target/surefire-reports

-------------------------------------------------------
 T E S T S
-------------------------------------------------------
There are no tests to run.

Results :

Tests run: 0, Failures: 0, Errors: 0, Skipped: 0

[INFO] [jar:jar]
[WARNING] JAR will be empty - no content was marked for inclusion!
[INFO] [antrun:run {execution: ant-test}]
[INFO] Executing tasks
     [echo] compile classpath: /srv/gump/public/workspace/slf4j/integration/target/classes:/srv/gump/public/workspace/slf4j/slf4j-api/target/classes:/srv/gump/public/workspace/mvnlocalrepo/junit/junit/3.8.1/junit-3.8.1.jar:/srv/gump/public/workspace/mvnlocalrepo/ant/ant-junit/1.6.5/ant-junit-1.6.5.jar
     [echo] runtime classpath: /srv/gump/public/workspace/slf4j/integration/target/classes:/srv/gump/public/workspace/slf4j/slf4j-api/target/slf4j-api-1.5.9-SNAPSHOT.jar:/srv/gump/public/workspace/mvnlocalrepo/junit/junit/3.8.1/junit-3.8.1.jar:/srv/gump/public/workspace/mvnlocalrepo/ant/ant-junit/1.6.5/ant-junit-1.6.5.jar
     [echo] test classpath:    /srv/gump/public/workspace/slf4j/integration/target/test-classes:/srv/gump/public/workspace/slf4j/integration/target/classes:/srv/gump/public/workspace/slf4j/slf4j-api/target/slf4j-api-1.5.9-SNAPSHOT.jar:/srv/gump/public/workspace/mvnlocalrepo/junit/junit/3.8.1/junit-3.8.1.jar:/srv/gump/public/workspace/mvnlocalrepo/ant/ant-junit/1.6.5/ant-junit-1.6.5.jar
     [echo] plugin classpath:  /srv/gump/public/workspace/mvnlocalrepo/org/codehaus/plexus/plexus-utils/1.5.6/plexus-utils-1.5.6.jar:/srv/gump/public/workspace/mvnlocalrepo/org/apache/ant/ant-launcher/1.7.1/ant-launcher-1.7.1.jar:/srv/gump/public/workspace/mvnlocalrepo/org/apache/ant/ant/1.7.1/ant-1.7.1.jar:/opt/maven2/lib/maven-2.0.10-uber.jar
Trying to override old definition of datatype junit

init:

testMismatch:
    [junit] Running org.slf4j.VersionMismatchTest
    [junit] Tests run: 1, Failures: 1, Errors: 0, Time elapsed: 0.039 sec
[INFO] ------------------------------------------------------------------------
[ERROR] BUILD ERROR
[INFO] ------------------------------------------------------------------------
[INFO] An Ant BuildException has occured: The following error occurred while executing this line:
/srv/gump/public/workspace/slf4j/integration/build.xml:64: Test org.slf4j.VersionMismatchTest failed

[INFO] ------------------------------------------------------------------------
[INFO] For more information, run Maven with the -e switch
[INFO] ------------------------------------------------------------------------
[INFO] Total time: 20 seconds
[INFO] Finished at: Mon Sep 21 03:22:05 PDT 2009
[INFO] Final Memory: 20M/37M
[INFO] ------------------------------------------------------------------------
---------------------------------------------

To subscribe to this information via syndicated feeds:
- RSS: http://vmgump.apache.org/gump/public/slf4j/slf4j-test/rss.xml
- Atom: http://vmgump.apache.org/gump/public/slf4j/slf4j-test/atom.xml

============================== Gump Tracking Only ===
Produced by Gump version 2.3.
Gump Run 13000021092009, vmgump:vmgump-public:13000021092009
Gump E-mail Identifier (unique within run) #23.

*********************************************************** G U M P
[GUMP@vmgump]: Module tomcat-jasper_tc6 success, but with warnings.
To whom it may engage...
        
This is an automated request, but not an unsolicited one. For 
more information please visit http://gump.apache.org/nagged.html, 
and/or contact the folk at general@gump.apache.org.

Module tomcat-jasper_tc6 contains errors.
The current state of this module is 'Success'.

Full details are available at:
    http://vmgump.apache.org/gump/public/tomcat-jasper_tc6/index.html

That said, some information snippets are provided here.

The following annotations (debug/informational/warning/error messages) were provided:
 -ERROR- *** Failed to update from source control.Stale contents ***



The following work was performed:
http://vmgump.apache.org/gump/public/tomcat-jasper_tc6/gump_work/update_tomcat-jasper_tc6.html
Work Name: update_tomcat-jasper_tc6 (Type: Update)
Work ended in a state of : Failed
Elapsed: 4 secs
Command Line: svn --quiet update --non-interactive tomcat-jasper_tc6 
[Working Directory: /srv/gump/public/workspace/cvs]
---------------------------------------------
svn: Target path '/tomcat/jasper/tc6.0.x' does not exist
---------------------------------------------

To subscribe to this information via syndicated feeds:
- RSS: http://vmgump.apache.org/gump/public/tomcat-jasper_tc6/rss.xml
- Atom: http://vmgump.apache.org/gump/public/tomcat-jasper_tc6/atom.xml

============================== Gump Tracking Only ===
Produced by Gump version 2.3.
Gump Run 13000021092009, vmgump:vmgump-public:13000021092009
Gump E-mail Identifier (unique within run) #24.

*********************************************************** G U M P
[GUMP@vmgump]: Project xml-security-tests (in module xml-security) failed
To whom it may engage...
        
This is an automated request, but not an unsolicited one. For 
more information please visit http://gump.apache.org/nagged.html, 
and/or contact the folk at general@gump.apache.org.

Project xml-security-tests has an issue affecting its community integration.
This issue affects 1 projects,
 and has been outstanding for 25 runs.
The current state of this project is 'Failed', with reason 'Build Failed'.
For reference only, the following projects are affected by this:
    - xml-security-tests :  XML-Signature Syntax and Processing


Full details are available at:
    http://vmgump.apache.org/gump/public/xml-security/xml-security-tests/index.html

That said, some information snippets are provided here.

The following annotations (debug/informational/warning/error messages) were provided:
 -DEBUG- Dependency on jce exists, no need to add for property lib.jce.
 -INFO- Failed with reason build failed



The following work was performed:
http://vmgump.apache.org/gump/public/xml-security/xml-security-tests/gump_work/build_xml-security_xml-security-tests.html
Work Name: build_xml-security_xml-security-tests (Type: Build)
Work ended in a state of : Failed
Elapsed: 2 mins 16 secs
Command Line: /usr/lib/jvm/java-6-sun/bin/java -Djava.awt.headless=true -Dant.build.clonevm=true -Xbootclasspath/p:/srv/gump/public/workspace/xml-commons/java/external/build/xml-apis.jar:/srv/gump/public/workspace/xml-xerces2/build/xercesImpl.jar:/srv/gump/public/workspace/xml-xalan/build/serializer.jar:/srv/gump/public/workspace/xml-xalan/build/xalan-unbundled.jar org.apache.tools.ant.Main -Dgump.merge=/srv/gump/public/gump/work/merge.xml -Dbuild.sysclasspath=only -Djce.download.sha1=c1f0e975e8c8e0a0105787b249a50615b485d109 -Dlib.jce=/srv/gump/packages/jce/jce-jdk13-116.jar -Djce.download.md5=85c64cd754719a4bc8da7e9aa0e113fd test 
[Working Directory: /srv/gump/public/workspace/xml-security]
CLASSPATH: /usr/lib/jvm/java-6-sun/lib/tools.jar:/srv/gump/public/workspace/xml-security/build/test:/srv/gump/public/workspace/xml-security:/srv/gump/public/workspace/xml-security/build/xmlsec-21092009.jar:/srv/gump/public/workspace/ant/dist/lib/ant-jmf.jar:/srv/gump/public/workspace/ant/dist/lib/ant-swing.jar:/srv/gump/public/workspace/ant/dist/lib/ant-apache-resolver.jar:/srv/gump/public/workspace/ant/dist/lib/ant-apache-xalan2.jar:/srv/gump/public/workspace/ant/dist/lib/ant-trax.jar:/srv/gump/public/workspace/ant/dist/lib/ant-junit.jar:/srv/gump/public/workspace/ant/dist/lib/ant-launcher.jar:/srv/gump/public/workspace/ant/dist/lib/ant-nodeps.jar:/srv/gump/public/workspace/ant/dist/lib/ant.jar:/srv/gump/packages/junit3.8.1/junit.jar:/srv/gump/public/workspace/xml-commons/java/build/resolver.jar:/srv/gump/public/workspace/xml-commons/java/external/build/xml-apis-ext.jar:/srv/gump/packages/jce/jce-jdk13-116.jar:/srv/gump/public/workspace/apache-commons/logging/target/commons-
 logging-21092009.jar:/srv/gump/public/workspace/apache-commons/logging/target/commons-logging-api-21092009.jar:/srv/gump/public/workspace/junit/dist/junit-21092009.jar
---------------------------------------------
    [junit] 	Caused an ERROR
    [junit] Illegal key size
    [junit] 
    [junit] Testcase: testTrippleDesElementCipher took 0.173 sec
    [junit] Testcase: testAes128ElementCipher took 0.262 sec
    [junit] Testcase: testAes192ElementCipher took 0.129 sec
    [junit] 	Caused an ERROR
    [junit] Illegal key size
    [junit] 
    [junit] Testcase: testAes265ElementCipher took 0.142 sec
    [junit] 	Caused an ERROR
    [junit] Illegal key size
    [junit] 
    [junit] Testcase: testTrippleDesDocumentCipher took 1.048 sec
    [junit] Testcase: testSameDocumentCipherReference took 0.02 sec
    [junit] Testcase: testSerializedData took 0.072 sec
    [junit] Testcase: testEncryptedKeyWithRecipient took 0.12 sec
    [junit] Testcase: test_five_content_3des_cbc took 0.291 sec
    [junit] Testcase: test_five_content_aes256_cbc took 0.134 sec
    [junit] 	Caused an ERROR
    [junit] Illegal key size
    [junit] 
    [junit] Testcase: test_five_content_aes128_cbc_kw_aes192 took 0.145 sec
    [junit] Testcase: test_five_content_3des_cbc_kw_aes128 took 0.111 sec
    [junit] Testcase: test_five_content_aes128_cbc_rsa_15 took 0.35 sec
    [junit] Testcase: test_five_element_aes192_cbc_ref took 0.114 sec
    [junit] 	Caused an ERROR
    [junit] Illegal key size
    [junit] 
    [junit] Testcase: test_five_data_aes128_cbc took 0.123 sec
    [junit] Testcase: test_five_data_aes256_cbc_3des took 0.033 sec
    [junit] 	Caused an ERROR
    [junit] Illegal key size
    [junit] 
    [junit] Testcase: test_five_data_aes192_cbc_aes256 took 0.033 sec
    [junit] 	Caused an ERROR
    [junit] Illegal key size
    [junit] 
    [junit] Testcase: test_five_data_3des_cbc_rsa_oaep took 0.276 sec
    [junit] Testcase: testContentRemoved took 0.011 sec
    [junit] Test org.apache.xml.security.test.AllTests FAILED
[junitreport] Processing /srv/gump/public/workspace/xml-security/build/docs/xml/junit/TESTS-TestSuites.xml to /tmp/null296126492
[junitreport] Loading stylesheet jar:file:/srv/gump/public/workspace/ant/dist/lib/ant-junit.jar!/org/apache/tools/ant/taskdefs/optional/junit/xsl/junit-frames.xsl
[junitreport] Transform time: 3072ms
[junitreport] Deleting: /tmp/null296126492

BUILD FAILED
/srv/gump/public/workspace/xml-security/build.xml:377: Unit Tests Failed

Total time: 2 minutes 15 seconds
---------------------------------------------

To subscribe to this information via syndicated feeds:
- RSS: http://vmgump.apache.org/gump/public/xml-security/xml-security-tests/rss.xml
- Atom: http://vmgump.apache.org/gump/public/xml-security/xml-security-tests/atom.xml

============================== Gump Tracking Only ===
Produced by Gump version 2.3.
Gump Run 13000021092009, vmgump:vmgump-public:13000021092009
Gump E-mail Identifier (unique within run) #28.

*********************************************************** G U M P
[GUMP@vmgump]: Project JacORB-idllib (in module JacORB) failed
To whom it may engage...
        
This is an automated request, but not an unsolicited one. For 
more information please visit http://gump.apache.org/nagged.html, 
and/or contact the folk at general@gump.apache.org.

Project JacORB-idllib has an issue affecting its community integration.
This issue affects 1 projects,
 and has been outstanding for 36 runs.
The current state of this project is 'Failed', with reason 'Build Failed'.
For reference only, the following projects are affected by this:
    - JacORB-idllib :  The free Java implementation of the OMG's CORBA standard.


Full details are available at:
    http://vmgump.apache.org/gump/public/JacORB/JacORB-idllib/index.html

That said, some information snippets are provided here.

The following annotations (debug/informational/warning/error messages) were provided:
 -DEBUG- Sole output [idl.jar] identifier set to project name
 -INFO- Failed with reason build failed
 -INFO- Failed to extract fallback artifacts from Gump Repository



The following work was performed:
http://vmgump.apache.org/gump/public/JacORB/JacORB-idllib/gump_work/build_JacORB_JacORB-idllib.html
Work Name: build_JacORB_JacORB-idllib (Type: Build)
Work ended in a state of : Failed
Elapsed: 5 secs
Command Line: /usr/lib/jvm/java-6-sun/bin/java -Djava.awt.headless=true -Xbootclasspath/p:/srv/gump/public/workspace/xml-commons/java/external/build/xml-apis.jar:/srv/gump/public/workspace/xml-xerces2/build/xercesImpl.jar org.apache.tools.ant.Main -Dgump.merge=/srv/gump/public/gump/work/merge.xml -Dbuild.sysclasspath=only init idllib 
[Working Directory: /srv/gump/public/workspace/JacORB]
CLASSPATH: /usr/lib/jvm/java-6-sun/lib/tools.jar:/srv/gump/public/workspace/ant/build/lib/ant-stylebook.jar:/srv/gump/public/workspace/ant/build/lib/ant-swing.jar:/srv/gump/public/workspace/ant/build/lib/ant-apache-resolver.jar:/srv/gump/public/workspace/ant/build/lib/ant-nodeps.jar:/srv/gump/public/workspace/ant/build/lib/ant-apache-xalan2.jar:/srv/gump/public/workspace/ant/build/lib/ant-apache-regexp.jar:/srv/gump/public/workspace/ant/build/lib/ant-commons-net.jar:/srv/gump/public/workspace/ant/build/lib/ant-apache-log4j.jar:/srv/gump/public/workspace/ant/build/lib/ant-commons-logging.jar:/srv/gump/public/workspace/ant/build/lib/ant-jai.jar:/srv/gump/public/workspace/ant/build/lib/ant-jmf.jar:/srv/gump/public/workspace/ant/build/lib/ant-launcher.jar:/srv/gump/public/workspace/ant/build/lib/ant-jdepend.jar:/srv/gump/public/workspace/ant/build/lib/ant-apache-bsf.jar:/srv/gump/public/workspace/ant/build/lib/ant-apache-oro.jar:/srv/gump/public/workspace/ant/build/lib/ant-apache
 -bcel.jar:/srv/gump/public/workspace/ant/build/lib/ant-trax.jar:/srv/gump/public/workspace/ant/build/lib/ant-antlr.jar:/srv/gump/public/workspace/ant/build/lib/ant-junit.jar:/srv/gump/public/workspace/ant/build/lib/ant-jsch.jar:/srv/gump/public/workspace/ant/build/lib/ant-javamail.jar:/srv/gump/public/workspace/ant/build/lib/ant.jar:/srv/gump/public/workspace/xml-commons/java/external/build/xml-apis-ext.jar:/srv/gump/packages/antlr/antlr-3.1.3.jar:/srv/gump/public/workspace/excalibur/framework/api/target/avalon-framework-api-4.3.2-SNAPSHOT.jar:/srv/gump/packages/dougLea/concurrent.jar:/srv/gump/packages/avalon/avalon-logkit-2.1.jar:/srv/gump/public/workspace/xml-xalan/tools/java_cup.jar:/srv/gump/public/workspace/xml-xalan/lib/runtime.jar
---------------------------------------------
    [javac] location: package org.jacorb.idl.runtime
    [javac]               CUP$parser$result = new org.jacorb.idl.runtime.Symbol(91/*parameter_dcls*/, ((org.jacorb.idl.runtime.Symbol)CUP$parser$stack.elementAt(CUP$parser$top-1)).left, ((org.jacorb.idl.runtime.Symbol)CUP$parser$stack.elementAt(CUP$parser$top-0)).right, RESULT);
    [javac]                                                             ^
    [javac] /srv/gump/public/workspace/JacORB/src/org/jacorb/idl/parser.java:2090: cannot find symbol
    [javac] symbol  : class Symbol
    [javac] location: package org.jacorb.idl.runtime
    [javac]               CUP$parser$result = new org.jacorb.idl.runtime.Symbol(91/*parameter_dcls*/, ((org.jacorb.idl.runtime.Symbol)CUP$parser$stack.elementAt(CUP$parser$top-1)).left, ((org.jacorb.idl.runtime.Symbol)CUP$parser$stack.elementAt(CUP$parser$top-0)).right, RESULT);
    [javac]                                                                                                                   ^
    [javac] /srv/gump/public/workspace/JacORB/src/org/jacorb/idl/parser.java:2090: cannot find symbol
    [javac] symbol  : class Symbol
    [javac] location: package org.jacorb.idl.runtime
    [javac]               CUP$parser$result = new org.jacorb.idl.runtime.Symbol(91/*parameter_dcls*/, ((org.jacorb.idl.runtime.Symbol)CUP$parser$stack.elementAt(CUP$parser$top-1)).left, ((org.jacorb.idl.runtime.Symbol)CUP$parser$stack.elementAt(CUP$parser$top-0)).right, RESULT);
    [javac]                                                                                                                                                                                                       ^
    [javac] /srv/gump/public/workspace/JacORB/src/org/jacorb/idl/parser.java:2098: cannot find symbol
    [javac] symbol  : class Symbol
    [javac] location: package org.jacorb.idl.runtime
    [javac] 		int pdsleft = ((org.jacorb.idl.runtime.Symbol)CUP$parser$stack.elementAt(CUP$parser$top-1)).left;
    [javac] 		                                      ^
    [javac] /srv/gump/public/workspace/JacORB/src/org/jacorb/idl/parser.java:2099: cannot find symbol
    [javac] symbol  : class Symbol
    [javac] location: package org.jacorb.idl.runtime
    [javac] 		int pdsright = ((org.jacorb.idl.runtime.Symbol)CUP$parser$stack.elementAt(CUP$parser$top-1)).right;
    [javac] 		                                       ^
    [javac] /srv/gump/public/workspace/JacORB/src/org/jacorb/idl/parser.java:2100: cannot find symbol
    [javac] symbol  : class Symbol
    [javac] location: package org.jacorb.idl.runtime
    [javac] 		SymbolList pds = (SymbolList)((org.jacorb.idl.runtime.Symbol) CUP$parser$stack.elementAt(CUP$parser$top-1)).value;
    [javac] 		                                                     ^
    [javac] /srv/gump/public/workspace/JacORB/src/org/jacorb/idl/parser.java:2104: cannot find symbol
    [javac] symbol  : class Symbol
    [javac] location: package org.jacorb.idl.runtime
    [javac]               CUP$parser$result = new org.jacorb.idl.runtime.Symbol(91/*parameter_dcls*/, ((org.jacorb.idl.runtime.Symbol)CUP$parser$stack.elementAt(CUP$parser$top-2)).left, ((org.jacorb.idl.runtime.Symbol)CUP$parser$stack.elementAt(CUP$parser$top-0)).right, RESULT);
    [javac]                                                             ^
    [javac] /srv/gump/public/workspace/JacORB/src/org/jacorb/idl/parser.java:2104: cannot find symbol
    [javac] symbol  : class Symbol
    [javac] location: package org.jacorb.idl.runtime
    [javac]               CUP$parser$result = new org.jacorb.idl.runtime.Symbol(91/*parameter_dcls*/, ((org.jacorb.idl.runtime.Symbol)CUP$parser$stack.elementAt(CUP$parser$top-2)).left, ((org.jacorb.idl.runtime.Symbol)CUP$parser$stack.elementAt(CUP$parser$top-0)).right, RESULT);
    [javac]                                                                                                                   ^
    [javac] Note: Some input files use or override a deprecated API.
    [javac] Note: Recompile with -Xlint:deprecation for details.
    [javac] Note: Some input files use unchecked or unsafe operations.
    [javac] Note: Recompile with -Xlint:unchecked for details.
    [javac] 100 errors

BUILD FAILED
/srv/gump/public/workspace/JacORB/build.xml:102: The following error occurred while executing this line:
/srv/gump/public/workspace/JacORB/src/org/jacorb/idl/build.xml:18: The following error occurred while executing this line:
/srv/gump/public/workspace/JacORB/etc/common.xml:83: Compile failed; see the compiler error output for details.

Total time: 4 seconds
---------------------------------------------

To subscribe to this information via syndicated feeds:
- RSS: http://vmgump.apache.org/gump/public/JacORB/JacORB-idllib/rss.xml
- Atom: http://vmgump.apache.org/gump/public/JacORB/JacORB-idllib/atom.xml

============================== Gump Tracking Only ===
Produced by Gump version 2.3.
Gump Run 13000021092009, vmgump:vmgump-public:13000021092009
Gump E-mail Identifier (unique within run) #31.

*********************************************************** G U M P
[GUMP@vmgump]: Project jetty-test (in module jetty) failed
To whom it may engage...
        
This is an automated request, but not an unsolicited one. For 
more information please visit http://gump.apache.org/nagged.html, 
and/or contact the folk at general@gump.apache.org.

Project jetty-test has an issue affecting its community integration.
This issue affects 1 projects,
 and has been outstanding for 245 runs.
The current state of this project is 'Failed', with reason 'Build Failed'.
For reference only, the following projects are affected by this:
    - jetty-test :  Java HTTP Servlet Server


Full details are available at:
    http://vmgump.apache.org/gump/public/jetty/jetty-test/index.html

That said, some information snippets are provided here.

The following annotations (debug/informational/warning/error messages) were provided:
 -WARNING- Overriding Maven2 settings: [/srv/gump/public/workspace/jetty/gump_mvn_settings.xml]
 -DEBUG- (Gump generated) Maven2 Settings in: /srv/gump/public/workspace/jetty/gump_mvn_settings.xml
 -INFO- Failed with reason build failed
 -DEBUG- Maven POM in: /srv/gump/public/workspace/jetty/pom.xml



The following work was performed:
http://vmgump.apache.org/gump/public/jetty/jetty-test/gump_work/build_jetty_jetty-test.html
Work Name: build_jetty_jetty-test (Type: Build)
Work ended in a state of : Failed
Elapsed: 7 mins 7 secs
Command Line: mvn --batch-mode --settings /srv/gump/public/workspace/jetty/gump_mvn_settings.xml package 
[Working Directory: /srv/gump/public/workspace/jetty]
CLASSPATH: /usr/lib/jvm/java-6-sun/lib/tools.jar:/srv/gump/public/workspace/jetty/jetty-client/target/jetty-client-7.0.1-SNAPSHOT.jar:/srv/gump/public/workspace/jetty/jetty-jaspi/target/jetty-jaspi-7.0.1-SNAPSHOT.jar:/srv/gump/public/workspace/jetty/jetty-xml/target/jetty-xml-7.0.1-SNAPSHOT.jar:/srv/gump/public/workspace/jetty/jetty-security/target/jetty-security-7.0.1-SNAPSHOT.jar:/srv/gump/public/workspace/jetty/jetty-policy/target/jetty-policy-7.0.1-SNAPSHOT.jar:/srv/gump/public/workspace/jetty/jetty-centralized-logging/target/jetty-centralized-logging-7.0.1-SNAPSHOT.jar:/srv/gump/public/workspace/jetty/jetty-webapp/target/jetty-webapp-7.0.1-SNAPSHOT.jar:/srv/gump/public/workspace/jetty/jetty-http/target/jetty-http-7.0.1-SNAPSHOT.jar:/srv/gump/public/workspace/jetty/jetty-continuation/target/jetty-continuation-7.0.1-SNAPSHOT.jar:/srv/gump/public/workspace/jetty/jetty-annotations/target/jetty-annotations-7.0.1-SNAPSHOT.jar:/srv/gump/public/workspace/jetty/jetty-start/target
 /jetty-start-7.0.1-SNAPSHOT.jar:/srv/gump/public/workspace/jetty/jetty-util/target/jetty-util-7.0.1-SNAPSHOT.jar:/srv/gump/public/workspace/jetty/jetty-ajp/target/jetty-ajp-7.0.1-SNAPSHOT.jar:/srv/gump/public/workspace/jetty/jetty-webapp-logging/target/jetty-webapp-logging-7.0.1-SNAPSHOT.jar:/srv/gump/public/workspace/jetty/jetty-io/target/jetty-io-7.0.1-SNAPSHOT.jar:/srv/gump/public/workspace/jetty/jetty-plus/target/jetty-plus-7.0.1-SNAPSHOT.jar:/srv/gump/public/workspace/jetty/jetty-servlet/target/jetty-servlet-7.0.1-SNAPSHOT.jar:/srv/gump/public/workspace/jetty/jetty-rewrite/target/jetty-rewrite-7.0.1-SNAPSHOT.jar:/srv/gump/public/workspace/jetty/jetty-server/target/jetty-server-7.0.1-SNAPSHOT.jar:/srv/gump/public/workspace/jetty/jetty-jndi/target/jetty-jndi-7.0.1-SNAPSHOT.jar:/srv/gump/public/workspace/jetty/jetty-deploy/target/jetty-deploy-7.0.1-SNAPSHOT.jar:/srv/gump/public/workspace/jetty/jetty-jmx/target/jetty-jmx-7.0.1-SNAPSHOT.jar:/srv/gump/public/workspace/jetty/j
 etty-webapp-verifier/target/jetty-webapp-verifier-7.0.1-SNAPSHOT.jar:/srv/gump/public/workspace/jetty/jetty-servlets/target/jetty-servlets-7.0.1-SNAPSHOT.jar:/srv/gump/public/workspace/ant/dist/lib/ant-jmf.jar:/srv/gump/public/workspace/ant/dist/lib/ant-swing.jar:/srv/gump/public/workspace/ant/dist/lib/ant-apache-resolver.jar:/srv/gump/public/workspace/ant/dist/lib/ant-apache-xalan2.jar:/srv/gump/public/workspace/ant/dist/lib/ant-trax.jar:/srv/gump/public/workspace/ant/dist/lib/ant-junit.jar:/srv/gump/public/workspace/ant/dist/lib/ant-launcher.jar:/srv/gump/public/workspace/ant/dist/lib/ant-nodeps.jar:/srv/gump/public/workspace/ant/dist/lib/ant.jar:/srv/gump/packages/bsh-2.0b4/bsh-commands-2.0b4.jar:/srv/gump/packages/bsh-2.0b4/bsh-classpath-2.0b4.jar:/srv/gump/packages/bsh-2.0b4/bsh-core-2.0b4.jar:/srv/gump/packages/bsh-2.0b4/bsh-bsf-2.0b4.jar:/srv/gump/packages/bsh-2.0b4/bsh-2.0b4.jar:/srv/gump/packages/bsh-2.0b4/bsh-reflect-2.0b4.jar:/srv/gump/packages/bsh-2.0b4/bsh-util-
 2.0b4.jar:/srv/gump/public/workspace/apache-commons/beanutils/dist/commons-beanutils-21092009.jar:/srv/gump/public/workspace/apache-commons/digester/dist/commons-digester.jar:/srv/gump/public/workspace/httpcomponents/oac.hc3x/dist/commons-httpclient.jar:/srv/gump/packages/jaf-1.1ea/activation.jar:/srv/gump/public/workspace/jakarta-servletapi-5/jsr154/dist/lib/servlet-api.jar:/srv/gump/packages/javamail-1.4/mail.jar:/srv/gump/packages/javamail-1.4/lib/mailapi.jar:/srv/gump/packages/jtidy-04aug2000r7-dev/build/Tidy.jar:/srv/gump/public/workspace/junit/dist/junit-21092009.jar:/srv/gump/public/workspace/mx4j/dist/lib/mx4j-impl.jar:/srv/gump/public/workspace/mx4j/dist/lib/mx4j-jmx.jar:/srv/gump/public/workspace/mx4j/dist/lib/mx4j.jar:/srv/gump/public/workspace/mx4j/tools-dist/lib/mx4j-tools.jar:/srv/gump/public/workspace/slf4j/slf4j-migrator/target/slf4j-migrator-1.5.9-SNAPSHOT.jar:/srv/gump/public/workspace/slf4j/slf4j-nop/target/slf4j-nop-1.5.9-SNAPSHOT.jar:/srv/gump/public/wor
 kspace/slf4j/log4j-over-slf4j/target/log4j-over-slf4j-1.5.9-SNAPSHOT.jar:/srv/gump/public/workspace/slf4j/slf4j-log4j12/target/slf4j-log4j12-1.5.9-SNAPSHOT.jar:/srv/gump/public/workspace/slf4j/slf4j-jcl/target/slf4j-jcl-1.5.9-SNAPSHOT.jar:/srv/gump/public/workspace/slf4j/slf4j-api/target/slf4j-api-1.5.9-SNAPSHOT.jar:/srv/gump/public/workspace/slf4j/jcl104-over-slf4j/target/jcl104-over-slf4j-1.5.9-SNAPSHOT.jar:/srv/gump/public/workspace/slf4j/slf4j-jdk14/target/slf4j-jdk14-1.5.9-SNAPSHOT.jar:/srv/gump/public/workspace/slf4j/slf4j-simple/target/slf4j-simple-1.5.9-SNAPSHOT.jar:/srv/gump/public/workspace/slf4j/slf4j-ext/target/slf4j-ext-1.5.9-SNAPSHOT.jar:/srv/gump/public/workspace/slf4j/jcl-over-slf4j/target/jcl-over-slf4j-1.5.9-SNAPSHOT.jar:/srv/gump/public/workspace/slf4j/jul-to-slf4j/target/jul-to-slf4j-1.5.9-SNAPSHOT.jar:/srv/gump/public/workspace/jakarta-slide/webdavclient/dist/lib/jakarta-slide-webdavlib-21092009.jar:/srv/gump/public/workspace/xml-commons/java/external/bu
 ild/xml-apis-ext.jar
---------------------------------------------
2009-09-21 04:46:32.151:DEBUG:org.eclipse.jetty.util.log:parse: file:/srv/gump/public/workspace/jetty/jetty-webapp-logging/src/test/resources/contexts/context-dummy-webapp-java.xml
2009-09-21 04:46:32.151:DEBUG:org.eclipse.jetty.util.log:parsing: sid=file:/srv/gump/public/workspace/jetty/jetty-webapp-logging/src/test/resources/contexts/context-dummy-webapp-java.xml,pid=null
2009-09-21 04:46:32.152:DEBUG:org.eclipse.jetty.util.log:resolveEntity(-//Mort Bay Consulting//DTD Configure//EN, http://jetty.mortbay.org/configure.dtd)
2009-09-21 04:46:32.152:DEBUG:org.eclipse.jetty.util.log:Redirected entity http://jetty.mortbay.org/configure.dtd --> jar:file:/srv/gump/public/workspace/jetty/jetty-xml/target/jetty-xml-7.0.1-SNAPSHOT.jar!/org/eclipse/jetty/xml/configure_6_0.dtd
2009-09-21 04:46:32.152:DEBUG:org.eclipse.jetty.util.log:XML WebAppContext@197a37c@197a37c/,null.setContextPath(/java)
2009-09-21 04:46:32.152:DEBUG:org.eclipse.jetty.util.log:XML WebAppContext@197a37c@197a37c/java,null.setWar(/srv/gump/public/workspace/jetty/jetty-webapp-logging/src/test/resources/webapps/dummy-webapp-logging-java.war)
2009-09-21 04:46:32.152:INFO:org.eclipse.jetty.util.log:Deploy /srv/gump/public/workspace/jetty/jetty-webapp-logging/src/test/resources/contexts/context-dummy-webapp-java.xml -> WebAppContext@197a37c@197a37c/java,null,/srv/gump/public/workspace/jetty/jetty-webapp-logging/src/test/resources/webapps/dummy-webapp-logging-java.war
2009-09-21 04:46:32.152:DEBUG:org.eclipse.jetty.util.log:Container ContextHandlerCollection@1e51060 + WebAppContext@197a37c@197a37c/java,null,/srv/gump/public/workspace/jetty/jetty-webapp-logging/src/test/resources/webapps/dummy-webapp-logging-java.war as handler
2009-09-21 04:46:32.152:DEBUG:org.eclipse.jetty.util.log:Container WebAppContext@197a37c@197a37c/java,null,/srv/gump/public/workspace/jetty/jetty-webapp-logging/src/test/resources/webapps/dummy-webapp-logging-java.war + ErrorPageErrorHandler@6e3d60 as error
2009-09-21 04:46:32.152:DEBUG:org.eclipse.jetty.util.log:STARTED org.eclipse.jetty.deploy.ContextDeployer@82c01f
2009-09-21 04:46:32.152:DEBUG:org.eclipse.jetty.util.log:Starting org.eclipse.jetty.deploy.WebAppDeployer@1037c71
2009-09-21 04:46:32.152:DEBUG:org.eclipse.jetty.util.log:Container ContextHandlerCollection@19616c7 + WebAppContext@18385e3@18385e3/dummy-webapp-logging-java,null,file:/srv/gump/public/workspace/jetty/jetty-webapp-logging/src/test/resources/webapps/dummy-webapp-logging-java.war as handler
2009-09-21 04:46:32.157:DEBUG:org.eclipse.jetty.util.log:Container WebAppContext@18385e3@18385e3/dummy-webapp-logging-java,null,file:/srv/gump/public/workspace/jetty/jetty-webapp-logging/src/test/resources/webapps/dummy-webapp-logging-java.war + ErrorPageErrorHandler@1cb25f1 as error
2009-09-21 04:46:32.160:DEBUG:org.eclipse.jetty.util.log:Container ContextHandlerCollection@19616c7 + WebAppContext@2808b3@2808b3/dummy-webapp-logging-commons,null,file:/srv/gump/public/workspace/jetty/jetty-webapp-logging/src/test/resources/webapps/dummy-webapp-logging-commons.war as handler
2009-09-21 04:46:32.165:DEBUG:org.eclipse.jetty.util.log:Container WebAppContext@2808b3@2808b3/dummy-webapp-logging-commons,null,file:/srv/gump/public/workspace/jetty/jetty-webapp-logging/src/test/resources/webapps/dummy-webapp-logging-commons.war + ErrorPageErrorHandler@535b58 as error
2009-09-21 04:46:32.174:DEBUG:org.eclipse.jetty.util.log:Container ContextHandlerCollection@19616c7 + WebAppContext@922804@922804/dummy-webapp-logging-log4j,null,file:/srv/gump/public/workspace/jetty/jetty-webapp-logging/src/test/resources/webapps/dummy-webapp-logging-log4j.war as handler
2009-09-21 04:46:32.174:DEBUG:org.eclipse.jetty.util.log:Container WebAppContext@922804@922804/dummy-webapp-logging-log4j,null,file:/srv/gump/public/workspace/jetty/jetty-webapp-logging/src/test/resources/webapps/dummy-webapp-logging-log4j.war + ErrorPageErrorHandler@1815859 as error
2009-09-21 04:46:32.176:DEBUG:org.eclipse.jetty.util.log:Container ContextHandlerCollection@19616c7 + WebAppContext@cf40f5@cf40f5/dummy-webapp-logging-slf4j,null,file:/srv/gump/public/workspace/jetty/jetty-webapp-logging/src/test/resources/webapps/dummy-webapp-logging-slf4j.war as handler
2009-09-21 04:46:32.176:DEBUG:org.eclipse.jetty.util.log:Container WebAppContext@cf40f5@cf40f5/dummy-webapp-logging-slf4j,null,file:/srv/gump/public/workspace/jetty/jetty-webapp-logging/src/test/resources/webapps/dummy-webapp-logging-slf4j.war + ErrorPageErrorHandler@b1c260 as error
2009-09-21 04:46:32.177:DEBUG:org.eclipse.jetty.util.log:STARTED org.eclipse.jetty.deploy.WebAppDeployer@1037c71
2009-09-21 04:46:32.182:DEBUG:org.eclipse.jetty.util.log:Starting HashLoginService[Test Realm]
2009-09-21 04:46:32.183:DEBUG:org.eclipse.jetty.util.log:Load HashLoginService[Test Realm] from /srv/gump/public/workspace/jetty/jetty-webapp-logging/target/test-testAllRouting/etc/realm.properties
2009-09-21 04:46:32.208:DEBUG:org.eclipse.jetty.util.log:STARTED HashLoginService[Test Realm]
2009-09-21 04:46:32.209:DEBUG:org.eclipse.jetty.util.log:Starting org.eclipse.jetty.webapp.logging.CentralizedLogging@540408
GET: http://140.211.11.135:58118/dummy-webapp-logging-log4j/logging
GET: http://140.211.11.135:58118/dummy-webapp-logging-commons/logging
GET: http://140.211.11.135:58118/dummy-webapp-logging-slf4j/logging
GET: http://140.211.11.135:58118/dummy-webapp-logging-java/logging
Tests run: 1, Failures: 0, Errors: 1, Skipped: 0, Time elapsed: 62.995 sec <<< FAILURE!

Results :

Tests in error: 
  testAllRouting(org.eclipse.jetty.webapp.logging.CentralizedLoggingTest)

Tests run: 6, Failures: 0, Errors: 3, Skipped: 0

[INFO] ------------------------------------------------------------------------
[ERROR] BUILD FAILURE
[INFO] ------------------------------------------------------------------------
[INFO] There are test failures.

Please refer to /srv/gump/public/workspace/jetty/jetty-webapp-logging/target/surefire-reports for the individual test results.
[INFO] ------------------------------------------------------------------------
[INFO] For more information, run Maven with the -e switch
[INFO] ------------------------------------------------------------------------
[INFO] Total time: 7 minutes 5 seconds
[INFO] Finished at: Mon Sep 21 04:47:34 PDT 2009
[INFO] Final Memory: 37M/66M
[INFO] ------------------------------------------------------------------------
---------------------------------------------

To subscribe to this information via syndicated feeds:
- RSS: http://vmgump.apache.org/gump/public/jetty/jetty-test/rss.xml
- Atom: http://vmgump.apache.org/gump/public/jetty/jetty-test/atom.xml

============================== Gump Tracking Only ===
Produced by Gump version 2.3.
Gump Run 13000021092009, vmgump:vmgump-public:13000021092009
Gump E-mail Identifier (unique within run) #40.

*********************************************************** G U M P
[GUMP@vmgump]: Project commons-jci (in module apache-commons) failed
To whom it may engage...
        
This is an automated request, but not an unsolicited one. For 
more information please visit http://gump.apache.org/nagged.html, 
and/or contact the folk at general@gump.apache.org.

Project commons-jci has an issue affecting its community integration.
This issue affects 3 projects,
 and has been outstanding for 1203 runs.
The current state of this project is 'Failed', with reason 'Build Failed'.
For reference only, the following projects are affected by this:
    - commons-javaflow :  Commons Javaflow
    - commons-jci :  Commons JCI
    - commons-jci-test :  Apache Commons


Full details are available at:
    http://vmgump.apache.org/gump/public/apache-commons/commons-jci/index.html

That said, some information snippets are provided here.

The following annotations (debug/informational/warning/error messages) were provided:
 -DEBUG- Sole output [commons-jci-21092009.jar] identifier set to project name
 -DEBUG- (Gump generated) Maven2 Settings in: /srv/gump/public/workspace/apache-commons/jci/gump_mvn_settings.xml
 -INFO- Failed with reason build failed
 -DEBUG- Maven POM in: /srv/gump/public/workspace/apache-commons/jci/pom.xml
 -INFO- Failed to extract fallback artifacts from Gump Repository



The following work was performed:
http://vmgump.apache.org/gump/public/apache-commons/commons-jci/gump_work/build_apache-commons_commons-jci.html
Work Name: build_apache-commons_commons-jci (Type: Build)
Work ended in a state of : Failed
Elapsed: 48 secs
Command Line: mvn --batch-mode -Dmaven.test.skip.exec=true --settings /srv/gump/public/workspace/apache-commons/jci/gump_mvn_settings.xml package 
[Working Directory: /srv/gump/public/workspace/apache-commons/jci]
CLASSPATH: /usr/lib/jvm/java-6-sun/lib/tools.jar:/srv/gump/public/workspace/jakarta-bcel/target/bcel-5.3-SNAPSHOT.jar:/srv/gump/public/workspace/apache-commons/collections/target/commons-collections-3.3-SNAPSHOT.jar:/srv/gump/public/workspace/apache-commons/io/target/commons-io-21092009.jar:/srv/gump/public/workspace/apache-commons/lang/target/commons-lang-3.0-SNAPSHOT.jar:/srv/gump/public/workspace/apache-commons/logging/target/commons-logging-21092009.jar:/srv/gump/public/workspace/apache-commons/logging/target/commons-logging-api-21092009.jar:/srv/gump/packages/eclipse/plugins/org.eclipse.jdt.core_3.4.2/jdtcore.jar:/srv/gump/packages/jarjar/jarjar-0.6.jar:/srv/gump/public/workspace/asm/output/dist/lib/asm-analysis-21092009.jar:/srv/gump/public/workspace/asm/output/dist/lib/asm-util-21092009.jar:/srv/gump/public/workspace/asm/output/dist/lib/asm-xml-21092009.jar:/srv/gump/public/workspace/asm/output/dist/lib/asm-commons-21092009.jar:/srv/gump/public/workspace/asm/output/dis
 t/lib/asm-21092009.jar:/srv/gump/public/workspace/asm/output/dist/lib/asm-tree-21092009.jar:/srv/gump/packages/antlr/antlr-3.1.3.jar:/srv/gump/packages/groovy-1.0-jsr-03/groovy-1.0-jsr-03.jar:/srv/gump/packages/maven-cobertura-plugin/maven-cobertura-plugin-1.1.jar
---------------------------------------------
1K downloaded
Downloading: http://localhost:8192/maven2/asm/asm-attrs/2.2.1/asm-attrs-2.2.1.pom
1K downloaded
Downloading: http://localhost:8192/maven2/commons-io/commons-io/1.1/commons-io-1.1.pom
5K downloaded
Downloading: http://localhost:8192/maven2/asm/asm/2.2/asm-2.2.pom
807b downloaded
Downloading: http://localhost:8192/maven2/org/vafer/dependency/0.2/dependency-0.2.jar
17K downloaded
Downloading: http://localhost:8192/maven2/asm/asm-commons/2.2.1/asm-commons-2.2.1.jar
32K downloaded
Downloading: http://localhost:8192/maven2/asm/asm/2.2/asm-2.2.jar
42K downloaded
Downloading: http://localhost:8192/maven2/asm/asm-util/2.2.1/asm-util-2.2.1.jar
34K downloaded
Downloading: http://localhost:8192/maven2/asm/asm-analysis/2.2.1/asm-analysis-2.2.1.jar
17K downloaded
Downloading: http://localhost:8192/maven2/asm/asm-tree/2.2.1/asm-tree-2.2.1.jar
21K downloaded
Downloading: http://localhost:8192/maven2/asm/asm-attrs/2.2.1/asm-attrs-2.2.1.jar
6K downloaded
[INFO] [antrun:run {execution: javadoc.resources}]
[INFO] Executing tasks
[INFO] Executed tasks
[INFO] [resources:resources]
[WARNING] Using platform encoding (UTF-8 actually) to copy filtered resources, i.e. build is platform dependent!
[INFO] Copying 0 resource to META-INF
[INFO] [compiler:compile]
[INFO] Compiling 6 source files to /srv/gump/public/workspace/apache-commons/jci/compilers/javac/target/classes
[INFO] ------------------------------------------------------------------------
[ERROR] BUILD FAILURE
[INFO] ------------------------------------------------------------------------
[INFO] Compilation failure

/srv/gump/public/workspace/apache-commons/jci/compilers/javac/src/main/java/org/apache/commons/jci/compilers/JavacClassLoader.java:[108,46] cannot find symbol
symbol  : constructor ClassWriter(boolean,boolean)
location: class org.objectweb.asm.ClassWriter

/srv/gump/public/workspace/apache-commons/jci/compilers/javac/src/main/java/org/apache/commons/jci/compilers/JavacClassLoader.java:[109,44] cannot find symbol
symbol  : method accept(org.vafer.dependency.asm.RenamingVisitor,boolean)
location: class org.objectweb.asm.ClassReader


[INFO] ------------------------------------------------------------------------
[INFO] For more information, run Maven with the -e switch
[INFO] ------------------------------------------------------------------------
[INFO] Total time: 47 seconds
[INFO] Finished at: Mon Sep 21 05:04:32 PDT 2009
[INFO] Final Memory: 41M/74M
[INFO] ------------------------------------------------------------------------
---------------------------------------------

To subscribe to this information via syndicated feeds:
- RSS: http://vmgump.apache.org/gump/public/apache-commons/commons-jci/rss.xml
- Atom: http://vmgump.apache.org/gump/public/apache-commons/commons-jci/atom.xml

============================== Gump Tracking Only ===
Produced by Gump version 2.3.
Gump Run 13000021092009, vmgump:vmgump-public:13000021092009
Gump E-mail Identifier (unique within run) #46.

*********************************************************** G U M P
[GUMP@vmgump]: Module turbine-fulcrum success, but with warnings.
To whom it may engage...
        
This is an automated request, but not an unsolicited one. For 
more information please visit http://gump.apache.org/nagged.html, 
and/or contact the folk at general@gump.apache.org.

Module turbine-fulcrum contains errors.
The current state of this module is 'Success'.

Full details are available at:
    http://vmgump.apache.org/gump/public/turbine-fulcrum/index.html

That said, some information snippets are provided here.

The following annotations (debug/informational/warning/error messages) were provided:
 -ERROR- *** Failed to update from source control.Stale contents ***



The following work was performed:
http://vmgump.apache.org/gump/public/turbine-fulcrum/gump_work/update_turbine-fulcrum.html
Work Name: update_turbine-fulcrum (Type: Update)
Work ended in a state of : Failed
Elapsed: 55 secs
Command Line: svn --quiet update --non-interactive turbine-fulcrum 
[Working Directory: /srv/gump/public/workspace/cvs]
---------------------------------------------
svn: Could not open the requested SVN filesystem
---------------------------------------------

To subscribe to this information via syndicated feeds:
- RSS: http://vmgump.apache.org/gump/public/turbine-fulcrum/rss.xml
- Atom: http://vmgump.apache.org/gump/public/turbine-fulcrum/atom.xml

============================== Gump Tracking Only ===
Produced by Gump version 2.3.
Gump Run 13000021092009, vmgump:vmgump-public:13000021092009
Gump E-mail Identifier (unique within run) #47.

*********************************************************** G U M P
[GUMP@vmgump]: Project invicta (in module invicta) failed
To whom it may engage...
        
This is an automated request, but not an unsolicited one. For 
more information please visit http://gump.apache.org/nagged.html, 
and/or contact the folk at general@gump.apache.org.

Project invicta has an issue affecting its community integration.
This issue affects 1 projects,
 and has been outstanding for 13 runs.
The current state of this project is 'Failed', with reason 'Build Failed'.
For reference only, the following projects are affected by this:
    - invicta :  Open-source build management tool.


Full details are available at:
    http://vmgump.apache.org/gump/public/invicta/invicta/index.html

That said, some information snippets are provided here.

The following annotations (debug/informational/warning/error messages) were provided:
 -DEBUG- Sole output [invicta-21092009.jar] identifier set to project name
 -DEBUG- Dependency on ant exists, no need to add for property ant.home.
 -INFO- Failed with reason build failed
 -INFO- Failed to extract fallback artifacts from Gump Repository



The following work was performed:
http://vmgump.apache.org/gump/public/invicta/invicta/gump_work/build_invicta_invicta.html
Work Name: build_invicta_invicta (Type: Build)
Work ended in a state of : Failed
Elapsed: 4 secs
Command Line: /usr/lib/jvm/java-6-sun/bin/java -Djava.awt.headless=true -Xbootclasspath/p:/srv/gump/public/workspace/xml-commons/java/external/build/xml-apis.jar:/srv/gump/public/workspace/xml-xerces2/build/xercesImpl.jar org.apache.tools.ant.Main -Dgump.merge=/srv/gump/public/gump/work/merge.xml -Dbuild.sysclasspath=only -Dant.home=/srv/gump/public/workspace/ant/dist -Dinvicta.jar.file=invicta-21092009.jar pack 
[Working Directory: /srv/gump/public/workspace/invicta]
CLASSPATH: /usr/lib/jvm/java-6-sun/lib/tools.jar:/srv/gump/public/workspace/invicta/target/antclasses:/srv/gump/public/workspace/ant/dist/lib/ant-jmf.jar:/srv/gump/public/workspace/ant/dist/lib/ant-swing.jar:/srv/gump/public/workspace/ant/dist/lib/ant-apache-resolver.jar:/srv/gump/public/workspace/ant/dist/lib/ant-apache-xalan2.jar:/srv/gump/public/workspace/ant/dist/lib/ant-trax.jar:/srv/gump/public/workspace/ant/dist/lib/ant-junit.jar:/srv/gump/public/workspace/ant/dist/lib/ant-launcher.jar:/srv/gump/public/workspace/ant/dist/lib/ant-nodeps.jar:/srv/gump/public/workspace/ant/dist/lib/ant.jar:/srv/gump/public/workspace/ant-contrib/target/ant-contrib-21092009.jar:/srv/gump/public/workspace/jakarta-bcel/target/bcel-5.3-SNAPSHOT.jar:/srv/gump/public/workspace/apache-commons/logging/target/commons-logging-21092009.jar:/srv/gump/public/workspace/apache-commons/logging/target/commons-logging-api-21092009.jar:/srv/gump/public/workspace/apache-commons/digester/dist/commons-digester.
 jar:/srv/gump/public/workspace/apache-commons/lang/target/commons-lang-3.0-SNAPSHOT.jar:/srv/gump/public/workspace/apache-commons/beanutils/dist/commons-beanutils-21092009.jar:/srv/gump/public/workspace/apache-commons/collections/target/commons-collections-3.3-SNAPSHOT.jar:/srv/gump/public/workspace/xml-commons/java/external/build/xml-apis-ext.jar
---------------------------------------------
    [javac] 	                               ^
    [javac] /srv/gump/public/workspace/invicta/src/java/net/sf/invicta/type/TypeDefinition.java:26: cannot find symbol
    [javac] symbol  : class SequencedHashMap
    [javac] location: class net.sf.invicta.type.TypeDefinition
    [javac] 	private Map targetTemplates = new SequencedHashMap();
    [javac] 	                                  ^
    [javac] /srv/gump/public/workspace/invicta/src/java/net/sf/invicta/type/TypeDefinition.java:29: cannot find symbol
    [javac] symbol  : class SequencedHashMap
    [javac] location: class net.sf.invicta.type.TypeDefinition
    [javac] 	private Map definedProperties = new SequencedHashMap();
    [javac] 	                                    ^
    [javac] /srv/gump/public/workspace/invicta/src/java/net/sf/invicta/type/TypeDefinition.java:31: cannot find symbol
    [javac] symbol  : class SequencedHashMap
    [javac] location: class net.sf.invicta.type.TypeDefinition
    [javac] 	private Map actualTargetTemplates = new SequencedHashMap();
    [javac] 	                                        ^
    [javac] /srv/gump/public/workspace/invicta/src/java/net/sf/invicta/type/TypeDefinition.java:32: cannot find symbol
    [javac] symbol  : class SequencedHashMap
    [javac] location: class net.sf.invicta.type.TypeDefinition
    [javac] 	private Map actualDefinedProperties = new SequencedHashMap();
    [javac] 	                                          ^
    [javac] /srv/gump/public/workspace/invicta/src/java/net/sf/invicta/type/TypeDefinition.java:292: cannot find symbol
    [javac] symbol  : class SequencedHashMap
    [javac] location: class net.sf.invicta.type.TypeDefinition
    [javac] 			parentDefinedProperties.add(new SequencedHashMap(oneType.getDefinedProperties()));
    [javac] 			                                ^
    [javac] /srv/gump/public/workspace/invicta/src/java/net/sf/invicta/type/TypeDefinition.java:293: cannot find symbol
    [javac] symbol  : class SequencedHashMap
    [javac] location: class net.sf.invicta.type.TypeDefinition
    [javac] 			parentTargetTemplates.add(new SequencedHashMap(oneType.getTargetTemplates()));
    [javac] 			                              ^
    [javac] /srv/gump/public/workspace/invicta/src/java/net/sf/invicta/process/TypedComponent.java:34: cannot find symbol
    [javac] symbol  : class SequencedHashMap
    [javac] location: class net.sf.invicta.process.TypedComponent
    [javac] 	protected Map definedProperties = new SequencedHashMap();	
    [javac] 	                                      ^
    [javac] /srv/gump/public/workspace/invicta/src/java/net/sf/invicta/project/ProductContainerImpl.java:25: cannot find symbol
    [javac] symbol  : class SequencedHashMap
    [javac] location: class net.sf.invicta.project.ProductContainerImpl
    [javac] 	protected Map products = new SequencedHashMap();
    [javac] 	                             ^
    [javac] Note: Some input files use unchecked or unsafe operations.
    [javac] Note: Recompile with -Xlint:unchecked for details.
    [javac] 20 errors
    [javac] 2 warnings

BUILD FAILED
/srv/gump/public/workspace/invicta/build.xml:147: Compile failed; see the compiler error output for details.

Total time: 3 seconds
---------------------------------------------

To subscribe to this information via syndicated feeds:
- RSS: http://vmgump.apache.org/gump/public/invicta/invicta/rss.xml
- Atom: http://vmgump.apache.org/gump/public/invicta/invicta/atom.xml

============================== Gump Tracking Only ===
Produced by Gump version 2.3.
Gump Run 13000021092009, vmgump:vmgump-public:13000021092009
Gump E-mail Identifier (unique within run) #48.

*********************************************************** G U M P
[GUMP@vmgump]: Project ws-commons-axiom-test (in module ws-axis2-commons) failed
To whom it may engage...
        
This is an automated request, but not an unsolicited one. For 
more information please visit http://gump.apache.org/nagged.html, 
and/or contact the folk at general@gump.apache.org.

Project ws-commons-axiom-test has an issue affecting its community integration.
This issue affects 1 projects,
 and has been outstanding for 39 runs.
The current state of this project is 'Failed', with reason 'Build Failed'.
For reference only, the following projects are affected by this:
    - ws-commons-axiom-test :  Common stuff for the WS projects.


Full details are available at:
    http://vmgump.apache.org/gump/public/ws-axis2-commons/ws-commons-axiom-test/index.html

That said, some information snippets are provided here.

The following annotations (debug/informational/warning/error messages) were provided:
 -WARNING- Overriding Maven2 settings: [/srv/gump/public/workspace/ws-axis2-commons/axiom/gump_mvn_settings.xml]
 -DEBUG- (Gump generated) Maven2 Settings in: /srv/gump/public/workspace/ws-axis2-commons/axiom/gump_mvn_settings.xml
 -INFO- Failed with reason build failed
 -DEBUG- Maven POM in: /srv/gump/public/workspace/ws-axis2-commons/axiom/pom.xml



The following work was performed:
http://vmgump.apache.org/gump/public/ws-axis2-commons/ws-commons-axiom-test/gump_work/build_ws-axis2-commons_ws-commons-axiom-test.html
Work Name: build_ws-axis2-commons_ws-commons-axiom-test (Type: Build)
Work ended in a state of : Failed
Elapsed: 2 mins 13 secs
Command Line: mvn --batch-mode --settings /srv/gump/public/workspace/ws-axis2-commons/axiom/gump_mvn_settings.xml package 
[Working Directory: /srv/gump/public/workspace/ws-axis2-commons/axiom]
CLASSPATH: /usr/lib/jvm/java-6-sun/lib/tools.jar:/srv/gump/public/workspace/ws-axis2-commons/axiom/modules/axiom-impl/target/axiom-impl-1.2.9-SNAPSHOT.jar:/srv/gump/public/workspace/ws-axis2-commons/axiom/modules/axiom-api/target/axiom-api-1.2.9-SNAPSHOT.jar:/srv/gump/public/workspace/ws-axis2-commons/axiom/modules/axiom-dom/target/axiom-dom-1.2.9-SNAPSHOT.jar
---------------------------------------------
Sep 21, 2009 5:29:06 AM org.apache.axiom.om.impl.OMStAXWrapper getDataHandler
WARNING: Invalid usage of OMStAXWrapper#getDataHandler(String): the argument must be a content ID, not an href; see OMAttachmentAccessor.
<purchase-order xmlns="http://openuri.org/easypo"Skipping compare because of lossy image i/o [48006][47999]
Skipping compare because of lossy image i/o [4944][13887]
Skipping compare because of lossy image i/o [4944][13887]
Sep 21, 2009 5:29:08 AM org.apache.axiom.util.blob.OverflowBlob finalize
WARNING: Cleaning up unreleased temporary file /tmp/test32290.dat
Sep 21, 2009 5:29:08 AM org.apache.axiom.util.blob.OverflowBlob finalize
WARNING: Cleaning up unreleased temporary file /tmp/test32291.dat
Sep 21, 2009 5:29:16 AM org.apache.axiom.util.stax.dialect.StAXDialectDetector detectDialect
INFO: Detected StAX dialect: BEA
<?xml version="1.0" encoding="UTF-8"?><bar xmlns="http://foo">test</bar>
after - '<root xmlns="http://custom.com"><node xmlns:cust="http://custom.com" cust:id="123"></node></root>'
Sep 21, 2009 5:29:21 AM org.apache.axiom.om.impl.llom.OMSourcedElementImpl forceExpand
SEVERE: forceExpand: expected element name DUMMYNAME, found library
Sep 21, 2009 5:29:21 AM org.apache.axiom.om.impl.llom.OMSourcedElementImpl forceExpand
SEVERE: forceExpand: expected element name DUMMYNAME, found library
Sep 21, 2009 5:29:21 AM org.apache.axiom.om.impl.llom.OMSourcedElementImpl forceExpand
SEVERE: forceExpand: expected element name DUMMYNAME, found library
Sep 21, 2009 5:29:21 AM org.apache.axiom.om.impl.OMStAXWrapper getDataHandler
WARNING: Invalid usage of OMStAXWrapper#getDataHandler(String): the argument must be a content ID, not an href; see OMAttachmentAccessor.
Skipping compare because of lossy image i/o [48006][47999]
Skipping compare because of lossy image i/o [4944][13887]
Skipping compare because of lossy image i/o [4944][13887]
Sep 21, 2009 5:29:23 AM org.apache.axiom.util.blob.OverflowBlob finalize
WARNING: Cleaning up unreleased temporary file /tmp/test32323.dat
Sep 21, 2009 5:29:23 AM org.apache.axiom.util.blob.OverflowBlob finalize
WARNING: Cleaning up unreleased temporary file /tmp/test32322.dat
Tests run: 3500, Failures: 1, Errors: 0, Skipped: 0, Time elapsed: 74.078 sec <<< FAILURE!

Results :

Failed tests: 
  testCreateXMLStreamWriterIsThreadSafe(org.apache.axiom.om.util.StAXUtilsTest)

Tests run: 3500, Failures: 1, Errors: 0, Skipped: 0

[INFO] ------------------------------------------------------------------------
[ERROR] BUILD FAILURE
[INFO] ------------------------------------------------------------------------
[INFO] There are test failures.

Please refer to /srv/gump/public/workspace/ws-axis2-commons/axiom/modules/axiom-parser-tests/target/surefire-reports for the individual test results.
[INFO] ------------------------------------------------------------------------
[INFO] For more information, run Maven with the -e switch
[INFO] ------------------------------------------------------------------------
[INFO] Total time: 2 minutes 11 seconds
[INFO] Finished at: Mon Sep 21 05:29:37 PDT 2009
[INFO] Final Memory: 38M/69M
[INFO] ------------------------------------------------------------------------
---------------------------------------------

To subscribe to this information via syndicated feeds:
- RSS: http://vmgump.apache.org/gump/public/ws-axis2-commons/ws-commons-axiom-test/rss.xml
- Atom: http://vmgump.apache.org/gump/public/ws-axis2-commons/ws-commons-axiom-test/atom.xml

============================== Gump Tracking Only ===
Produced by Gump version 2.3.
Gump Run 13000021092009, vmgump:vmgump-public:13000021092009
Gump E-mail Identifier (unique within run) #49.

*********************************************************** G U M P
[GUMP@vmgump]: Project ws-axis2 (in module ws-axis2) failed
To whom it may engage...
        
This is an automated request, but not an unsolicited one. For 
more information please visit http://gump.apache.org/nagged.html, 
and/or contact the folk at general@gump.apache.org.

Project ws-axis2 has an issue affecting its community integration.
This issue affects 3 projects,
 and has been outstanding for 25 runs.
The current state of this project is 'Failed', with reason 'Build Failed'.
For reference only, the following projects are affected by this:
    - ws-axis2 :  Apache Axis2 SOAP Stack
    - ws-juddi :  ws-juddi -- UDDI Toolkit/Repository
    - ws-juddi-test :  ws-juddi -- UDDI Toolkit/Repository


Full details are available at:
    http://vmgump.apache.org/gump/public/ws-axis2/ws-axis2/index.html

That said, some information snippets are provided here.

The following annotations (debug/informational/warning/error messages) were provided:
 -DEBUG- Sole output [ws-axis2-21092009] identifier set to project name
 -DEBUG- (Gump generated) Maven Properties in: /srv/gump/public/workspace/ws-axis2/build.properties
 -INFO- Failed with reason build failed
 -INFO- Failed to extract fallback artifacts from Gump Repository



The following work was performed:
http://vmgump.apache.org/gump/public/ws-axis2/ws-axis2/gump_work/build_ws-axis2_ws-axis2.html
Work Name: build_ws-axis2_ws-axis2 (Type: Build)
Work ended in a state of : Failed
Elapsed: 2 secs
Command Line: maven --offline jar 
[Working Directory: /srv/gump/public/workspace/ws-axis2]
CLASSPATH: /usr/lib/jvm/java-6-sun/lib/tools.jar:/srv/gump/public/workspace/annogen/build/distribution/annogen-21092009.jar:/srv/gump/public/workspace/httpcomponents/oac.hc3x/dist/commons-httpclient.jar:/srv/gump/packages/dougLea/concurrent.jar:/srv/gump/public/workspace/jakarta-servletapi/dist/lib/servlet.jar:/srv/gump/public/workspace/logging-log4j-12/dist/lib/log4j-21092009.jar:/srv/gump/packages/stax/jsr173_1.0_api.jar:/srv/gump/packages/stax/jsr173_1.0_ri.jar:/srv/gump/public/workspace/ws-axis2-commons/axiom/modules/axiom-impl/target/axiom-impl-1.2.9-SNAPSHOT.jar:/srv/gump/public/workspace/ws-axis2-commons/axiom/modules/axiom-api/target/axiom-api-1.2.9-SNAPSHOT.jar:/srv/gump/public/workspace/ws-axis2-commons/axiom/modules/axiom-dom/target/axiom-dom-1.2.9-SNAPSHOT.jar:/srv/gump/public/workspace/ws-axis2-commons/neethi/target/neethi-3.0.0-SNAPSHOT.jar:/srv/gump/public/workspace/ws-axis2-commons/XmlSchema/target/XmlSchema-2.0-SNAPSHOT.jar:/srv/gump/public/workspace/wsdl4j/b
 uild/lib/qname.jar:/srv/gump/public/workspace/wsdl4j/build/lib/wsdl4j.jar:/srv/gump/public/workspace/xml-xmlbeans/build/lib/xbean_xpath.jar:/srv/gump/public/workspace/xml-xmlbeans/build/lib/xmlpublic.jar:/srv/gump/public/workspace/xml-xmlbeans/build/lib/xbean.jar:/srv/gump/public/workspace/xml-commons/java/external/build/xml-apis-ext.jar:/srv/gump/public/workspace/xml-security/build/xmlsec-21092009.jar:/srv/gump/packages/jaf-1.1ea/activation.jar:/srv/gump/packages/javamail-1.4/mail.jar:/srv/gump/packages/javamail-1.4/lib/mailapi.jar:/srv/gump/public/workspace/jaxen/target/jaxen-21092009.jar:/srv/gump/packages/jsse1.0.3/lib/jcert.jar:/srv/gump/packages/jsse1.0.3/lib/jnet.jar:/srv/gump/packages/jsse1.0.3/lib/jsse.jar:/srv/gump/packages/jms1.1/lib/jms.jar
---------------------------------------------
 __  __
|  \/  |__ _Apache__ ___
| |\/| / _` \ V / -_) ' \  ~ intelligent projects ~
|_|  |_\__,_|\_/\___|_||_|  v. 1.0.2

build:start:

java:prepare-filesystem:
    [mkdir] Created dir: /srv/gump/public/workspace/ws-axis2/target/classes

java:compile:
    [echo] Compiling to /srv/gump/public/workspace/ws-axis2/target/classes
    [echo] No java source files to compile.
resources or todir was null

java:jar-resources:

test:prepare-filesystem:
    [mkdir] Created dir: /srv/gump/public/workspace/ws-axis2/target/test-classes
    [mkdir] Created dir: /srv/gump/public/workspace/ws-axis2/target/test-reports

test:test-resources:

test:compile:
    [echo] No test source files to compile.

test:test:
    [echo] No tests to run.

BUILD FAILED
File...... /home/gump/.maven/cache/maven-jar-plugin-1.6.1/plugin.jelly
Element... ant:fail
Line...... 53
Column.... 19
You must define currentVersion in your POM.
Total time: 2 seconds
Finished at: Mon Sep 21 05:53:23 PDT 2009

---------------------------------------------

To subscribe to this information via syndicated feeds:
- RSS: http://vmgump.apache.org/gump/public/ws-axis2/ws-axis2/rss.xml
- Atom: http://vmgump.apache.org/gump/public/ws-axis2/ws-axis2/atom.xml

============================== Gump Tracking Only ===
Produced by Gump version 2.3.
Gump Run 13000021092009, vmgump:vmgump-public:13000021092009
Gump E-mail Identifier (unique within run) #51.

*********************************************************** G U M P
[GUMP@vmgump]: Project kerberos-common (in module kerberos-shared) failed
To whom it may engage...
        
This is an automated request, but not an unsolicited one. For 
more information please visit http://gump.apache.org/nagged.html, 
and/or contact the folk at general@gump.apache.org.

Project kerberos-common has an issue affecting its community integration.
This issue affects 2 projects,
 and has been outstanding for 36 runs.
The current state of this project is 'Failed', with reason 'Build Failed'.
For reference only, the following projects are affected by this:
    - kerberos-common :  Apache Directory Project
    - kerberos-protocol :  Apache Kerberos Server


Full details are available at:
    http://vmgump.apache.org/gump/public/kerberos-shared/kerberos-common/index.html

That said, some information snippets are provided here.

The following annotations (debug/informational/warning/error messages) were provided:
 -DEBUG- Sole output [kerberos-common-21092009.jar] identifier set to project name
 -DEBUG- (Gump generated) Maven2 Settings in: /srv/gump/public/workspace/kerberos-shared/gump_mvn_settings.xml
 -INFO- Failed with reason build failed
 -DEBUG- Maven POM in: /srv/gump/public/workspace/kerberos-shared/pom.xml
 -INFO- Project Reports in: /srv/gump/public/workspace/kerberos-shared/common/target/test-reports
 -WARNING- No directory [/srv/gump/public/workspace/kerberos-shared/common/target/test-reports]
 -INFO- Failed to extract fallback artifacts from Gump Repository



The following work was performed:
http://vmgump.apache.org/gump/public/kerberos-shared/kerberos-common/gump_work/build_kerberos-shared_kerberos-common.html
Work Name: build_kerberos-shared_kerberos-common (Type: Build)
Work ended in a state of : Failed
Elapsed: 1 sec
Command Line: mvn --batch-mode --settings /srv/gump/public/workspace/kerberos-shared/gump_mvn_settings.xml package 
[Working Directory: /srv/gump/public/workspace/kerberos-shared]
CLASSPATH: /usr/lib/jvm/java-6-sun/lib/tools.jar:/srv/gump/public/workspace/directory-shared/asn1/target/shared-asn1-0.9.16-SNAPSHOT.jar:/srv/gump/packages/bouncycastle-jdk14/bcprov-130.jar:/srv/gump/public/workspace/directory-shared/ldap/target/shared-ldap-0.9.16-SNAPSHOT.jar
---------------------------------------------
	at org.apache.maven.cli.MavenCli.main(MavenCli.java:301)
	at sun.reflect.NativeMethodAccessorImpl.invoke0(Native Method)
	at sun.reflect.NativeMethodAccessorImpl.invoke(NativeMethodAccessorImpl.java:39)
	at sun.reflect.DelegatingMethodAccessorImpl.invoke(DelegatingMethodAccessorImpl.java:25)
	at java.lang.reflect.Method.invoke(Method.java:597)
	at org.codehaus.classworlds.Launcher.launchEnhanced(Launcher.java:315)
	at org.codehaus.classworlds.Launcher.launch(Launcher.java:255)
	at org.codehaus.classworlds.Launcher.mainWithExitCode(Launcher.java:430)
	at org.codehaus.classworlds.Launcher.main(Launcher.java:375)
Caused by: org.apache.maven.project.ProjectBuildingException: Cannot find parent: org.apache.directory.server:apacheds-parent for project: null:apacheds-kerberos-shared:jar:null for project null:apacheds-kerberos-shared:jar:null
	at org.apache.maven.project.DefaultMavenProjectBuilder.assembleLineage(DefaultMavenProjectBuilder.java:1369)
	at org.apache.maven.project.DefaultMavenProjectBuilder.buildInternal(DefaultMavenProjectBuilder.java:820)
	at org.apache.maven.project.DefaultMavenProjectBuilder.buildFromSourceFileInternal(DefaultMavenProjectBuilder.java:505)
	at org.apache.maven.project.DefaultMavenProjectBuilder.build(DefaultMavenProjectBuilder.java:197)
	at org.apache.maven.DefaultMaven.getProject(DefaultMaven.java:583)
	at org.apache.maven.DefaultMaven.collectProjects(DefaultMaven.java:461)
	at org.apache.maven.DefaultMaven.getProjects(DefaultMaven.java:365)
	... 11 more
Caused by: org.apache.maven.project.ProjectBuildingException: POM 'org.apache.directory.server:apacheds-parent' not found in repository: Unable to download the artifact from any repository

  org.apache.directory.server:apacheds-parent:pom:1.5.6-SNAPSHOT

from the specified remote repositories:
  gump-central (http://localhost:8192/maven2)

 for project org.apache.directory.server:apacheds-parent
	at org.apache.maven.project.DefaultMavenProjectBuilder.findModelFromRepository(DefaultMavenProjectBuilder.java:602)
	at org.apache.maven.project.DefaultMavenProjectBuilder.assembleLineage(DefaultMavenProjectBuilder.java:1365)
	... 17 more
Caused by: org.apache.maven.artifact.resolver.ArtifactNotFoundException: Unable to download the artifact from any repository

  org.apache.directory.server:apacheds-parent:pom:1.5.6-SNAPSHOT

from the specified remote repositories:
  gump-central (http://localhost:8192/maven2)


	at org.apache.maven.artifact.resolver.DefaultArtifactResolver.resolve(DefaultArtifactResolver.java:212)
	at org.apache.maven.artifact.resolver.DefaultArtifactResolver.resolve(DefaultArtifactResolver.java:74)
	at org.apache.maven.project.DefaultMavenProjectBuilder.findModelFromRepository(DefaultMavenProjectBuilder.java:555)
	... 18 more
Caused by: org.apache.maven.wagon.ResourceDoesNotExistException: Unable to download the artifact from any repository
	at org.apache.maven.artifact.manager.DefaultWagonManager.getArtifact(DefaultWagonManager.java:332)
	at org.apache.maven.artifact.resolver.DefaultArtifactResolver.resolve(DefaultArtifactResolver.java:200)
	... 20 more
[INFO] ------------------------------------------------------------------------
[INFO] Total time: < 1 second
[INFO] Finished at: Mon Sep 21 05:58:11 PDT 2009
[INFO] Final Memory: 1M/4M
[INFO] ------------------------------------------------------------------------
---------------------------------------------

To subscribe to this information via syndicated feeds:
- RSS: http://vmgump.apache.org/gump/public/kerberos-shared/kerberos-common/rss.xml
- Atom: http://vmgump.apache.org/gump/public/kerberos-shared/kerberos-common/atom.xml

============================== Gump Tracking Only ===
Produced by Gump version 2.3.
Gump Run 13000021092009, vmgump:vmgump-public:13000021092009
Gump E-mail Identifier (unique within run) #52.

*********************************************************** G U M P
[GUMP@vmgump]: Project naming-config-test (in module directory-naming) failed
To whom it may engage...
        
This is an automated request, but not an unsolicited one. For 
more information please visit http://gump.apache.org/nagged.html, 
and/or contact the folk at general@gump.apache.org.

Project naming-config-test has an issue affecting its community integration.
This issue affects 1 projects,
 and has been outstanding for 13 runs.
The current state of this project is 'Failed', with reason 'Build Failed'.
For reference only, the following projects are affected by this:
    - naming-config-test :  Apache Directory Naming Component


Full details are available at:
    http://vmgump.apache.org/gump/public/directory-naming/naming-config-test/index.html

That said, some information snippets are provided here.

The following annotations (debug/informational/warning/error messages) were provided:
 -WARNING- Overriding Maven properties: [/srv/gump/public/workspace/directory-naming/naming-config/build.properties]
 -DEBUG- (Gump generated) Maven Properties in: /srv/gump/public/workspace/directory-naming/naming-config/build.properties
 -INFO- Failed with reason build failed
 -DEBUG- Maven POM in: /srv/gump/public/workspace/directory-naming/naming-config/project.xml
 -DEBUG- Maven project properties in: /srv/gump/public/workspace/directory-naming/naming-config/project.properties
 -INFO- Project Reports in: /srv/gump/public/workspace/directory-naming/naming-config/target/test-reports



The following work was performed:
http://vmgump.apache.org/gump/public/directory-naming/naming-config-test/gump_work/build_directory-naming_naming-config-test.html
Work Name: build_directory-naming_naming-config-test (Type: Build)
Work ended in a state of : Failed
Elapsed: 5 secs
Command Line: maven --offline test 
[Working Directory: /srv/gump/public/workspace/directory-naming/naming-config]
CLASSPATH: /usr/lib/jvm/java-6-sun/lib/tools.jar:/srv/gump/public/workspace/apache-commons/beanutils/dist/commons-beanutils-21092009.jar:/srv/gump/public/workspace/apache-commons/collections/target/commons-collections-3.3-SNAPSHOT.jar:/srv/gump/public/workspace/apache-commons/dbcp/dist/commons-dbcp.jar:/srv/gump/public/workspace/apache-commons/digester/dist/commons-digester.jar:/srv/gump/public/workspace/apache-commons/lang/target/commons-lang-3.0-SNAPSHOT.jar:/srv/gump/public/workspace/apache-commons/logging/target/commons-logging-21092009.jar:/srv/gump/public/workspace/apache-commons/logging/target/commons-logging-api-21092009.jar:/srv/gump/public/workspace/apache-commons/pool/dist/commons-pool.jar:/srv/gump/public/workspace/hsqldb/lib/hsqldb.jar:/srv/gump/public/workspace/junit/dist/junit-21092009.jar:/srv/gump/public/workspace/directory-naming/naming-config/target/naming-config-21092009.jar:/srv/gump/public/workspace/directory-naming/naming-core/target/naming-core-2109200
 9.jar:/srv/gump/public/workspace/directory-naming/naming-factory/target/naming-factory-21092009.jar:/srv/gump/public/workspace/directory-naming/naming-java/target/naming-java-21092009.jar:/srv/gump/packages/maven-site-plugin/maven-site-plugin-1.6.1.jar
---------------------------------------------
 __  __
|  \/  |__ _Apache__ ___
| |\/| / _` \ V / -_) ' \  ~ intelligent projects ~
|_|  |_\__,_|\_/\___|_||_|  v. 1.0.2

You are working offline so the build will continue, but naming-core-0.9-SNAPSHOT.jar may be out of date!
You are working offline so the build will continue, but naming-factory-0.9-SNAPSHOT.jar may be out of date!
You are working offline so the build will continue, but naming-java-0.9-SNAPSHOT.jar may be out of date!
build:start:

java:prepare-filesystem:

java:compile:
    [echo] Compiling to /srv/gump/public/workspace/directory-naming/naming-config/target/classes

java:jar-resources:

test:prepare-filesystem:

test:test-resources:
Copying 5 files to /srv/gump/public/workspace/directory-naming/naming-config/target/test-classes

test:compile:
    [javac] Compiling 1 source file to /srv/gump/public/workspace/directory-naming/naming-config/target/test-classes

test:test:
    [junit] Running org.apache.naming.config.XmlConfiguratorTest
    [junit] Tests run: 5, Failures: 0, Errors: 5, Time elapsed: 0.504 sec
    [junit] [ERROR] TEST org.apache.naming.config.XmlConfiguratorTest FAILED

BUILD FAILED
File...... /home/gump/.maven/cache/maven-test-plugin-1.6.2/plugin.jelly
Element... fail
Line...... 181
Column.... 54
There were test failures.
Total time: 5 seconds
Finished at: Mon Sep 21 05:58:18 PDT 2009

---------------------------------------------

To subscribe to this information via syndicated feeds:
- RSS: http://vmgump.apache.org/gump/public/directory-naming/naming-config-test/rss.xml
- Atom: http://vmgump.apache.org/gump/public/directory-naming/naming-config-test/atom.xml

============================== Gump Tracking Only ===
Produced by Gump version 2.3.
Gump Run 13000021092009, vmgump:vmgump-public:13000021092009
Gump E-mail Identifier (unique within run) #53.

*********************************************************** G U M P
[GUMP@vmgump]: Project tapestry (in module tapestry) failed
To whom it may engage...
        
This is an automated request, but not an unsolicited one. For 
more information please visit http://gump.apache.org/nagged.html, 
and/or contact the folk at general@gump.apache.org.

Project tapestry has an issue affecting its community integration.
This issue affects 1 projects,
 and has been outstanding for 1183 runs.
The current state of this project is 'Failed', with reason 'Build Failed'.
For reference only, the following projects are affected by this:
    - tapestry :  Component-based web application framework organized around i...


Full details are available at:
    http://vmgump.apache.org/gump/public/tapestry/tapestry/index.html

That said, some information snippets are provided here.

The following annotations (debug/informational/warning/error messages) were provided:
 -DEBUG- Sole output [tapestry-21092009.jar] identifier set to project name
 -DEBUG- (Gump generated) Maven2 Settings in: /srv/gump/public/workspace/tapestry/gump_mvn_settings.xml
 -INFO- Failed with reason build failed
 -DEBUG- Maven POM in: /srv/gump/public/workspace/tapestry/pom.xml
 -INFO- Failed to extract fallback artifacts from Gump Repository



The following work was performed:
http://vmgump.apache.org/gump/public/tapestry/tapestry/gump_work/build_tapestry_tapestry.html
Work Name: build_tapestry_tapestry (Type: Build)
Work ended in a state of : Failed
Elapsed: 2 mins 17 secs
Command Line: mvn --batch-mode --settings /srv/gump/public/workspace/tapestry/gump_mvn_settings.xml package 
[Working Directory: /srv/gump/public/workspace/tapestry]
CLASSPATH: /usr/lib/jvm/java-6-sun/lib/tools.jar:/srv/gump/public/workspace/apache-commons/beanutils/dist/commons-beanutils-21092009.jar:/srv/gump/public/workspace/apache-commons/codec/dist/commons-codec-21092009.jar:/srv/gump/public/workspace/apache-commons/digester/dist/commons-digester.jar:/srv/gump/public/workspace/apache-commons/fileupload/target/commons-fileupload-21092009.jar:/srv/gump/public/workspace/apache-commons/io/target/commons-io-21092009.jar:/srv/gump/public/workspace/apache-commons/lang/target/commons-lang-3.0-SNAPSHOT.jar:/srv/gump/public/workspace/apache-commons/logging/target/commons-logging-21092009.jar:/srv/gump/public/workspace/apache-commons/logging/target/commons-logging-api-21092009.jar:/srv/gump/public/workspace/jakarta-oro/jakarta-oro-21092009.jar:/srv/gump/public/workspace/jakarta-servletapi-4/lib/servlet.jar:/srv/gump/public/workspace/javassist/javassist.jar:/srv/gump/public/workspace/jdom/build/jdom.jar:/srv/gump/public/workspace/logging-log4j-1
 2/dist/lib/log4j-21092009.jar:/srv/gump/packages/ognl-2.6.7/ognl-2.6.7.jar:/srv/gump/public/workspace/xml-commons/java/external/build/xml-apis-ext.jar
---------------------------------------------
location: class org.apache.tapestry.services.impl.HiveMindExpressionCompiler

/srv/gump/public/workspace/tapestry/tapestry-framework/src/java/org/apache/tapestry/services/impl/HiveMindExpressionCompiler.java:[425,21] cannot find symbol
symbol  : method getRootExpression(ognl.Node,java.lang.Object,ognl.OgnlContext)
location: class org.apache.tapestry.services.impl.HiveMindExpressionCompiler

/srv/gump/public/workspace/tapestry/tapestry-framework/src/java/org/apache/tapestry/listener/ListenerMapPropertyAccessor.java:[81,20] cannot find symbol
symbol  : method getPropertyClass(ognl.OgnlContext,java.lang.Object,java.lang.Object)
location: class ognl.ObjectPropertyAccessor

/srv/gump/public/workspace/tapestry/tapestry-framework/src/java/org/apache/tapestry/listener/ListenerMapPropertyAccessor.java:[91,36] cannot find symbol
symbol  : method getCompiler()
location: class ognl.OgnlRuntime

/srv/gump/public/workspace/tapestry/tapestry-framework/src/java/org/apache/tapestry/listener/ListenerMapPropertyAccessor.java:[93,12] cannot find symbol
symbol  : variable ExpressionCompiler
location: class org.apache.tapestry.listener.ListenerMapPropertyAccessor

/srv/gump/public/workspace/tapestry/tapestry-framework/src/java/org/apache/tapestry/listener/ListenerMapPropertyAccessor.java:[95,19] cannot find symbol
symbol  : method setCurrentAccessor(java.lang.Class)
location: class ognl.OgnlContext

/srv/gump/public/workspace/tapestry/tapestry-framework/src/java/org/apache/tapestry/listener/ListenerMapPropertyAccessor.java:[96,19] cannot find symbol
symbol  : method setCurrentType(java.lang.Class)
location: class ognl.OgnlContext

/srv/gump/public/workspace/tapestry/tapestry-framework/src/java/org/apache/tapestry/listener/ListenerMapPropertyAccessor.java:[101,20] cannot find symbol
symbol  : method getSourceAccessor(ognl.OgnlContext,java.lang.Object,java.lang.Object)
location: class ognl.ObjectPropertyAccessor

/srv/gump/public/workspace/tapestry/tapestry-framework/src/java/org/apache/tapestry/listener/ListenerMapPropertyAccessor.java:[106,18] cannot find symbol
symbol  : class UnsupportedCompilationException
location: class org.apache.tapestry.listener.ListenerMapPropertyAccessor

/srv/gump/public/workspace/tapestry/tapestry-framework/src/java/org/apache/tapestry/binding/ExpressionBinding.java:[135,45] cannot find symbol
symbol  : method getAccessor()
location: interface ognl.Node

/srv/gump/public/workspace/tapestry/tapestry-framework/src/java/org/apache/tapestry/binding/ExpressionBinding.java:[210,53] cannot find symbol
symbol  : method getAccessor()
location: interface ognl.Node


[INFO] ------------------------------------------------------------------------
[INFO] For more information, run Maven with the -e switch
[INFO] ------------------------------------------------------------------------
[INFO] Total time: 2 minutes 15 seconds
[INFO] Finished at: Mon Sep 21 06:01:16 PDT 2009
[INFO] Final Memory: 14M/49M
[INFO] ------------------------------------------------------------------------
---------------------------------------------

To subscribe to this information via syndicated feeds:
- RSS: http://vmgump.apache.org/gump/public/tapestry/tapestry/rss.xml
- Atom: http://vmgump.apache.org/gump/public/tapestry/tapestry/atom.xml

============================== Gump Tracking Only ===
Produced by Gump version 2.3.
Gump Run 13000021092009, vmgump:vmgump-public:13000021092009
Gump E-mail Identifier (unique within run) #54.

*********************************************************** G U M P
[GUMP@vmgump]: Project maven-directory-plugin (in module apacheds) failed
To whom it may engage...
        
This is an automated request, but not an unsolicited one. For 
more information please visit http://gump.apache.org/nagged.html, 
and/or contact the folk at general@gump.apache.org.

Project maven-directory-plugin has an issue affecting its community integration.
This issue affects 1 projects.
The current state of this project is 'Failed', with reason 'Build Failed'.
For reference only, the following projects are affected by this:
    - maven-directory-plugin :  Apache Directory Server


Full details are available at:
    http://vmgump.apache.org/gump/public/apacheds/maven-directory-plugin/index.html

That said, some information snippets are provided here.

The following annotations (debug/informational/warning/error messages) were provided:
 -DEBUG- Sole output [maven-directory-plugin-21092009.jar] identifier set to project name
 -DEBUG- Dependency on velocity-engine exists, no need to add for property maven.jar.velocity-dep.
 -INFO- Making directory for Maven properties: [/srv/gump/public/workspace/apacheds/plugin]
 -DEBUG- (Gump generated) Maven Properties in: /srv/gump/public/workspace/apacheds/plugin/build.properties
 -INFO- Failed with reason build failed
 -INFO- Project Reports in: /srv/gump/public/workspace/apacheds/plugin/target/test-reports
 -INFO- Failed to extract fallback artifacts from Gump Repository



The following work was performed:
http://vmgump.apache.org/gump/public/apacheds/maven-directory-plugin/gump_work/build_apacheds_maven-directory-plugin.html
Work Name: build_apacheds_maven-directory-plugin (Type: Build)
Work ended in a state of : Failed
Elapsed: 5 secs
Command Line: maven --offline jar 
[Working Directory: /srv/gump/public/workspace/apacheds/plugin]
CLASSPATH: /usr/lib/jvm/java-6-sun/lib/tools.jar:/srv/gump/public/workspace/ant/dist/lib/ant-jmf.jar:/srv/gump/public/workspace/ant/dist/lib/ant-swing.jar:/srv/gump/public/workspace/ant/dist/lib/ant-apache-resolver.jar:/srv/gump/public/workspace/ant/dist/lib/ant-apache-xalan2.jar:/srv/gump/public/workspace/ant/dist/lib/ant-trax.jar:/srv/gump/public/workspace/ant/dist/lib/ant-junit.jar:/srv/gump/public/workspace/ant/dist/lib/ant-launcher.jar:/srv/gump/public/workspace/ant/dist/lib/ant-nodeps.jar:/srv/gump/public/workspace/ant/dist/lib/ant.jar:/srv/gump/packages/antlr/antlr-3.1.3.jar:/srv/gump/public/workspace/velocity-engine/bin/velocity-21092009-dep.jar:/srv/gump/public/workspace/junit/dist/junit-21092009.jar:/srv/gump/public/workspace/directory-shared/ldap/target/shared-ldap-0.9.16-SNAPSHOT.jar
---------------------------------------------
 __  __
|  \/  |__ _Apache__ ___
| |\/| / _` \ V / -_) ' \  ~ intelligent projects ~
|_|  |_\__,_|\_/\___|_||_|  v. 1.0.2

build:start:

java:prepare-filesystem:
    [mkdir] Created dir: /srv/gump/public/workspace/apacheds/plugin/target/classes

java:compile:
    [echo] Compiling to /srv/gump/public/workspace/apacheds/plugin/target/classes
    [echo] No java source files to compile.
resources or todir was null

java:jar-resources:

test:prepare-filesystem:
    [mkdir] Created dir: /srv/gump/public/workspace/apacheds/plugin/target/test-classes
    [mkdir] Created dir: /srv/gump/public/workspace/apacheds/plugin/target/test-reports

test:test-resources:

test:compile:
    [echo] No test source files to compile.

test:test:
    [echo] No tests to run.

BUILD FAILED
File...... /home/gump/.maven/cache/maven-jar-plugin-1.6.1/plugin.jelly
Element... ant:fail
Line...... 53
Column.... 19
You must define currentVersion in your POM.
Total time: 4 seconds
Finished at: Mon Sep 21 06:12:53 PDT 2009

---------------------------------------------

To subscribe to this information via syndicated feeds:
- RSS: http://vmgump.apache.org/gump/public/apacheds/maven-directory-plugin/rss.xml
- Atom: http://vmgump.apache.org/gump/public/apacheds/maven-directory-plugin/atom.xml

============================== Gump Tracking Only ===
Produced by Gump version 2.3.
Gump Run 13000021092009, vmgump:vmgump-public:13000021092009
Gump E-mail Identifier (unique within run) #56.

*********************************************************** G U M P
[GUMP@vmgump]: Project cocoon (in module cocoon) failed
To whom it may engage...
        
This is an automated request, but not an unsolicited one. For 
more information please visit http://gump.apache.org/nagged.html, 
and/or contact the folk at general@gump.apache.org.

Project cocoon has an issue affecting its community integration.
This issue affects 1 projects,
 and has been outstanding for 1207 runs.
The current state of this project is 'Failed', with reason 'Build Failed'.
For reference only, the following projects are affected by this:
    - cocoon :  Java XML Framework


Full details are available at:
    http://vmgump.apache.org/gump/public/cocoon/cocoon/index.html

That said, some information snippets are provided here.

The following annotations (debug/informational/warning/error messages) were provided:
 -INFO- Optional dependency htmlunit prerequisite failed with reason build failed
 -INFO- Optional dependency excalibur-datasource prerequisite failed with reason build failed
 -INFO- Optional dependency excalibur-pool-instrumented prerequisite failed with reason build failed
 -DEBUG- (Gump generated) Maven2 Settings in: /srv/gump/public/workspace/cocoon/gump_mvn_settings.xml
 -INFO- Failed with reason build failed
 -DEBUG- Maven POM in: /srv/gump/public/workspace/cocoon/pom.xml



The following work was performed:
http://vmgump.apache.org/gump/public/cocoon/cocoon/gump_work/build_cocoon_cocoon.html
Work Name: build_cocoon_cocoon (Type: Build)
Work ended in a state of : Failed
Elapsed: 2 mins 52 secs
Command Line: mvn --batch-mode --settings /srv/gump/public/workspace/cocoon/gump_mvn_settings.xml package 
[Working Directory: /srv/gump/public/workspace/cocoon]
CLASSPATH: /usr/lib/jvm/java-6-sun/lib/tools.jar:/srv/gump/public/workspace/junit/dist/junit-21092009.jar:/srv/gump/public/workspace/apache-commons/lang/target/commons-lang-3.0-SNAPSHOT.jar:/srv/gump/public/workspace/ant/dist/lib/ant-jmf.jar:/srv/gump/public/workspace/ant/dist/lib/ant-swing.jar:/srv/gump/public/workspace/ant/dist/lib/ant-apache-resolver.jar:/srv/gump/public/workspace/ant/dist/lib/ant-apache-xalan2.jar:/srv/gump/public/workspace/ant/dist/lib/ant-trax.jar:/srv/gump/public/workspace/ant/dist/lib/ant-junit.jar:/srv/gump/public/workspace/ant/dist/lib/ant-launcher.jar:/srv/gump/public/workspace/ant/dist/lib/ant-nodeps.jar:/srv/gump/public/workspace/ant/dist/lib/ant.jar:/srv/gump/public/workspace/aopalliance/build/aopalliance.jar:/srv/gump/packages/bsh-2.0b4/bsh-commands-2.0b4.jar:/srv/gump/packages/bsh-2.0b4/bsh-classpath-2.0b4.jar:/srv/gump/packages/bsh-2.0b4/bsh-core-2.0b4.jar:/srv/gump/packages/bsh-2.0b4/bsh-bsf-2.0b4.jar:/srv/gump/packages/bsh-2.0b4/bsh-2.0b4.j
 ar:/srv/gump/packages/bsh-2.0b4/bsh-reflect-2.0b4.jar:/srv/gump/packages/bsh-2.0b4/bsh-util-2.0b4.jar:/srv/gump/public/workspace/apache-commons/beanutils/dist/commons-beanutils-21092009.jar:/srv/gump/public/workspace/apache-commons/codec/dist/commons-codec-21092009.jar:/srv/gump/public/workspace/apache-commons/collections/target/commons-collections-3.3-SNAPSHOT.jar:/srv/gump/public/workspace/apache-commons/configuration/target/commons-configuration-1.7-SNAPSHOT.jar:/srv/gump/public/workspace/apache-commons/digester/dist/commons-digester.jar:/srv/gump/public/workspace/httpcomponents/oac.hc3x/dist/commons-httpclient.jar:/srv/gump/public/workspace/apache-commons/io/target/commons-io-21092009.jar:/srv/gump/public/workspace/apache-commons/jexl/target/commons-jexl-2.0-SNAPSHOT.jar:/srv/gump/public/workspace/apache-commons/jxpath/dist/commons-jxpath.jar:/srv/gump/public/workspace/apache-commons/logging/target/commons-logging-21092009.jar:/srv/gump/public/workspace/apache-commons/lo
 gging/target/commons-logging-api-21092009.jar:/srv/gump/public/workspace/apache-commons/validator/dist/commons-validator-21092009.jar:/srv/gump/packages/dougLea/concurrent.jar:/srv/gump/public/workspace/dom4j/build/dom4j.jar:/srv/gump/public/workspace/excalibur/components/datasource/target/excalibur-datasource-2.2.3-SNAPSHOT.jar:/srv/gump/public/workspace/excalibur/components/pool/instrumented/target/excalibur-pool-instrumented-2.2.3-SNAPSHOT.jar:/srv/gump/public/workspace/hsqldb/lib/hsqldb.jar:/srv/gump/public/workspace/htmlunit/target/htmlunit-21092009.jar:/srv/gump/public/workspace/jakarta-oro/jakarta-oro-21092009.jar:/srv/gump/public/workspace/jakarta-regexp/build/jakarta-regexp-21092009.jar:/srv/gump/public/workspace/jaxen/target/jaxen-21092009.jar:/srv/gump/public/workspace/jdom/build/jdom.jar:/srv/gump/public/workspace/jmock/build/dist/jmock-core-21092009.jar:/srv/gump/public/workspace/jmock/build/dist/jmock-cglib-21092009.jar:/srv/gump/packages/jtidy-04aug2000r7-dev/
 build/Tidy.jar:/srv/gump/public/workspace/logging-log4j-12/dist/lib/log4j-21092009.jar:/srv/gump/packages/nekohtml-0.9.5/nekohtml.jar:/srv/gump/public/workspace/rhino/build/rhino_21092009/js.jar:/srv/gump/public/workspace/velocity-engine/bin/velocity-21092009.jar:/srv/gump/public/workspace/velocity-engine/bin/velocity-21092009-dep.jar:/srv/gump/public/workspace/xml-commons/java/external/build/xml-apis-ext.jar:/srv/gump/public/workspace/xml-commons/java/external/build/xml-apis.jar:/srv/gump/public/workspace/xml-batik/batik-21092009/lib/batik-util.jar:/srv/gump/public/workspace/xml-batik/batik-21092009/lib/batik-swing.jar:/srv/gump/public/workspace/xml-batik/batik-21092009/lib/batik-css.jar:/srv/gump/public/workspace/xml-batik/batik-21092009/lib/batik-bridge.jar:/srv/gump/public/workspace/xml-batik/batik-21092009/lib/batik-xml.jar:/srv/gump/public/workspace/xml-batik/batik-21092009/lib/batik-svg-dom.jar:/srv/gump/public/workspace/xml-batik/batik-21092009/lib/batik-awt-util.jar
 :/srv/gump/public/workspace/xml-batik/batik-21092009/lib/batik-transcoder.jar:/srv/gump/public/workspace/xml-batik/batik-21092009/lib/batik-gui-util.jar:/srv/gump/public/workspace/xml-batik/batik-21092009/lib/batik-dom.jar:/srv/gump/public/workspace/xml-batik/batik-21092009/lib/batik-ext.jar:/srv/gump/public/workspace/xml-batik/batik-21092009/lib/batik-script.jar:/srv/gump/public/workspace/xml-batik/batik-21092009/lib/batik-svggen.jar:/srv/gump/public/workspace/xml-batik/batik-21092009/lib/batik-parser.jar:/srv/gump/public/workspace/xml-batik/batik-21092009/lib/batik-extension.jar:/srv/gump/public/workspace/xml-batik/batik-21092009/lib/batik-gvt.jar:/srv/gump/public/workspace/xml-fop/build/fop.jar:/srv/gump/public/workspace/xml-commons/java/build/resolver.jar:/srv/gump/public/workspace/xml-xerces2/build/xercesImpl.jar:/srv/gump/public/workspace/xmlunit/build/java/lib/xmlunit-sumo-21092009.jar:/srv/gump/public/workspace/xom/build/xom-21092009.jar
---------------------------------------------
Downloading: http://localhost:8192/maven2/org/apache/maven/maven-repository-metadata/2.0.1/maven-repository-metadata-2.0.1.jar
19K downloaded
Downloading: http://people.apache.org/~gkossakowski/maven2/repository/org/apache/maven/wagon/wagon-provider-api/1.0-alpha-5/wagon-provider-api-1.0-alpha-5.jar
Downloading: http://localhost:8192/maven2/org/apache/maven/wagon/wagon-provider-api/1.0-alpha-5/wagon-provider-api-1.0-alpha-5.jar
50K downloaded
Downloading: http://localhost:8192/maven2/org/apache/maven/plugins/maven-war-plugin/2.0.2/maven-war-plugin-2.0.2.jar
27K downloaded
Downloading: http://people.apache.org/~gkossakowski/maven2/repository/org/apache/maven/maven-archiver/2.2/maven-archiver-2.2.jar
Downloading: http://localhost:8192/maven2/org/apache/maven/maven-archiver/2.2/maven-archiver-2.2.jar
9K downloaded
Downloading: http://localhost:8192/maven2/javax/servlet/servlet-api/2.4/servlet-api-2.4.jar
86K downloaded
[INFO] [plugin:descriptor]
[WARNING] 

Goal prefix is specified as: 'cocoon'. Maven currently expects it to be 'cocoon'.

[INFO] Using 2 extractors.
[INFO] Applying extractor for language: java
[INFO] Extractor for language: java found 4 mojo descriptors.
[INFO] Applying extractor for language: bsh
[INFO] Extractor for language: bsh found 0 mojo descriptors.
[INFO] [resources:resources]
[WARNING] Using platform encoding (UTF-8 actually) to copy filtered resources, i.e. build is platform dependent!
[INFO] Copying 7 resources
[INFO] Copying 2 resources to META-INF
[INFO] [compiler:compile]
[INFO] Compiling 24 source files to /srv/gump/public/workspace/cocoon/tools/cocoon-maven-plugin/target/classes
[INFO] ------------------------------------------------------------------------
[ERROR] BUILD FAILURE
[INFO] ------------------------------------------------------------------------
[INFO] Compilation failure
/srv/gump/public/workspace/cocoon/tools/cocoon-maven-plugin/src/main/java/org/apache/cocoon/maven/rcl/PrepareWebappMojo.java:[285,8] cannot access org.apache.commons.lang.exception.NestableException
class file for org.apache.commons.lang.exception.NestableException not found
        try {



/srv/gump/public/workspace/cocoon/tools/cocoon-maven-plugin/src/main/java/org/apache/cocoon/maven/rcl/PrepareWebappMojo.java:[285,8] cannot access org.apache.commons.lang.exception.NestableException
class file for org.apache.commons.lang.exception.NestableException not found
        try {


[INFO] ------------------------------------------------------------------------
[INFO] For more information, run Maven with the -e switch
[INFO] ------------------------------------------------------------------------
[INFO] Total time: 2 minutes 50 seconds
[INFO] Finished at: Mon Sep 21 06:35:08 PDT 2009
[INFO] Final Memory: 54M/96M
[INFO] ------------------------------------------------------------------------
---------------------------------------------

To subscribe to this information via syndicated feeds:
- RSS: http://vmgump.apache.org/gump/public/cocoon/cocoon/rss.xml
- Atom: http://vmgump.apache.org/gump/public/cocoon/cocoon/atom.xml

============================== Gump Tracking Only ===
Produced by Gump version 2.3.
Gump Run 13000021092009, vmgump:vmgump-public:13000021092009
Gump E-mail Identifier (unique within run) #57.

*********************************************************** G U M P
[GUMP@vmgump]: Project portals-bridges-velocity (in module portals-bridges) failed
To whom it may engage...
        
This is an automated request, but not an unsolicited one. For 
more information please visit http://gump.apache.org/nagged.html, 
and/or contact the folk at general@gump.apache.org.

Project portals-bridges-velocity has an issue affecting its community integration.
This issue affects 2 projects,
 and has been outstanding for 11 runs.
The current state of this project is 'Failed', with reason 'Build Failed'.
For reference only, the following projects are affected by this:
    - portals-bridges-frameworks :  Support for JSR168 compliant Portlet development
    - portals-bridges-velocity :  Support for JSR168 compliant Portlet development


Full details are available at:
    http://vmgump.apache.org/gump/public/portals-bridges/portals-bridges-velocity/index.html

That said, some information snippets are provided here.

The following annotations (debug/informational/warning/error messages) were provided:
 -DEBUG- Sole output [portals-bridges-velocity-21092009.jar] identifier set to project name
 -DEBUG- Dependency on portals-pluto-api-1.0 exists, no need to add for property maven.jar.portlet-api.
 -DEBUG- Dependency on jakarta-servletapi-5-servlet exists, no need to add for property maven.jar.servletapi.
 -DEBUG- (Gump generated) Maven Properties in: /srv/gump/public/workspace/portals-bridges/velocity/build.properties
 -INFO- Failed with reason build failed
 -DEBUG- Maven POM in: /srv/gump/public/workspace/portals-bridges/velocity/project.xml
 -DEBUG- Maven project properties in: /srv/gump/public/workspace/portals-bridges/velocity/project.properties
 -INFO- Failed to extract fallback artifacts from Gump Repository



The following work was performed:
http://vmgump.apache.org/gump/public/portals-bridges/portals-bridges-velocity/gump_work/build_portals-bridges_portals-bridges-velocity.html
Work Name: build_portals-bridges_portals-bridges-velocity (Type: Build)
Work ended in a state of : Failed
Elapsed: 6 secs
Command Line: maven --offline jar 
[Working Directory: /srv/gump/public/workspace/portals-bridges/velocity]
CLASSPATH: /usr/lib/jvm/java-6-sun/lib/tools.jar:/srv/gump/public/workspace/jakarta-servletapi-5/jsr154/dist/lib/servlet-api.jar:/srv/gump/public/workspace/portals-bridges/common/target/portals-bridges-common-21092009.jar:/srv/gump/public/workspace/portals-pluto-1.0/api/target/portlet-api-1.0.jar:/srv/gump/public/workspace/velocity-engine/bin/velocity-21092009.jar:/srv/gump/public/workspace/velocity-tools/dist/velocity-tools-21092009.jar
---------------------------------------------
 __  __
|  \/  |__ _Apache__ ___
| |\/| / _` \ V / -_) ' \  ~ intelligent projects ~
|_|  |_\__,_|\_/\___|_||_|  v. 1.0.2

build:start:

java:prepare-filesystem:
    [mkdir] Created dir: /srv/gump/public/workspace/portals-bridges/velocity/target/classes

java:compile:
    [echo] Compiling to /srv/gump/public/workspace/portals-bridges/velocity/target/classes
    [javac] Compiling 3 source files to /srv/gump/public/workspace/portals-bridges/velocity/target/classes
    [javac] /srv/gump/public/workspace/portals-bridges/velocity/src/java/org/apache/portals/bridges/velocity/BridgesVelocityViewServlet.java:35: warning: [deprecation] org.apache.velocity.tools.view.servlet.VelocityViewServlet in org.apache.velocity.tools.view.servlet has been deprecated
    [javac] import org.apache.velocity.tools.view.servlet.VelocityViewServlet;
    [javac]                                              ^
    [javac] /srv/gump/public/workspace/portals-bridges/velocity/src/java/org/apache/portals/bridges/velocity/BridgesVelocityViewServlet.java:42: warning: [deprecation] org.apache.velocity.tools.view.servlet.VelocityViewServlet in org.apache.velocity.tools.view.servlet has been deprecated
    [javac] public class BridgesVelocityViewServlet extends VelocityViewServlet
    [javac]                                                 ^
    [javac] /srv/gump/public/workspace/portals-bridges/velocity/src/java/org/apache/portals/bridges/velocity/BridgesVelocityViewServlet.java:58: handleRequest(javax.servlet.http.HttpServletRequest,javax.servlet.http.HttpServletResponse,org.apache.velocity.context.Context) in org.apache.portals.bridges.velocity.BridgesVelocityViewServlet cannot override handleRequest(javax.servlet.http.HttpServletRequest,javax.servlet.http.HttpServletResponse,org.apache.velocity.context.Context) in org.apache.velocity.tools.view.VelocityViewServlet; overridden method does not throw java.lang.Exception
    [javac]     protected Template handleRequest(HttpServletRequest request, HttpServletResponse response, Context ctx) throws Exception
    [javac]                        ^
    [javac] /srv/gump/public/workspace/portals-bridges/velocity/src/java/org/apache/portals/bridges/velocity/BridgesVelocityViewServlet.java:92: mergeTemplate(org.apache.velocity.Template,org.apache.velocity.context.Context,javax.servlet.http.HttpServletResponse) in org.apache.portals.bridges.velocity.BridgesVelocityViewServlet cannot override mergeTemplate(org.apache.velocity.Template,org.apache.velocity.context.Context,javax.servlet.http.HttpServletResponse) in org.apache.velocity.tools.view.VelocityViewServlet; overridden method does not throw java.lang.Exception
    [javac]     protected void mergeTemplate(Template template, Context context, HttpServletResponse response)
    [javac]                    ^
    [javac] 2 errors
    [javac] 2 warnings

BUILD FAILED
File...... /home/gump/.maven/cache/maven-java-plugin-1.5/plugin.jelly
Element... ant:javac
Line...... 63
Column.... 48
Compile failed; see the compiler error output for details.
Total time: 5 seconds
Finished at: Mon Sep 21 06:43:52 PDT 2009

---------------------------------------------

To subscribe to this information via syndicated feeds:
- RSS: http://vmgump.apache.org/gump/public/portals-bridges/portals-bridges-velocity/rss.xml
- Atom: http://vmgump.apache.org/gump/public/portals-bridges/portals-bridges-velocity/atom.xml

============================== Gump Tracking Only ===
Produced by Gump version 2.3.
Gump Run 13000021092009, vmgump:vmgump-public:13000021092009
Gump E-mail Identifier (unique within run) #58.

*********************************************************** G U M P
[GUMP@vmgump]: Project portals-pluto-portal-1.0 (in module portals-pluto-1.0) failed
To whom it may engage...
        
This is an automated request, but not an unsolicited one. For 
more information please visit http://gump.apache.org/nagged.html, 
and/or contact the folk at general@gump.apache.org.

Project portals-pluto-portal-1.0 has an issue affecting its community integration.
This issue affects 1 projects,
 and has been outstanding for 13 runs.
The current state of this project is 'Failed', with reason 'Build Failed'.
For reference only, the following projects are affected by this:
    - portals-pluto-portal-1.0 :  JSR168 Container


Full details are available at:
    http://vmgump.apache.org/gump/public/portals-pluto-1.0/portals-pluto-portal-1.0/index.html

That said, some information snippets are provided here.

The following annotations (debug/informational/warning/error messages) were provided:
 -DEBUG- Dependency on ant exists, no need to add for property env.ANT_HOME.
 -INFO- Failed with reason build failed
 -INFO- Failed to extract fallback artifacts from Gump Repository



The following work was performed:
http://vmgump.apache.org/gump/public/portals-pluto-1.0/portals-pluto-portal-1.0/gump_work/build_portals-pluto-1.0_portals-pluto-portal-1.0.html
Work Name: build_portals-pluto-1.0_portals-pluto-portal-1.0 (Type: Build)
Work ended in a state of : Failed
Elapsed: 5 secs
Command Line: /usr/lib/jvm/java-6-sun/bin/java -Djava.awt.headless=true -Xbootclasspath/p:/srv/gump/public/workspace/xml-commons/java/external/build/xml-apis.jar:/srv/gump/public/workspace/xml-xerces2/build/xercesImpl.jar org.apache.tools.ant.Main -Dgump.merge=/srv/gump/public/gump/work/merge.xml -Dbuild.sysclasspath=only -Denv.ANT_HOME=/srv/gump/public/workspace/ant/dist -Dversion=21092009 -Dfinal.portal.name=pluto-portal-impl-21092009 all 
[Working Directory: /srv/gump/public/workspace/portals-pluto-1.0]
CLASSPATH: /usr/lib/jvm/java-6-sun/lib/tools.jar:/srv/gump/public/workspace/portals-pluto-1.0/build/ant/lib/ForeachTask.jar:/srv/gump/public/workspace/ant/dist/lib/ant-jmf.jar:/srv/gump/public/workspace/ant/dist/lib/ant-swing.jar:/srv/gump/public/workspace/ant/dist/lib/ant-apache-resolver.jar:/srv/gump/public/workspace/ant/dist/lib/ant-apache-xalan2.jar:/srv/gump/public/workspace/ant/dist/lib/ant-trax.jar:/srv/gump/public/workspace/ant/dist/lib/ant-junit.jar:/srv/gump/public/workspace/ant/dist/lib/ant-launcher.jar:/srv/gump/public/workspace/ant/dist/lib/ant-nodeps.jar:/srv/gump/public/workspace/ant/dist/lib/ant.jar:/srv/gump/packages/junit3.8.1/junit.jar:/srv/gump/public/workspace/xml-commons/java/build/resolver.jar:/srv/gump/public/workspace/castor/core/target/castor-core-1.3.1-SNAPSHOT.jar:/srv/gump/public/workspace/castor/xml/target/castor-xml-1.3.1-SNAPSHOT.jar:/srv/gump/public/workspace/apache-commons/fileupload/target/commons-fileupload-21092009.jar:/srv/gump/public/wor
 kspace/apache-commons/logging/target/commons-logging-21092009.jar:/srv/gump/public/workspace/apache-commons/logging/target/commons-logging-api-21092009.jar:/srv/gump/public/workspace/junit/dist/junit-21092009.jar:/srv/gump/public/workspace/jakarta-regexp/build/jakarta-regexp-21092009.jar:/srv/gump/public/workspace/jakarta-servletapi-5/jsr154/dist/lib/servlet-api.jar:/srv/gump/public/workspace/jakarta-servletapi-5/jsr152/dist/lib/jsp-api.jar:/srv/gump/public/workspace/portals-pluto-1.0/api/target/portlet-api-1.0.jar:/srv/gump/public/workspace/portals-pluto-1.0/container/target/pluto-1.0.jar:/srv/gump/public/workspace/portals-pluto-1.0/descriptors/target/pluto-descriptors-1.0.jar:/srv/gump/public/workspace/xml-commons/java/external/build/xml-apis-ext.jar
---------------------------------------------

compile-tests:

internal-test:

test:

jar:

portal:

init:
    [mkdir] Created dir: /srv/gump/public/workspace/portals-pluto-1.0/portal/target/lib

get-deps:

compile:
    [mkdir] Created dir: /srv/gump/public/workspace/portals-pluto-1.0/portal/target/classes
    [javac] Compiling 149 source files to /srv/gump/public/workspace/portals-pluto-1.0/portal/target/classes
    [javac] /srv/gump/public/workspace/portals-pluto-1.0/portal/src/java/org/apache/pluto/portalImpl/Deploy.java:62: warning: [deprecation] org.apache.xml.serialize.OutputFormat in org.apache.xml.serialize has been deprecated
    [javac] import org.apache.xml.serialize.OutputFormat;
    [javac]                                ^
    [javac] /srv/gump/public/workspace/portals-pluto-1.0/portal/src/java/org/apache/pluto/portalImpl/Deploy.java:63: warning: [deprecation] org.apache.xml.serialize.XMLSerializer in org.apache.xml.serialize has been deprecated
    [javac] import org.apache.xml.serialize.XMLSerializer;
    [javac]                                ^
    [javac] /srv/gump/public/workspace/portals-pluto-1.0/portal/src/java/org/apache/pluto/portalImpl/core/PortalURL.java:179: warning: [deprecation] encode(java.lang.String) in java.net.URLEncoder has been deprecated
    [javac]         value = URLEncoder.encode(value);
    [javac]                           ^
    [javac] /srv/gump/public/workspace/portals-pluto-1.0/portal/src/java/org/apache/pluto/portalImpl/services/portletdefinitionregistry/PortletDefinitionRegistryServiceContextImpl.java:113: exception java.io.IOException is never thrown in body of corresponding try statement
    [javac]         } catch (IOException e) {
    [javac]           ^
    [javac] /srv/gump/public/workspace/portals-pluto-1.0/portal/src/java/org/apache/pluto/portalImpl/services/portletdefinitionregistry/PortletDefinitionRegistryServiceContextImpl.java:115: exception org.exolab.castor.mapping.MappingException is never thrown in body of corresponding try statement
    [javac]         } catch (MappingException e) {
    [javac]           ^
    [javac] /srv/gump/public/workspace/portals-pluto-1.0/portal/src/java/org/apache/pluto/portalImpl/services/portletdefinitionregistry/PortletDefinitionRegistryServiceFileImpl.java:233: warning: [deprecation] toURL() in java.io.File has been deprecated
    [javac]             source.setSystemId(portletXml.toURL().toExternalForm());
    [javac]                                          ^
    [javac] /srv/gump/public/workspace/portals-pluto-1.0/portal/src/java/org/apache/pluto/portlet/admin/services/DeployWarService.java:165: warning: [deprecation] org.apache.pluto.portalImpl.Deploy in org.apache.pluto.portalImpl has been deprecated
    [javac] 		            org.apache.pluto.portalImpl.Deploy.main(args);
    [javac] 		                                       ^
    [javac] Note: Some input files use unchecked or unsafe operations.
    [javac] Note: Recompile with -Xlint:unchecked for details.
    [javac] 2 errors
    [javac] 5 warnings

BUILD FAILED
/srv/gump/public/workspace/portals-pluto-1.0/build.xml:51: The following error occurred while executing this line:
/srv/gump/public/workspace/portals-pluto-1.0/portal/build.xml:50: Compile failed; see the compiler error output for details.

Total time: 4 seconds
---------------------------------------------

To subscribe to this information via syndicated feeds:
- RSS: http://vmgump.apache.org/gump/public/portals-pluto-1.0/portals-pluto-portal-1.0/rss.xml
- Atom: http://vmgump.apache.org/gump/public/portals-pluto-1.0/portals-pluto-portal-1.0/atom.xml

============================== Gump Tracking Only ===
Produced by Gump version 2.3.
Gump Run 13000021092009, vmgump:vmgump-public:13000021092009
Gump E-mail Identifier (unique within run) #59.

*********************************************************** G U M P
[GUMP@vmgump]: Project authx-example (in module authx) failed
To whom it may engage...
        
This is an automated request, but not an unsolicited one. For 
more information please visit http://gump.apache.org/nagged.html, 
and/or contact the folk at general@gump.apache.org.

Project authx-example has an issue affecting its community integration.
This issue affects 1 projects,
 and has been outstanding for 11 runs.
The current state of this project is 'Failed', with reason 'Build Failed'.
For reference only, the following projects are affected by this:
    - authx-example :  Apache Authentication and Authorization Framework


Full details are available at:
    http://vmgump.apache.org/gump/public/authx/authx-example/index.html

That said, some information snippets are provided here.

The following annotations (debug/informational/warning/error messages) were provided:
 -DEBUG- Sole output [authx-example-21092009.jar] identifier set to project name
 -DEBUG- Dependency on jakarta-servletapi-5-servlet exists, no need to add for property maven.jar.servletapi.
 -DEBUG- Dependency on xml-xerces exists, no need to add for property maven.jar.xercesImpl.
 -DEBUG- Dependency on asm exists, no need to add for property maven.jar.asm-util.
 -DEBUG- Dependency on velocity-engine exists, no need to add for property maven.jar.velocity.
 -DEBUG- Dependency on velocity-tools exists, no need to add for property maven.jar.velocity-tools-view.
 -DEBUG- Dependency on packaged-jmock exists, no need to add for property maven.jar.jmock.
 -DEBUG- (Gump generated) Maven Properties in: /srv/gump/public/workspace/authx/example/build.properties
 -INFO- Failed with reason build failed
 -DEBUG- Maven POM in: /srv/gump/public/workspace/authx/example/project.xml
 -DEBUG- Maven project properties in: /srv/gump/public/workspace/authx/example/project.properties
 -INFO- Project Reports in: /srv/gump/public/workspace/authx/example/target/test-reports
 -WARNING- No directory [/srv/gump/public/workspace/authx/example/target/test-reports]
 -INFO- Failed to extract fallback artifacts from Gump Repository



The following work was performed:
http://vmgump.apache.org/gump/public/authx/authx-example/gump_work/build_authx_authx-example.html
Work Name: build_authx_authx-example (Type: Build)
Work ended in a state of : Failed
Elapsed: 3 secs
Command Line: maven --offline jar 
[Working Directory: /srv/gump/public/workspace/authx/example]
CLASSPATH: /usr/lib/jvm/java-6-sun/lib/tools.jar:/srv/gump/public/workspace/asm/output/dist/lib/asm-util-21092009.jar:/srv/gump/public/workspace/authx/core/target/authx-core-21092009.jar:/srv/gump/public/workspace/authx/script/target/authx-script-21092009.jar:/srv/gump/public/workspace/dom4j/build/dom4j.jar:/srv/gump/public/workspace/groovy/target/groovy-1.7-beta-2-SNAPSHOT.jar:/srv/gump/public/workspace/jakarta-servletapi-5/jsr154/dist/lib/servlet-api.jar:/srv/gump/public/workspace/velocity-engine/bin/velocity-21092009.jar:/srv/gump/public/workspace/velocity-tools/dist/velocity-tools-view-21092009.jar:/srv/gump/packages/jmock/jmock-1.0.1.jar:/srv/gump/packages/nanocontainer/nanocontainer-1.0-beta-3.jar:/srv/gump/packages/nanocontainer/nanocontainer-nanowar-1.0-beta-3.jar:/srv/gump/packages/ognl-2.6.7/ognl-2.6.7.jar:/srv/gump/packages/picocontainer-1.1/picocontainer-1.1.jar:/srv/gump/public/workspace/xml-commons/java/external/build/xml-apis-ext.jar
---------------------------------------------
 __  __
|  \/  |__ _Apache__ ___
| |\/| / _` \ V / -_) ' \  ~ intelligent projects ~
|_|  |_\__,_|\_/\___|_||_|  v. 1.0.2

You are working offline so the build will continue, but authx-core-0.4-SNAPSHOT.jar may be out of date!
You are working offline so the build will continue, but authx-script-0.4-SNAPSHOT.jar may be out of date!
The build cannot continue because of the following unsatisfied dependency:

groovy-all-1.0-jsr-04.jar

Total time: 2 seconds
Finished at: Mon Sep 21 06:59:52 PDT 2009

---------------------------------------------

To subscribe to this information via syndicated feeds:
- RSS: http://vmgump.apache.org/gump/public/authx/authx-example/rss.xml
- Atom: http://vmgump.apache.org/gump/public/authx/authx-example/atom.xml

============================== Gump Tracking Only ===
Produced by Gump version 2.3.
Gump Run 13000021092009, vmgump:vmgump-public:13000021092009
Gump E-mail Identifier (unique within run) #61.


--
Apache Gump
http://gump.apache.org/ [Instance: vmgump]

---------------------------------------------------------------------
To unsubscribe, e-mail: general-unsubscribe@gump.apache.org
For additional commands, e-mail: general-help@gump.apache.org


Mime
View raw message