gump-general mailing list archives

Site index · List index
Message view « Date » · « Thread »
Top « Date » · « Thread »
From g...@vmgump.apache.org
Subject BATCH: All dressed up, with nowhere to go...
Date Sat, 22 Aug 2009 05:01:38 GMT
Dear Gumpmeisters,
            
The following 29 notifys should have been sent

*********************************************************** G U M P
[GUMP@vmgump]: Project gsbase (in module gsbase) failed
[GUMP@vmgump]: Project gsbase-test (in module gsbase) failed
[GUMP@vmgump]: Module apr-util success, but with warnings.
[GUMP@vmgump]: Module jdom success, but with warnings.
[GUMP@vmgump]: Project jmock2 (in module jmock2) failed
[GUMP@vmgump]: Project apr-iconv-configure (in module apr-iconv) failed
[GUMP@vmgump]: Project derby (in module db-derby) failed
[GUMP@vmgump]: Project dotnet-antlib-test (in module ant-antlibs) failed
[GUMP@vmgump]: Project emma (in module emma) failed
[GUMP@vmgump]: Project logging-log4cxx-configure (in module logging-log4cxx) failed
[GUMP@vmgump]: Project jython (in module jython) failed
[GUMP@vmgump]: Project slf4j-test (in module slf4j) failed
[GUMP@vmgump]: Module tomcat-jasper_tc6 success, but with warnings.
[GUMP@vmgump]: Project castor-test (in module castor) failed
[GUMP@vmgump]: Project ws-commons-xmlschema (in module ws-axis2-commons) failed
[GUMP@vmgump]: Project ws-commons-axiom (in module ws-axis2-commons) failed
[GUMP@vmgump]: Project authx-script-test (in module authx) failed
[GUMP@vmgump]: Project ws-commons-policy (in module ws-axis2-commons) failed
[GUMP@vmgump]: Project jetty (in module jetty) failed
[GUMP@vmgump]: Project commons-jci (in module apache-commons) failed
[GUMP@vmgump]: Project httpcomponents-core (in module httpcomponents) failed
[GUMP@vmgump]: Project asn1-codec (in module directory-shared) failed
[GUMP@vmgump]: Project mina (in module mina) failed
[GUMP@vmgump]: Project groovy (in module groovy) failed
[GUMP@vmgump]: Project httpcomponents-client (in module httpcomponents) failed
[GUMP@vmgump]: Project rat-test (in module rat) failed
[GUMP@vmgump]: Project directory-ldap (in module directory-shared) failed
[GUMP@vmgump]: Project cocoon (in module cocoon) failed
[GUMP@vmgump]: Project tapestry (in module tapestry) failed
*********************************************************** G U M P
[GUMP@vmgump]: Project gsbase (in module gsbase) failed
To whom it may engage...
        
This is an automated request, but not an unsolicited one. For 
more information please visit http://gump.apache.org/nagged.html, 
and/or contact the folk at general@gump.apache.org.

Project gsbase has an issue affecting its community integration.
This issue affects 1 projects,
 and has been outstanding for 9 runs.
The current state of this project is 'Failed', with reason 'Build Failed'.
For reference only, the following projects are affected by this:
    - gsbase :  A collection of java utility classes


Full details are available at:
    http://vmgump.apache.org/gump/public/gsbase/gsbase/index.html

That said, some information snippets are provided here.

The following annotations (debug/informational/warning/error messages) were provided:
 -DEBUG- Sole output [gsbase-22082009.jar] identifier set to project name
 -DEBUG- (Gump generated) Maven Properties in: /srv/gump/public/workspace/gsbase/build.properties
 -INFO- Failed with reason build failed
 -DEBUG- Maven POM in: /srv/gump/public/workspace/gsbase/project.xml
 -DEBUG- Maven project properties in: /srv/gump/public/workspace/gsbase/project.properties
 -INFO- Failed to extract fallback artifacts from Gump Repository



The following work was performed:
http://vmgump.apache.org/gump/public/gsbase/gsbase/gump_work/build_gsbase_gsbase.html
Work Name: build_gsbase_gsbase (Type: Build)
Work ended in a state of : Failed
Elapsed: 7 secs
Command Line: maven --offline jar 
[Working Directory: /srv/gump/public/workspace/gsbase]
CLASSPATH: /usr/lib/jvm/java-6-sun/lib/tools.jar:/srv/gump/public/workspace/gsbase/target/classes:/srv/gump/public/workspace/junit/dist/junit-22082009.jar:/srv/gump/packages/junitperf-1.8/lib/junitperf.jar
---------------------------------------------
| |\/| / _` \ V / -_) ' \  ~ intelligent projects ~
|_|  |_\__,_|\_/\___|_||_|  v. 1.0.2

build:start:

java:prepare-filesystem:
    [mkdir] Created dir: /srv/gump/public/workspace/gsbase/target/classes

java:compile:
    [echo] Compiling to /srv/gump/public/workspace/gsbase/target/classes
    [echo] 
==========================================================

  NOTE: Targetting JVM 1.6, classes
  will not run on earlier JVMs

==========================================================
          
    [javac] Compiling 66 source files to /srv/gump/public/workspace/gsbase/target/classes
/srv/gump/public/workspace/gsbase/src/java/com/gargoylesoftware/base/resource/jdbc/StatementWrapper.java:65: com.gargoylesoftware.base.resource.jdbc.StatementWrapper is not abstract and does not override abstract method isPoolable() in java.sql.Statement
public class StatementWrapper implements Statement {
       ^
/srv/gump/public/workspace/gsbase/src/java/com/gargoylesoftware/base/resource/jdbc/PreparedStatementWrapper.java:64: com.gargoylesoftware.base.resource.jdbc.PreparedStatementWrapper is not abstract and does not override abstract method setNClob(int,java.io.Reader) in java.sql.PreparedStatement
public class PreparedStatementWrapper
       ^
/srv/gump/public/workspace/gsbase/src/java/com/gargoylesoftware/base/resource/jdbc/ConnectionWrapper.java:77: com.gargoylesoftware.base.resource.jdbc.ConnectionWrapper is not abstract and does not override abstract method createStruct(java.lang.String,java.lang.Object[]) in java.sql.Connection
public final class ConnectionWrapper implements Connection, ManagedResource {
             ^
/srv/gump/public/workspace/gsbase/src/java/com/gargoylesoftware/base/resource/jdbc/CallableStatementWrapper.java:81: com.gargoylesoftware.base.resource.jdbc.CallableStatementWrapper is not abstract and does not override abstract method setNClob(java.lang.String,java.io.Reader) in java.sql.CallableStatement
public final class CallableStatementWrapper
             ^
/srv/gump/public/workspace/gsbase/src/java/com/gargoylesoftware/base/resource/jdbc/DatabaseMetaDataWrapper.java:54: com.gargoylesoftware.base.resource.jdbc.DatabaseMetaDataWrapper is not abstract and does not override abstract method getFunctionColumns(java.lang.String,java.lang.String,java.lang.String,java.lang.String) in java.sql.DatabaseMetaData
public final class DatabaseMetaDataWrapper implements DatabaseMetaData {
             ^
/srv/gump/public/workspace/gsbase/src/java/com/gargoylesoftware/base/resource/jdbc/ResultSetWrapper.java:150: com.gargoylesoftware.base.resource.jdbc.ResultSetWrapper is not abstract and does not override abstract method updateNClob(java.lang.String,java.io.Reader) in java.sql.ResultSet
public final class ResultSetWrapper implements ResultSet {
             ^
Note: Some input files use unchecked or unsafe operations.
Note: Recompile with -Xlint:unchecked for details.
6 errors

BUILD FAILED
File...... /home/gump/.maven/cache/maven-java-plugin-1.5/plugin.jelly
Element... ant:javac
Line...... 63
Column.... 48
Compile failed; see the compiler error output for details.
Total time: 6 seconds
Finished at: Sat Aug 22 01:04:02 PDT 2009

---------------------------------------------

To subscribe to this information via syndicated feeds:
- RSS: http://vmgump.apache.org/gump/public/gsbase/gsbase/rss.xml
- Atom: http://vmgump.apache.org/gump/public/gsbase/gsbase/atom.xml

============================== Gump Tracking Only ===
Produced by Gump version 2.3.
Gump Run 25000022082009, vmgump:vmgump-public:25000022082009
Gump E-mail Identifier (unique within run) #4.

*********************************************************** G U M P
[GUMP@vmgump]: Project gsbase-test (in module gsbase) failed
To whom it may engage...
        
This is an automated request, but not an unsolicited one. For 
more information please visit http://gump.apache.org/nagged.html, 
and/or contact the folk at general@gump.apache.org.

Project gsbase-test has an issue affecting its community integration.
This issue affects 1 projects,
 and has been outstanding for 9 runs.
The current state of this project is 'Failed', with reason 'Build Failed'.
For reference only, the following projects are affected by this:
    - gsbase-test :  A collection of java utility classes


Full details are available at:
    http://vmgump.apache.org/gump/public/gsbase/gsbase-test/index.html

That said, some information snippets are provided here.

The following annotations (debug/informational/warning/error messages) were provided:
 -WARNING- Overriding Maven properties: [/srv/gump/public/workspace/gsbase/build.properties]
 -DEBUG- (Gump generated) Maven Properties in: /srv/gump/public/workspace/gsbase/build.properties
 -INFO- Failed with reason build failed
 -DEBUG- Maven POM in: /srv/gump/public/workspace/gsbase/project.xml
 -DEBUG- Maven project properties in: /srv/gump/public/workspace/gsbase/project.properties



The following work was performed:
http://vmgump.apache.org/gump/public/gsbase/gsbase-test/gump_work/build_gsbase_gsbase-test.html
Work Name: build_gsbase_gsbase-test (Type: Build)
Work ended in a state of : Failed
Elapsed: 4 secs
Command Line: maven --offline jar 
[Working Directory: /srv/gump/public/workspace/gsbase]
CLASSPATH: /usr/lib/jvm/java-6-sun/lib/tools.jar:/srv/gump/public/workspace/gsbase/target/classes:/srv/gump/public/workspace/junit/dist/junit-22082009.jar:/srv/gump/packages/junitperf-1.8/lib/junitperf.jar
---------------------------------------------
|  \/  |__ _Apache__ ___
| |\/| / _` \ V / -_) ' \  ~ intelligent projects ~
|_|  |_\__,_|\_/\___|_||_|  v. 1.0.2

build:start:

java:prepare-filesystem:

java:compile:
    [echo] Compiling to /srv/gump/public/workspace/gsbase/target/classes
    [echo] 
==========================================================

  NOTE: Targetting JVM 1.6, classes
  will not run on earlier JVMs

==========================================================
          
    [javac] Compiling 60 source files to /srv/gump/public/workspace/gsbase/target/classes
/srv/gump/public/workspace/gsbase/src/java/com/gargoylesoftware/base/resource/jdbc/StatementWrapper.java:65: com.gargoylesoftware.base.resource.jdbc.StatementWrapper is not abstract and does not override abstract method isPoolable() in java.sql.Statement
public class StatementWrapper implements Statement {
       ^
/srv/gump/public/workspace/gsbase/src/java/com/gargoylesoftware/base/resource/jdbc/PreparedStatementWrapper.java:64: com.gargoylesoftware.base.resource.jdbc.PreparedStatementWrapper is not abstract and does not override abstract method setNClob(int,java.io.Reader) in java.sql.PreparedStatement
public class PreparedStatementWrapper
       ^
/srv/gump/public/workspace/gsbase/src/java/com/gargoylesoftware/base/resource/jdbc/ConnectionWrapper.java:77: com.gargoylesoftware.base.resource.jdbc.ConnectionWrapper is not abstract and does not override abstract method createStruct(java.lang.String,java.lang.Object[]) in java.sql.Connection
public final class ConnectionWrapper implements Connection, ManagedResource {
             ^
/srv/gump/public/workspace/gsbase/src/java/com/gargoylesoftware/base/resource/jdbc/CallableStatementWrapper.java:81: com.gargoylesoftware.base.resource.jdbc.CallableStatementWrapper is not abstract and does not override abstract method setNClob(java.lang.String,java.io.Reader) in java.sql.CallableStatement
public final class CallableStatementWrapper
             ^
/srv/gump/public/workspace/gsbase/src/java/com/gargoylesoftware/base/resource/jdbc/DatabaseMetaDataWrapper.java:54: com.gargoylesoftware.base.resource.jdbc.DatabaseMetaDataWrapper is not abstract and does not override abstract method getFunctionColumns(java.lang.String,java.lang.String,java.lang.String,java.lang.String) in java.sql.DatabaseMetaData
public final class DatabaseMetaDataWrapper implements DatabaseMetaData {
             ^
/srv/gump/public/workspace/gsbase/src/java/com/gargoylesoftware/base/resource/jdbc/ResultSetWrapper.java:150: com.gargoylesoftware.base.resource.jdbc.ResultSetWrapper is not abstract and does not override abstract method updateNClob(java.lang.String,java.io.Reader) in java.sql.ResultSet
public final class ResultSetWrapper implements ResultSet {
             ^
Note: Some input files use unchecked or unsafe operations.
Note: Recompile with -Xlint:unchecked for details.
6 errors

BUILD FAILED
File...... /home/gump/.maven/cache/maven-java-plugin-1.5/plugin.jelly
Element... ant:javac
Line...... 63
Column.... 48
Compile failed; see the compiler error output for details.
Total time: 4 seconds
Finished at: Sat Aug 22 01:05:28 PDT 2009

---------------------------------------------

To subscribe to this information via syndicated feeds:
- RSS: http://vmgump.apache.org/gump/public/gsbase/gsbase-test/rss.xml
- Atom: http://vmgump.apache.org/gump/public/gsbase/gsbase-test/atom.xml

============================== Gump Tracking Only ===
Produced by Gump version 2.3.
Gump Run 25000022082009, vmgump:vmgump-public:25000022082009
Gump E-mail Identifier (unique within run) #5.

*********************************************************** G U M P
[GUMP@vmgump]: Module apr-util success, but with warnings.
To whom it may engage...
        
This is an automated request, but not an unsolicited one. For 
more information please visit http://gump.apache.org/nagged.html, 
and/or contact the folk at general@gump.apache.org.

Module apr-util contains errors.
The current state of this module is 'Success'.

Full details are available at:
    http://vmgump.apache.org/gump/public/apr-util/index.html

That said, some information snippets are provided here.

The following annotations (debug/informational/warning/error messages) were provided:
 -ERROR- *** Failed to update from source control.Stale contents ***



The following work was performed:
http://vmgump.apache.org/gump/public/apr-util/gump_work/update_apr-util.html
Work Name: update_apr-util (Type: Update)
Work ended in a state of : Failed
Elapsed: 6 secs
Command Line: svn --quiet update --non-interactive apr-util 
[Working Directory: /srv/gump/public/workspace/cvs]
---------------------------------------------
svn: Target path '/apr/apr-util/trunk' does not exist
---------------------------------------------

To subscribe to this information via syndicated feeds:
- RSS: http://vmgump.apache.org/gump/public/apr-util/rss.xml
- Atom: http://vmgump.apache.org/gump/public/apr-util/atom.xml

============================== Gump Tracking Only ===
Produced by Gump version 2.3.
Gump Run 25000022082009, vmgump:vmgump-public:25000022082009
Gump E-mail Identifier (unique within run) #6.

*********************************************************** G U M P
[GUMP@vmgump]: Module jdom success, but with warnings.
To whom it may engage...
        
This is an automated request, but not an unsolicited one. For 
more information please visit http://gump.apache.org/nagged.html, 
and/or contact the folk at general@gump.apache.org.

Module jdom contains errors.
The current state of this module is 'Success'.

Full details are available at:
    http://vmgump.apache.org/gump/public/jdom/index.html

That said, some information snippets are provided here.

The following annotations (debug/informational/warning/error messages) were provided:
 -ERROR- *** Failed to update from source control.Stale contents ***



The following work was performed:
http://vmgump.apache.org/gump/public/jdom/gump_work/update_jdom.html
Work Name: update_jdom (Type: Update)
Work ended in a state of : Failed
Elapsed: 3 mins 9 secs
Command Line: cvs -q -z3 -d :pserver:anonymous@cvs.jdom.org:/home/cvspublic update -P -d 
[Working Directory: /srv/gump/public/workspace/cvs/jdom]
---------------------------------------------
cvs [update aborted]: connect to cvs.jdom.org(65.212.180.182):2401 failed: Connection timed out
---------------------------------------------

To subscribe to this information via syndicated feeds:
- RSS: http://vmgump.apache.org/gump/public/jdom/rss.xml
- Atom: http://vmgump.apache.org/gump/public/jdom/atom.xml

============================== Gump Tracking Only ===
Produced by Gump version 2.3.
Gump Run 25000022082009, vmgump:vmgump-public:25000022082009
Gump E-mail Identifier (unique within run) #7.

*********************************************************** G U M P
[GUMP@vmgump]: Project jmock2 (in module jmock2) failed
To whom it may engage...
        
This is an automated request, but not an unsolicited one. For 
more information please visit http://gump.apache.org/nagged.html, 
and/or contact the folk at general@gump.apache.org.

Project jmock2 has an issue affecting its community integration.
This issue affects 1 projects,
 and has been outstanding for 9 runs.
The current state of this project is 'Failed', with reason 'Build Failed'.
For reference only, the following projects are affected by this:
    - jmock2 :  jMock is a library for testing Java code using mock objects.


Full details are available at:
    http://vmgump.apache.org/gump/public/jmock2/jmock2/index.html

That said, some information snippets are provided here.

The following annotations (debug/informational/warning/error messages) were provided:
 -INFO- Failed with reason build failed
 -INFO- Failed to extract fallback artifacts from Gump Repository



The following work was performed:
http://vmgump.apache.org/gump/public/jmock2/jmock2/gump_work/build_jmock2_jmock2.html
Work Name: build_jmock2_jmock2 (Type: Build)
Work ended in a state of : Failed
Elapsed: 5 secs
Command Line: /usr/lib/jvm/java-6-sun/bin/java -Djava.awt.headless=true -Xbootclasspath/p:/srv/gump/public/workspace/xml-xerces2/build/xercesImpl.jar:/srv/gump/public/workspace/xml-commons/java/external/build/xml-apis.jar org.apache.tools.ant.Main -Dgump.merge=/srv/gump/public/gump/work/merge.xml -Dbuild.sysclasspath=only -Dversion=22082009 
[Working Directory: /srv/gump/public/workspace/jmock2]
CLASSPATH: /usr/lib/jvm/java-6-sun/lib/tools.jar:/srv/gump/public/workspace/jmock2/build/classes:/srv/gump/public/workspace/jmock2/lib/objenesis-1.0.jar:/srv/gump/public/workspace/ant/dist/lib/ant-jmf.jar:/srv/gump/public/workspace/ant/dist/lib/ant-swing.jar:/srv/gump/public/workspace/ant/dist/lib/ant-apache-resolver.jar:/srv/gump/public/workspace/ant/dist/lib/ant-apache-xalan2.jar:/srv/gump/public/workspace/ant/dist/lib/ant-trax.jar:/srv/gump/public/workspace/ant/dist/lib/ant-junit.jar:/srv/gump/public/workspace/ant/dist/lib/ant-launcher.jar:/srv/gump/public/workspace/ant/dist/lib/ant-nodeps.jar:/srv/gump/public/workspace/ant/dist/lib/ant.jar:/srv/gump/packages/bsh-2.0b4/bsh-commands-2.0b4.jar:/srv/gump/packages/bsh-2.0b4/bsh-classpath-2.0b4.jar:/srv/gump/packages/bsh-2.0b4/bsh-core-2.0b4.jar:/srv/gump/packages/bsh-2.0b4/bsh-bsf-2.0b4.jar:/srv/gump/packages/bsh-2.0b4/bsh-2.0b4.jar:/srv/gump/packages/bsh-2.0b4/bsh-reflect-2.0b4.jar:/srv/gump/packages/bsh-2.0b4/bsh-util-2.0b4.
 jar:/srv/gump/packages/cglib/cglib-nodep-2.1_3.jar:/srv/gump/public/workspace/hamcrest/hamcrest-java/build/hamcrest-core-22082009.jar:/srv/gump/public/workspace/hamcrest/hamcrest-java/build/hamcrest-library-22082009.jar:/srv/gump/public/workspace/junit/dist/junit-22082009.jar:/srv/gump/packages/junit3.8.1/junit.jar:/srv/gump/public/workspace/xml-commons/java/external/build/xml-apis-ext.jar
---------------------------------------------
    [javac] location: class org.jmock.test.unit.lib.CurrentStateMatcherTest
    [javac]         assertTrue("should match", isNotCurrently("S").matches(stateMachine));
    [javac]         ^
    [javac] /srv/gump/public/workspace/jmock2/test/org/jmock/test/unit/lib/CurrentStateMatcherTest.java:38: cannot find symbol
    [javac] symbol  : method assertTrue(java.lang.String,boolean)
    [javac] location: class org.jmock.test.unit.lib.CurrentStateMatcherTest
    [javac]         assertTrue("should not match", !isCurrentlyS.matches(null));
    [javac]         ^
    [javac] /srv/gump/public/workspace/jmock2/test/org/jmock/test/unit/lib/CurrentStateMatcherTest.java:42: cannot find symbol
    [javac] symbol  : method assertTrue(java.lang.String,boolean)
    [javac] location: class org.jmock.test.unit.lib.CurrentStateMatcherTest
    [javac]         assertTrue("should not match", !isCurrentlyS.matches("something else"));
    [javac]         ^
    [javac] /srv/gump/public/workspace/jmock2/test/org/jmock/test/unit/lib/CurrentStateMatcherTest.java:46: cannot find symbol
    [javac] symbol  : method assertEquals(java.lang.String,java.lang.String)
    [javac] location: class org.jmock.test.unit.lib.CurrentStateMatcherTest
    [javac]         assertEquals("a state machine that is S", asString(isCurrently("S")));
    [javac]         ^
    [javac] /srv/gump/public/workspace/jmock2/test/org/jmock/test/unit/lib/CurrentStateMatcherTest.java:47: cannot find symbol
    [javac] symbol  : method assertEquals(java.lang.String,java.lang.String)
    [javac] location: class org.jmock.test.unit.lib.CurrentStateMatcherTest
    [javac]         assertEquals("a state machine that is not S", asString(isNotCurrently("S")));
    [javac]         ^
    [javac] /srv/gump/public/workspace/jmock2/test/org/jmock/test/unit/lib/CurrentStateMatcherTest.java:53: cannot find symbol
    [javac] symbol  : method assertMismatchDescription(java.lang.String,org.hamcrest.Matcher<org.jmock.States>,org.jmock.States)
    [javac] location: class org.jmock.test.unit.lib.CurrentStateMatcherTest
    [javac]         assertMismatchDescription("was not S", isCurrently("S"), stateMachine);
    [javac]         ^
    [javac] /srv/gump/public/workspace/jmock2/test/org/jmock/test/unit/lib/CurrentStateMatcherTest.java:56: method does not override or implement a method from a supertype
    [javac]     @Override
    [javac]     ^
    [javac] /srv/gump/public/workspace/jmock2/test/org/jmock/test/unit/support/SyntheticEmptyInterfaceClassLoader.java:35: cannot find symbol
    [javac] symbol  : variable COMPUTE_MAXS
    [javac] location: class net.sf.cglib.asm.ClassWriter
    [javac]         ClassWriter writer = new ClassWriter(ClassWriter.COMPUTE_MAXS);
    [javac]                                                         ^
    [javac] /srv/gump/public/workspace/jmock2/test/org/jmock/test/unit/support/SyntheticEmptyInterfaceClassLoader.java:35: internal error; cannot instantiate ClassWriter(boolean) at net.sf.cglib.asm.ClassWriter to ()
    [javac]         ClassWriter writer = new ClassWriter(ClassWriter.COMPUTE_MAXS);
    [javac]                              ^
    [javac] /srv/gump/public/workspace/jmock2/test/org/jmock/test/unit/support/SyntheticEmptyInterfaceClassLoader.java:36: visit(int,int,java.lang.String,java.lang.String,java.lang.String[],java.lang.String) in net.sf.cglib.asm.ClassWriter cannot be applied to (int,int,java.lang.String,<nulltype>,java.lang.String,<nulltype>)
    [javac]                 writer.visit(CLASS_FORMAT_VERSION,
    [javac]                       ^
    [javac] Note: /srv/gump/public/workspace/jmock2/src/org/jmock/integration/junit4/JMock.java uses or overrides a deprecated API.
    [javac] Note: Recompile with -Xlint:deprecation for details.
    [javac] 22 errors

BUILD FAILED
/srv/gump/public/workspace/jmock2/build.xml:61: Compile failed; see the compiler error output for details.

Total time: 4 seconds
---------------------------------------------

To subscribe to this information via syndicated feeds:
- RSS: http://vmgump.apache.org/gump/public/jmock2/jmock2/rss.xml
- Atom: http://vmgump.apache.org/gump/public/jmock2/jmock2/atom.xml

============================== Gump Tracking Only ===
Produced by Gump version 2.3.
Gump Run 25000022082009, vmgump:vmgump-public:25000022082009
Gump E-mail Identifier (unique within run) #10.

*********************************************************** G U M P
[GUMP@vmgump]: Project apr-iconv-configure (in module apr-iconv) failed
To whom it may engage...
        
This is an automated request, but not an unsolicited one. For 
more information please visit http://gump.apache.org/nagged.html, 
and/or contact the folk at general@gump.apache.org.

Project apr-iconv-configure has an issue affecting its community integration.
This issue affects 2 projects,
 and has been outstanding for 66 runs.
The current state of this project is 'Failed', with reason 'Build Failed'.
For reference only, the following projects are affected by this:
    - apr-iconv-configure :  Apache Portable Runtime
    - apr-iconv-make :  Apache Portable Runtime


Full details are available at:
    http://vmgump.apache.org/gump/public/apr-iconv/apr-iconv-configure/index.html

That said, some information snippets are provided here.

The following annotations (debug/informational/warning/error messages) were provided:
 -INFO- Failed with reason build failed



The following work was performed:
http://vmgump.apache.org/gump/public/apr-iconv/apr-iconv-configure/gump_work/buildscript_apr-iconv_apr-iconv-configure.html
Work Name: buildscript_apr-iconv_apr-iconv-configure (Type: Build)
Work ended in a state of : Failed
Elapsed: 1 sec
Command Line: /srv/gump/public/workspace/apr-iconv/configure --with-apr=/srv/gump/public/workspace/apr/dest-22082009 --prefix=/srv/gump/public/workspace/apr-iconv/dest-22082009 
[Working Directory: /srv/gump/public/workspace/apr-iconv]
---------------------------------------------
checking for gawk... no
checking for mawk... mawk
checking for a BSD-compatible install... /usr/bin/install -c
checking for APR... configure: error: the --with-apr parameter is incorrect. It must specify an install prefix, a build directory, or an apr-config file.
---------------------------------------------

To subscribe to this information via syndicated feeds:
- RSS: http://vmgump.apache.org/gump/public/apr-iconv/apr-iconv-configure/rss.xml
- Atom: http://vmgump.apache.org/gump/public/apr-iconv/apr-iconv-configure/atom.xml

============================== Gump Tracking Only ===
Produced by Gump version 2.3.
Gump Run 25000022082009, vmgump:vmgump-public:25000022082009
Gump E-mail Identifier (unique within run) #11.

*********************************************************** G U M P
[GUMP@vmgump]: Project derby (in module db-derby) failed
To whom it may engage...
        
This is an automated request, but not an unsolicited one. For 
more information please visit http://gump.apache.org/nagged.html, 
and/or contact the folk at general@gump.apache.org.

Project derby has an issue affecting its community integration.
This issue affects 1 projects,
 and has been outstanding for 4 runs.
The current state of this project is 'Failed', with reason 'Build Failed'.
For reference only, the following projects are affected by this:
    - derby :  Apache Derby, 100% Java relational database.


Full details are available at:
    http://vmgump.apache.org/gump/public/db-derby/derby/index.html

That said, some information snippets are provided here.

The following annotations (debug/informational/warning/error messages) were provided:
 -INFO- Failed with reason build failed
 -INFO- Failed to extract fallback artifacts from Gump Repository



The following work was performed:
http://vmgump.apache.org/gump/public/db-derby/derby/gump_work/build_db-derby_derby.html
Work Name: build_db-derby_derby (Type: Build)
Work ended in a state of : Failed
Elapsed: 1 min 17 secs
Command Line: /usr/lib/jvm/java-6-sun/bin/java -Djava.awt.headless=true -Xbootclasspath/p:/srv/gump/public/workspace/xml-commons/java/external/build/xml-apis.jar:/srv/gump/public/workspace/xml-xerces2/build/xercesImpl.jar:/srv/gump/public/workspace/xml-xalan/build/serializer.jar:/srv/gump/public/workspace/xml-xalan/build/xalan-unbundled.jar org.apache.tools.ant.Main -Dgump.merge=/srv/gump/public/gump/work/merge.xml -Dbuild.sysclasspath=only -Dsane=false gump_all 
[Working Directory: /srv/gump/public/workspace/db-derby]
CLASSPATH: /usr/lib/jvm/java-6-sun/lib/tools.jar:/srv/gump/public/workspace/db-derby/classes:/srv/gump/public/workspace/ant/dist/lib/ant-jmf.jar:/srv/gump/public/workspace/ant/dist/lib/ant-swing.jar:/srv/gump/public/workspace/ant/dist/lib/ant-apache-resolver.jar:/srv/gump/public/workspace/ant/dist/lib/ant-apache-xalan2.jar:/srv/gump/public/workspace/ant/dist/lib/ant-trax.jar:/srv/gump/public/workspace/ant/dist/lib/ant-junit.jar:/srv/gump/public/workspace/ant/dist/lib/ant-launcher.jar:/srv/gump/public/workspace/ant/dist/lib/ant-nodeps.jar:/srv/gump/public/workspace/ant/dist/lib/ant.jar:/srv/gump/public/workspace/xml-commons/java/external/build/xml-apis-ext.jar:/srv/gump/public/workspace/jakarta-servletapi-5/jsr154/dist/lib/servlet-api.jar:/srv/gump/public/workspace/jakarta-oro/jakarta-oro-22082009.jar:/srv/gump/packages/javacc-3.1/bin/lib/javacc.jar:/srv/gump/public/workspace/junit/dist/junit-22082009.jar
---------------------------------------------
engine_169:

compile_reference:
    [javac] Compiling 11 source files to /srv/gump/public/workspace/db-derby/classes
    [javac] Compiling 2 source files to /srv/gump/public/workspace/db-derby/classes

compile_authentication:
    [javac] Compiling 2 source files to /srv/gump/public/workspace/db-derby/classes

authentication:

compile_security:
    [javac] Compiling 2 source files to /srv/gump/public/workspace/db-derby/classes

security:

compile_mbeans:
    [javac] Compiling 4 source files to /srv/gump/public/workspace/db-derby/classes

compile_io:

storage:

compile_iapi_error_jsr169:

compile_reference:
    [javac] Compiling 2 source files to /srv/gump/public/workspace/db-derby/classes

compile_util:

compile_types:
    [javac] Compiling 1 source file to /srv/gump/public/workspace/db-derby/classes
    [javac] /srv/gump/public/workspace/db-derby/java/engine/org/apache/derby/impl/jdbc/EmbedStatement.java:60: org.apache.derby.impl.jdbc.EmbedStatement is not abstract and does not override abstract method isWrapperFor(java.lang.Class) in java.sql.Wrapper
    [javac] public class EmbedStatement extends ConnectionChild
    [javac]        ^
    [javac] /srv/gump/public/workspace/db-derby/java/engine/org/apache/derby/impl/jdbc/EmbedResultSetMetaData.java:59: org.apache.derby.impl.jdbc.EmbedResultSetMetaData is not abstract and does not override abstract method isWrapperFor(java.lang.Class) in java.sql.Wrapper
    [javac] public class EmbedResultSetMetaData
    [javac]        ^
    [javac] /srv/gump/public/workspace/db-derby/java/engine/org/apache/derby/impl/jdbc/EmbedDatabaseMetaData.java:88: org.apache.derby.impl.jdbc.EmbedDatabaseMetaData is not abstract and does not override abstract method autoCommitFailureClosesAllResultSets() in java.sql.DatabaseMetaData
    [javac] public class EmbedDatabaseMetaData extends ConnectionChild 
    [javac]        ^
    [javac] 3 errors

BUILD FAILED
/srv/gump/public/workspace/db-derby/build.xml:452: The following error occurred while executing this line:
/srv/gump/public/workspace/db-derby/java/engine/build.xml:79: The following error occurred while executing this line:
/srv/gump/public/workspace/db-derby/java/engine/org/apache/derby/iapi/build.xml:65: The following error occurred while executing this line:
/srv/gump/public/workspace/db-derby/java/engine/org/apache/derby/iapi/types/build.xml:53: Compile failed; see the compiler error output for details.

Total time: 1 minute 17 seconds
---------------------------------------------

To subscribe to this information via syndicated feeds:
- RSS: http://vmgump.apache.org/gump/public/db-derby/derby/rss.xml
- Atom: http://vmgump.apache.org/gump/public/db-derby/derby/atom.xml

============================== Gump Tracking Only ===
Produced by Gump version 2.3.
Gump Run 25000022082009, vmgump:vmgump-public:25000022082009
Gump E-mail Identifier (unique within run) #12.

*********************************************************** G U M P
[GUMP@vmgump]: Project dotnet-antlib-test (in module ant-antlibs) failed
To whom it may engage...
        
This is an automated request, but not an unsolicited one. For 
more information please visit http://gump.apache.org/nagged.html, 
and/or contact the folk at general@gump.apache.org.

Project dotnet-antlib-test has an issue affecting its community integration.
This issue affects 1 projects,
 and has been outstanding for 9 runs.
The current state of this project is 'Failed', with reason 'Build Failed'.
For reference only, the following projects are affected by this:
    - dotnet-antlib-test :  Task and Type Libraries for Apache Ant


Full details are available at:
    http://vmgump.apache.org/gump/public/ant-antlibs/dotnet-antlib-test/index.html

That said, some information snippets are provided here.

The following annotations (debug/informational/warning/error messages) were provided:
 -INFO- Failed with reason build failed



The following work was performed:
http://vmgump.apache.org/gump/public/ant-antlibs/dotnet-antlib-test/gump_work/build_ant-antlibs_dotnet-antlib-test.html
Work Name: build_ant-antlibs_dotnet-antlib-test (Type: Build)
Work ended in a state of : Failed
Elapsed: 18 secs
Command Line: /usr/lib/jvm/java-6-sun/bin/java -Djava.awt.headless=true -Xbootclasspath/p:/srv/gump/public/workspace/xml-xerces2/build/xercesImpl.jar:/srv/gump/public/workspace/xml-commons/java/external/build/xml-apis.jar org.apache.tools.ant.Main -Dgump.merge=/srv/gump/public/gump/work/merge.xml -Dbuild.sysclasspath=only -Dant-testutil.jar=/srv/gump/public/workspace/ant/build/lib/ant-testutil.jar test 
[Working Directory: /srv/gump/public/workspace/ant-antlibs/dotnet]
CLASSPATH: /usr/lib/jvm/java-6-sun/lib/tools.jar:/srv/gump/public/workspace/ant-antlibs/dotnet/build/test-classes:/srv/gump/public/workspace/ant/dist/lib/ant-jmf.jar:/srv/gump/public/workspace/ant/dist/lib/ant-swing.jar:/srv/gump/public/workspace/ant/dist/lib/ant-apache-resolver.jar:/srv/gump/public/workspace/ant/dist/lib/ant-apache-xalan2.jar:/srv/gump/public/workspace/ant/dist/lib/ant-trax.jar:/srv/gump/public/workspace/ant/dist/lib/ant-junit.jar:/srv/gump/public/workspace/ant/dist/lib/ant-launcher.jar:/srv/gump/public/workspace/ant/dist/lib/ant-nodeps.jar:/srv/gump/public/workspace/ant/dist/lib/ant.jar:/srv/gump/public/workspace/ant-antlibs/antunit/build/ant-antunit-22082009.jar:/srv/gump/public/workspace/ant-antlibs/dotnet/build/ant-dotnet-22082009.jar:/srv/gump/public/workspace/xml-commons/java/external/build/xml-apis-ext.jar
---------------------------------------------
[au:antunit] Target: test-passing took 0.007 sec
[au:antunit] Build File: /srv/gump/public/workspace/ant-antlibs/dotnet/src/tests/antunit/dir with spaces/wsdl-test.xml
[au:antunit] Tests run: 1, Failures: 0, Errors: 0, Time elapsed: 0.958 sec
[au:antunit] Target: testWSDL took 0.957 sec
[au:antunit] Build File: /srv/gump/public/workspace/ant-antlibs/dotnet/src/tests/antunit/dotnetexec-test.xml
[au:antunit] Tests run: 2, Failures: 0, Errors: 0, Time elapsed: 1.519 sec
[au:antunit] Target: testCSC took 0.795 sec
[au:antunit] Target: testCSCNoConfig took 0.676 sec
[au:antunit] Build File: /srv/gump/public/workspace/ant-antlibs/dotnet/src/tests/antunit/nunit/nunit-test.xml
[au:antunit] Tests run: 5, Failures: 0, Errors: 0, Time elapsed: 0.146 sec
[au:antunit] Target: test-passing took 0 sec
[au:antunit] Target: test-failing took 0.002 sec
[au:antunit] Target: test-failing-errorproperty took 0.002 sec
[au:antunit] Target: test-failing-with-fail took 0.002 sec
[au:antunit] Target: test-no-assembly took 0.016 sec
[au:antunit] Build File: /srv/gump/public/workspace/ant-antlibs/dotnet/src/tests/antunit/old-core-test.xml
[au:antunit] Tests run: 9, Failures: 0, Errors: 0, Time elapsed: 6.106 sec
[au:antunit] Target: testCSCintrinsicFileset took 0.805 sec
[au:antunit] Target: testCSCresponseFile took 0.728 sec
[au:antunit] Target: testILASM took 0.8 sec
[au:antunit] Target: testCSCdll took 0.664 sec
[au:antunit] Target: testILDASM took 0.863 sec
[au:antunit] Target: testILDASM_empty took 0.059 sec
[au:antunit] Target: testJsharp took 0.152 sec
[au:antunit] Target: testCSCResources took 0.999 sec
[au:antunit] Target: testCSC took 0.826 sec
[au:antunit] Build File: /srv/gump/public/workspace/ant-antlibs/dotnet/src/tests/antunit/wsdl2dotnet-test.xml
[au:antunit] Tests run: 15, Failures: 0, Errors: 0, Time elapsed: 3.973 sec
[au:antunit] Target: testSchemaMustBeSet took 0.03 sec
[au:antunit] Target: testLocalWsdlVB took 0.037 sec
[au:antunit] Target: testInvalidExtraOps took 0.019 sec
[au:antunit] Target: testSrcIsMissing took 0.018 sec
[au:antunit] Target: testNoParams took 0.01 sec
[au:antunit] Target: testBothSrc took 0.03 sec
[au:antunit] Target: testSchemaFileMustHaveOneOptionOnly took 0.025 sec
[au:antunit] Target: testLocalWsdl took 1.433 sec
[au:antunit] Target: testSrcIsDir took 0.019 sec
[au:antunit] Target: testLocalWsdlServerVB took 0.024 sec
[au:antunit] Target: testLocalWsdlServer took 1.889 sec
[au:antunit] Target: testNoSrc took 0.014 sec
[au:antunit] Target: testSchemaFileMustExist took 0.01 sec
[au:antunit] Target: testInvalidExtraOpsVB took 0.009 sec
[au:antunit] Target: testDestIsDir took 0.008 sec

test:

BUILD FAILED
/srv/gump/public/workspace/ant-antlibs/dotnet/common/build.xml:223: At least one AntUnit test has failed.

Total time: 18 seconds
---------------------------------------------

To subscribe to this information via syndicated feeds:
- RSS: http://vmgump.apache.org/gump/public/ant-antlibs/dotnet-antlib-test/rss.xml
- Atom: http://vmgump.apache.org/gump/public/ant-antlibs/dotnet-antlib-test/atom.xml

============================== Gump Tracking Only ===
Produced by Gump version 2.3.
Gump Run 25000022082009, vmgump:vmgump-public:25000022082009
Gump E-mail Identifier (unique within run) #13.

*********************************************************** G U M P
[GUMP@vmgump]: Project emma (in module emma) failed
To whom it may engage...
        
This is an automated request, but not an unsolicited one. For 
more information please visit http://gump.apache.org/nagged.html, 
and/or contact the folk at general@gump.apache.org.

Project emma has an issue affecting its community integration.
This issue affects 1 projects,
 and has been outstanding for 443 runs.
The current state of this project is 'Failed', with reason 'Build Failed'.
For reference only, the following projects are affected by this:
    - emma :  code coverage tool


Full details are available at:
    http://vmgump.apache.org/gump/public/emma/emma/index.html

That said, some information snippets are provided here.

The following annotations (debug/informational/warning/error messages) were provided:
 -INFO- Failed with reason build failed
 -INFO- Failed to extract fallback artifacts from Gump Repository



The following work was performed:
http://vmgump.apache.org/gump/public/emma/emma/gump_work/build_emma_emma.html
Work Name: build_emma_emma (Type: Build)
Work ended in a state of : Failed
Elapsed: 6 secs
Command Line: /usr/lib/jvm/java-6-sun/bin/java -Djava.awt.headless=true -Xbootclasspath/p:/srv/gump/public/workspace/xml-commons/java/external/build/xml-apis.jar:/srv/gump/public/workspace/xml-xerces2/build/xercesImpl.jar org.apache.tools.ant.Main -Dgump.merge=/srv/gump/public/gump/work/merge.xml -Dbuild.sysclasspath=only -Dapp.short.name=emma-22082009 
[Working Directory: /srv/gump/public/workspace/emma]
CLASSPATH: /usr/lib/jvm/java-6-sun/lib/tools.jar:/srv/gump/public/workspace/emma/out/core/classes:/srv/gump/public/workspace/emma/out/ant/classes:/srv/gump/public/workspace/emma/lib/internal/stamptool.jar:/srv/gump/public/workspace/ant/dist/lib/ant-jmf.jar:/srv/gump/public/workspace/ant/dist/lib/ant-swing.jar:/srv/gump/public/workspace/ant/dist/lib/ant-apache-resolver.jar:/srv/gump/public/workspace/ant/dist/lib/ant-apache-xalan2.jar:/srv/gump/public/workspace/ant/dist/lib/ant-trax.jar:/srv/gump/public/workspace/ant/dist/lib/ant-junit.jar:/srv/gump/public/workspace/ant/dist/lib/ant-launcher.jar:/srv/gump/public/workspace/ant/dist/lib/ant-nodeps.jar:/srv/gump/public/workspace/ant/dist/lib/ant.jar:/srv/gump/public/workspace/xml-commons/java/external/build/xml-apis-ext.jar
---------------------------------------------
timestamp:

-pre-compile:

core.bootstrap.compile:
    [javac] Compiling 2 source files to /srv/gump/public/workspace/emma/out/core/classes
    [javac] 
    [javac]           WARNING
    [javac] 
    [javac] The -source switch defaults to 1.5 in JDK 1.5 and 1.6.
    [javac] If you specify -target 1.2 you now must also specify -source 1.2.
    [javac] Ant will implicitly add -source 1.2 for you.  Please change your build file.

core.java14.compile:
    [javac] Compiling 1 source file to /srv/gump/public/workspace/emma/out/core/classes
    [javac] 
    [javac]           WARNING
    [javac] 
    [javac] The -source switch defaults to 1.5 in JDK 1.5 and 1.6.
    [javac] If you specify -target 1.2 you now must also specify -source 1.2.
    [javac] Ant will implicitly add -source 1.2 for you.  Please change your build file.

core.java13.compile:
    [javac] Compiling 1 source file to /srv/gump/public/workspace/emma/out/core/classes
    [javac] 
    [javac]           WARNING
    [javac] 
    [javac] The -source switch defaults to 1.5 in JDK 1.5 and 1.6.
    [javac] If you specify -target 1.2 you now must also specify -source 1.2.
    [javac] Ant will implicitly add -source 1.2 for you.  Please change your build file.

core.compile:
    [javac] Compiling 175 source files to /srv/gump/public/workspace/emma/out/core/classes
    [javac] 
    [javac]           WARNING
    [javac] 
    [javac] The -source switch defaults to 1.5 in JDK 1.5 and 1.6.
    [javac] If you specify -target 1.2 you now must also specify -source 1.2.
    [javac] Ant will implicitly add -source 1.2 for you.  Please change your build file.
    [javac] /srv/gump/public/workspace/emma/core/java12/com/vladium/emma/run/InstrClassLoader.java:346: reference to CodeSource is ambiguous, both method CodeSource(java.net.URL,java.security.cert.Certificate[]) in java.security.CodeSource and method CodeSource(java.net.URL,java.security.CodeSigner[]) in java.security.CodeSource match
    [javac]         final CodeSource csrc = new CodeSource (srcURL, null);
    [javac]                                 ^
    [javac] Note: Some input files use or override a deprecated API.
    [javac] Note: Recompile with -Xlint:deprecation for details.
    [javac] 1 error

BUILD FAILED
/srv/gump/public/workspace/emma/build.xml:297: Compile failed; see the compiler error output for details.

Total time: 5 seconds
---------------------------------------------

To subscribe to this information via syndicated feeds:
- RSS: http://vmgump.apache.org/gump/public/emma/emma/rss.xml
- Atom: http://vmgump.apache.org/gump/public/emma/emma/atom.xml

============================== Gump Tracking Only ===
Produced by Gump version 2.3.
Gump Run 25000022082009, vmgump:vmgump-public:25000022082009
Gump E-mail Identifier (unique within run) #15.

*********************************************************** G U M P
[GUMP@vmgump]: Project logging-log4cxx-configure (in module logging-log4cxx) failed
To whom it may engage...
        
This is an automated request, but not an unsolicited one. For 
more information please visit http://gump.apache.org/nagged.html, 
and/or contact the folk at general@gump.apache.org.

Project logging-log4cxx-configure has an issue affecting its community integration.
This issue affects 3 projects,
 and has been outstanding for 66 runs.
The current state of this project is 'Failed', with reason 'Build Failed'.
For reference only, the following projects are affected by this:
    - logging-log4cxx-configure :  Apache log4cxx
    - logging-log4cxx-make :  Apache log4cxx
    - logging-log4cxx-make-install :  Apache log4cxx


Full details are available at:
    http://vmgump.apache.org/gump/public/logging-log4cxx/logging-log4cxx-configure/index.html

That said, some information snippets are provided here.

The following annotations (debug/informational/warning/error messages) were provided:
 -DEBUG- Dependency on apr-make-install exists, no need to add for property --with-apr.
 -DEBUG- Dependency on apr-util-make-install exists, no need to add for property --with-apr-util.
 -INFO- Failed with reason build failed



The following work was performed:
http://vmgump.apache.org/gump/public/logging-log4cxx/logging-log4cxx-configure/gump_work/buildscript_logging-log4cxx_logging-log4cxx-configure.html
Work Name: buildscript_logging-log4cxx_logging-log4cxx-configure (Type: Build)
Work ended in a state of : Failed
Elapsed: 28 secs
Command Line: /srv/gump/public/workspace/logging-log4cxx/configure --with-apr-util=/srv/gump/public/workspace/apr-util --with-apr=/srv/gump/public/workspace/apr --prefix=/srv/gump/public/workspace/logging-log4cxx/dest-22082009 
[Working Directory: /srv/gump/public/workspace/logging-log4cxx]
---------------------------------------------
checking for f95... no
checking for fort... no
checking for ifort... no
checking for ifc... no
checking for efc... no
checking for pgf95... no
checking for lf95... no
checking for ftn... no
checking whether we are using the GNU Fortran 77 compiler... no
checking whether  accepts -g... no
checking the maximum length of command line arguments... 98304
checking command to parse /usr/bin/nm -B output from ccache gcc object... ok
checking for objdir... .libs
checking for ar... ar
checking for ranlib... ranlib
checking for strip... strip
checking if ccache gcc supports -fno-rtti -fno-exceptions... no
checking for ccache gcc option to produce PIC... -fPIC
checking if ccache gcc PIC flag -fPIC works... yes
checking if ccache gcc static flag -static works... yes
checking if ccache gcc supports -c -o file.o... yes
checking whether the ccache gcc linker (/usr/bin/ld) supports shared libraries... yes
checking whether -lc should be explicitly linked in... no
checking dynamic linker characteristics... GNU/Linux ld.so
checking how to hardcode library paths into programs... immediate
checking whether stripping libraries is possible... yes
checking if libtool supports shared libraries... yes
checking whether to build shared libraries... yes
checking whether to build static libraries... yes
configure: creating libtool
appending configuration tag "CXX" to libtool
checking for ld used by ccache g++... /usr/bin/ld
checking if the linker (/usr/bin/ld) is GNU ld... yes
checking whether the ccache g++ linker (/usr/bin/ld) supports shared libraries... yes
checking for ccache g++ option to produce PIC... -fPIC
checking if ccache g++ PIC flag -fPIC works... yes
checking if ccache g++ static flag -static works... yes
checking if ccache g++ supports -c -o file.o... yes
checking whether the ccache g++ linker (/usr/bin/ld) supports shared libraries... yes
checking dynamic linker characteristics... GNU/Linux ld.so
(cached) (cached) checking how to hardcode library paths into programs... immediate
appending configuration tag "F77" to libtool
checking for a BSD-compatible install... /usr/bin/install -c
checking whether make sets $(MAKE)... (cached) yes
checking whether we are using the GNU C++ compiler... (cached) yes
checking whether ccache g++ accepts -g... (cached) yes
checking dependency style of ccache g++... (cached) gcc3
checking how to run the C++ preprocessor... ccache g++ -E
checking for doxygen... no
checking for APR... configure: error: the --with-apr parameter is incorrect. It must specify an install prefix, a build directory, or an apr-config file.
---------------------------------------------

To subscribe to this information via syndicated feeds:
- RSS: http://vmgump.apache.org/gump/public/logging-log4cxx/logging-log4cxx-configure/rss.xml
- Atom: http://vmgump.apache.org/gump/public/logging-log4cxx/logging-log4cxx-configure/atom.xml

============================== Gump Tracking Only ===
Produced by Gump version 2.3.
Gump Run 25000022082009, vmgump:vmgump-public:25000022082009
Gump E-mail Identifier (unique within run) #16.

*********************************************************** G U M P
[GUMP@vmgump]: Project jython (in module jython) failed
To whom it may engage...
        
This is an automated request, but not an unsolicited one. For 
more information please visit http://gump.apache.org/nagged.html, 
and/or contact the folk at general@gump.apache.org.

Project jython has an issue affecting its community integration.
This issue affects 1 projects,
 and has been outstanding for 72 runs.
The current state of this project is 'Failed', with reason 'Build Failed'.
For reference only, the following projects are affected by this:
    - jython :  Java Python


Full details are available at:
    http://vmgump.apache.org/gump/public/jython/jython/index.html

That said, some information snippets are provided here.

The following annotations (debug/informational/warning/error messages) were provided:
 -DEBUG- Sole output [jython.jar] identifier set to project name
 -INFO- Failed with reason build failed
 -INFO- Failed to extract fallback artifacts from Gump Repository



The following work was performed:
http://vmgump.apache.org/gump/public/jython/jython/gump_work/build_jython_jython.html
Work Name: build_jython_jython (Type: Build)
Work ended in a state of : Failed
Elapsed: 1 min 12 secs
Command Line: /usr/lib/jvm/java-6-sun/bin/java -Djava.awt.headless=true -Xbootclasspath/p:/srv/gump/public/workspace/xml-commons/java/external/build/xml-apis.jar:/srv/gump/public/workspace/xml-xerces2/build/xercesImpl.jar org.apache.tools.ant.Main -Dgump.merge=/srv/gump/public/gump/work/merge.xml -Dbuild.sysclasspath=only -DdistDir=dist -DoutputDir=build jar 
[Working Directory: /srv/gump/public/workspace/jython]
CLASSPATH: /usr/lib/jvm/java-6-sun/lib/tools.jar:/srv/gump/public/workspace/jython/build/classes:/srv/gump/public/workspace/jython/extlibs/constantine-0.4.jar:/srv/gump/public/workspace/jython/extlibs/jna.jar:/srv/gump/public/workspace/jython/extlibs/jna-posix.jar:/srv/gump/public/workspace/jython/extlibs/libreadline-java-0.8.jar:/srv/gump/public/workspace/ant/dist/lib/ant-jmf.jar:/srv/gump/public/workspace/ant/dist/lib/ant-swing.jar:/srv/gump/public/workspace/ant/dist/lib/ant-apache-resolver.jar:/srv/gump/public/workspace/ant/dist/lib/ant-apache-xalan2.jar:/srv/gump/public/workspace/ant/dist/lib/ant-trax.jar:/srv/gump/public/workspace/ant/dist/lib/ant-junit.jar:/srv/gump/public/workspace/ant/dist/lib/ant-launcher.jar:/srv/gump/public/workspace/ant/dist/lib/ant-nodeps.jar:/srv/gump/public/workspace/ant/dist/lib/ant.jar:/srv/gump/packages/junit3.8.1/junit.jar:/srv/gump/public/workspace/xml-commons/java/build/resolver.jar:/srv/gump/packages/antlr/antlr-3.1.3.jar:/srv/gump/publi
 c/workspace/asm/output/dist/lib/asm-analysis-22082009.jar:/srv/gump/public/workspace/asm/output/dist/lib/asm-util-22082009.jar:/srv/gump/public/workspace/asm/output/dist/lib/asm-xml-22082009.jar:/srv/gump/public/workspace/asm/output/dist/lib/asm-commons-22082009.jar:/srv/gump/public/workspace/asm/output/dist/lib/asm-22082009.jar:/srv/gump/public/workspace/asm/output/dist/lib/asm-tree-22082009.jar:/srv/gump/public/workspace/jakarta-servletapi-5/jsr154/dist/lib/servlet-api.jar:/srv/gump/public/workspace/jline/target/jline-0.9.95-SNAPSHOT.jar:/srv/gump/public/workspace/xml-commons/java/external/build/xml-apis-ext.jar
---------------------------------------------
    [javac] 1 warning
    [javac] Compiling 73 source files to /srv/gump/public/workspace/jython/build/classes
    [javac] warning: [path] bad path element "/srv/gump/public/workspace/asm/output/dist/lib/asm-attrs-22082009.jar": no such file or directory
    [javac] Note: /srv/gump/public/workspace/jython/tests/java/javatests/PySetInJavaTest.java uses unchecked or unsafe operations.
    [javac] Note: Recompile with -Xlint:unchecked for details.
    [javac] 1 warning
    [javac] Compiling 1 source file to /srv/gump/public/workspace/jython/tests/data/initializer
    [javac] warning: [path] bad path element "/srv/gump/public/workspace/asm/output/dist/lib/asm-attrs-22082009.jar": no such file or directory
    [javac] 1 warning
     [copy] Copying 1 file to /srv/gump/public/workspace/jython/build/classes/org/python/modules
     [copy] Copying 2 files to /srv/gump/public/workspace/jython/build/classes
     [copy] Copying 1 file to /srv/gump/public/workspace/jython/build/classes/META-INF/services

expose:
   [expose] Exposing 160 classes

BUILD FAILED
/srv/gump/public/workspace/jython/build.xml:559: java.lang.RuntimeException: java.lang.ClassNotFoundException: org.python.core.PyObject
	at org.objectweb.asm.ClassWriter.getCommonSuperClass(Unknown Source)
	at org.objectweb.asm.ClassWriter.a(Unknown Source)
	at org.objectweb.asm.Frame.a(Unknown Source)
	at org.objectweb.asm.Frame.a(Unknown Source)
	at org.objectweb.asm.MethodWriter.visitMaxs(Unknown Source)
	at org.python.expose.generate.Exposer.endMethod(Exposer.java:213)
	at org.python.expose.generate.DescriptorExposer.generateMethodGetter(DescriptorExposer.java:145)
	at org.python.expose.generate.DescriptorExposer.generate(DescriptorExposer.java:108)
	at org.python.expose.generate.Exposer.generate(Exposer.java:107)
	at org.python.expose.generate.ExposeTask.generate(ExposeTask.java:71)
	at org.python.expose.generate.ExposeTask.expose(ExposeTask.java:59)
	at org.python.expose.generate.ExposeTask.process(ExposeTask.java:39)
	at org.python.util.FileNameMatchingTask.execute(FileNameMatchingTask.java:70)
	at org.apache.tools.ant.UnknownElement.execute(UnknownElement.java:291)
	at sun.reflect.NativeMethodAccessorImpl.invoke0(Native Method)
	at sun.reflect.NativeMethodAccessorImpl.invoke(NativeMethodAccessorImpl.java:39)
	at sun.reflect.DelegatingMethodAccessorImpl.invoke(DelegatingMethodAccessorImpl.java:25)
	at java.lang.reflect.Method.invoke(Method.java:597)
	at org.apache.tools.ant.dispatch.DispatchUtils.execute(DispatchUtils.java:106)
	at org.apache.tools.ant.Task.perform(Task.java:348)
	at org.apache.tools.ant.Target.execute(Target.java:390)
	at org.apache.tools.ant.Target.performTasks(Target.java:411)
	at org.apache.tools.ant.Project.executeSortedTargets(Project.java:1361)
	at org.apache.tools.ant.Project.executeTarget(Project.java:1330)
	at org.apache.tools.ant.helper.DefaultExecutor.executeTargets(DefaultExecutor.java:41)
	at org.apache.tools.ant.Project.executeTargets(Project.java:1213)
	at org.apache.tools.ant.Main.runBuild(Main.java:775)
	at org.apache.tools.ant.Main.startAnt(Main.java:217)
	at org.apache.tools.ant.Main.start(Main.java:179)
	at org.apache.tools.ant.Main.main(Main.java:268)

Total time: 1 minute 11 seconds
---------------------------------------------

To subscribe to this information via syndicated feeds:
- RSS: http://vmgump.apache.org/gump/public/jython/jython/rss.xml
- Atom: http://vmgump.apache.org/gump/public/jython/jython/atom.xml

============================== Gump Tracking Only ===
Produced by Gump version 2.3.
Gump Run 25000022082009, vmgump:vmgump-public:25000022082009
Gump E-mail Identifier (unique within run) #17.

*********************************************************** G U M P
[GUMP@vmgump]: Project slf4j-test (in module slf4j) failed
To whom it may engage...
        
This is an automated request, but not an unsolicited one. For 
more information please visit http://gump.apache.org/nagged.html, 
and/or contact the folk at general@gump.apache.org.

Project slf4j-test has an issue affecting its community integration.
This issue affects 1 projects,
 and has been outstanding for 58 runs.
The current state of this project is 'Failed', with reason 'Build Failed'.
For reference only, the following projects are affected by this:
    - slf4j-test :  Simple Logging Facade for Java


Full details are available at:
    http://vmgump.apache.org/gump/public/slf4j/slf4j-test/index.html

That said, some information snippets are provided here.

The following annotations (debug/informational/warning/error messages) were provided:
 -WARNING- Overriding Maven2 settings: [/srv/gump/public/workspace/slf4j/gump_mvn_settings.xml]
 -DEBUG- (Gump generated) Maven2 Settings in: /srv/gump/public/workspace/slf4j/gump_mvn_settings.xml
 -INFO- Failed with reason build failed
 -DEBUG- Maven POM in: /srv/gump/public/workspace/slf4j/pom.xml



The following work was performed:
http://vmgump.apache.org/gump/public/slf4j/slf4j-test/gump_work/build_slf4j_slf4j-test.html
Work Name: build_slf4j_slf4j-test (Type: Build)
Work ended in a state of : Failed
Elapsed: 33 secs
Command Line: mvn --batch-mode --settings /srv/gump/public/workspace/slf4j/gump_mvn_settings.xml package 
[Working Directory: /srv/gump/public/workspace/slf4j]
CLASSPATH: /usr/lib/jvm/java-6-sun/lib/tools.jar:/srv/gump/public/workspace/slf4j/slf4j-migrator/target/slf4j-migrator-1.5.9-SNAPSHOT.jar:/srv/gump/public/workspace/slf4j/slf4j-nop/target/slf4j-nop-1.5.9-SNAPSHOT.jar:/srv/gump/public/workspace/slf4j/log4j-over-slf4j/target/log4j-over-slf4j-1.5.9-SNAPSHOT.jar:/srv/gump/public/workspace/slf4j/slf4j-log4j12/target/slf4j-log4j12-1.5.9-SNAPSHOT.jar:/srv/gump/public/workspace/slf4j/slf4j-jcl/target/slf4j-jcl-1.5.9-SNAPSHOT.jar:/srv/gump/public/workspace/slf4j/slf4j-api/target/slf4j-api-1.5.9-SNAPSHOT.jar:/srv/gump/public/workspace/slf4j/jcl104-over-slf4j/target/jcl104-over-slf4j-1.5.9-SNAPSHOT.jar:/srv/gump/public/workspace/slf4j/slf4j-jdk14/target/slf4j-jdk14-1.5.9-SNAPSHOT.jar:/srv/gump/public/workspace/slf4j/slf4j-simple/target/slf4j-simple-1.5.9-SNAPSHOT.jar:/srv/gump/public/workspace/slf4j/slf4j-ext/target/slf4j-ext-1.5.9-SNAPSHOT.jar:/srv/gump/public/workspace/slf4j/jcl-over-slf4j/target/jcl-over-slf4j-1.5.9-SNAPSHOT.jar:/srv
 /gump/public/workspace/slf4j/jul-to-slf4j/target/jul-to-slf4j-1.5.9-SNAPSHOT.jar
---------------------------------------------
[WARNING] File encoding has not been set, using platform encoding UTF-8, i.e. build is platform dependent!
[WARNING] Using platform encoding (UTF-8 actually) to copy filtered resources, i.e. build is platform dependent!
[INFO] skip non existing resourceDirectory /srv/gump/public/workspace/slf4j/integration/src/main/resources
[INFO] [compiler:compile]
[INFO] Nothing to compile - all classes are up to date
[INFO] [resources:testResources]
[WARNING] Using platform encoding (UTF-8 actually) to copy filtered resources, i.e. build is platform dependent!
[INFO] skip non existing resourceDirectory /srv/gump/public/workspace/slf4j/integration/src/test/resources
[INFO] [compiler:testCompile]
[INFO] Nothing to compile - all classes are up to date
[INFO] [surefire:test]
[INFO] Surefire report directory: /srv/gump/public/workspace/slf4j/integration/target/surefire-reports

-------------------------------------------------------
 T E S T S
-------------------------------------------------------
There are no tests to run.

Results :

Tests run: 0, Failures: 0, Errors: 0, Skipped: 0

[INFO] [jar:jar]
[WARNING] JAR will be empty - no content was marked for inclusion!
[INFO] [antrun:run {execution: ant-test}]
[INFO] Executing tasks
     [echo] compile classpath: /srv/gump/public/workspace/slf4j/integration/target/classes:/srv/gump/public/workspace/slf4j/slf4j-api/target/classes:/srv/gump/public/workspace/mvnlocalrepo/junit/junit/3.8.1/junit-3.8.1.jar:/srv/gump/public/workspace/mvnlocalrepo/ant/ant-junit/1.6.5/ant-junit-1.6.5.jar
     [echo] runtime classpath: /srv/gump/public/workspace/slf4j/integration/target/classes:/srv/gump/public/workspace/slf4j/slf4j-api/target/slf4j-api-1.5.9-SNAPSHOT.jar:/srv/gump/public/workspace/mvnlocalrepo/junit/junit/3.8.1/junit-3.8.1.jar:/srv/gump/public/workspace/mvnlocalrepo/ant/ant-junit/1.6.5/ant-junit-1.6.5.jar
     [echo] test classpath:    /srv/gump/public/workspace/slf4j/integration/target/test-classes:/srv/gump/public/workspace/slf4j/integration/target/classes:/srv/gump/public/workspace/slf4j/slf4j-api/target/slf4j-api-1.5.9-SNAPSHOT.jar:/srv/gump/public/workspace/mvnlocalrepo/junit/junit/3.8.1/junit-3.8.1.jar:/srv/gump/public/workspace/mvnlocalrepo/ant/ant-junit/1.6.5/ant-junit-1.6.5.jar
     [echo] plugin classpath:  /srv/gump/public/workspace/mvnlocalrepo/org/codehaus/plexus/plexus-utils/1.5.6/plexus-utils-1.5.6.jar:/srv/gump/public/workspace/mvnlocalrepo/org/apache/ant/ant-launcher/1.7.1/ant-launcher-1.7.1.jar:/srv/gump/public/workspace/mvnlocalrepo/org/apache/ant/ant/1.7.1/ant-1.7.1.jar:/opt/maven2/lib/maven-2.0.10-uber.jar
Trying to override old definition of datatype junit

init:

testMismatch:
    [junit] Running org.slf4j.VersionMismatchTest
    [junit] Tests run: 1, Failures: 1, Errors: 0, Time elapsed: 0.038 sec
[INFO] ------------------------------------------------------------------------
[ERROR] BUILD ERROR
[INFO] ------------------------------------------------------------------------
[INFO] An Ant BuildException has occured: The following error occurred while executing this line:
/srv/gump/public/workspace/slf4j/integration/build.xml:64: Test org.slf4j.VersionMismatchTest failed

[INFO] ------------------------------------------------------------------------
[INFO] For more information, run Maven with the -e switch
[INFO] ------------------------------------------------------------------------
[INFO] Total time: 31 seconds
[INFO] Finished at: Sat Aug 22 02:37:29 PDT 2009
[INFO] Final Memory: 19M/36M
[INFO] ------------------------------------------------------------------------
---------------------------------------------

To subscribe to this information via syndicated feeds:
- RSS: http://vmgump.apache.org/gump/public/slf4j/slf4j-test/rss.xml
- Atom: http://vmgump.apache.org/gump/public/slf4j/slf4j-test/atom.xml

============================== Gump Tracking Only ===
Produced by Gump version 2.3.
Gump Run 25000022082009, vmgump:vmgump-public:25000022082009
Gump E-mail Identifier (unique within run) #19.

*********************************************************** G U M P
[GUMP@vmgump]: Module tomcat-jasper_tc6 success, but with warnings.
To whom it may engage...
        
This is an automated request, but not an unsolicited one. For 
more information please visit http://gump.apache.org/nagged.html, 
and/or contact the folk at general@gump.apache.org.

Module tomcat-jasper_tc6 contains errors.
The current state of this module is 'Success'.

Full details are available at:
    http://vmgump.apache.org/gump/public/tomcat-jasper_tc6/index.html

That said, some information snippets are provided here.

The following annotations (debug/informational/warning/error messages) were provided:
 -ERROR- *** Failed to update from source control.Stale contents ***



The following work was performed:
http://vmgump.apache.org/gump/public/tomcat-jasper_tc6/gump_work/update_tomcat-jasper_tc6.html
Work Name: update_tomcat-jasper_tc6 (Type: Update)
Work ended in a state of : Failed
Elapsed: 1 sec
Command Line: svn --quiet update --non-interactive tomcat-jasper_tc6 
[Working Directory: /srv/gump/public/workspace/cvs]
---------------------------------------------
svn: Target path '/tomcat/jasper/tc6.0.x' does not exist
---------------------------------------------

To subscribe to this information via syndicated feeds:
- RSS: http://vmgump.apache.org/gump/public/tomcat-jasper_tc6/rss.xml
- Atom: http://vmgump.apache.org/gump/public/tomcat-jasper_tc6/atom.xml

============================== Gump Tracking Only ===
Produced by Gump version 2.3.
Gump Run 25000022082009, vmgump:vmgump-public:25000022082009
Gump E-mail Identifier (unique within run) #20.

*********************************************************** G U M P
[GUMP@vmgump]: Project castor-test (in module castor) failed
To whom it may engage...
        
This is an automated request, but not an unsolicited one. For 
more information please visit http://gump.apache.org/nagged.html, 
and/or contact the folk at general@gump.apache.org.

Project castor-test has an issue affecting its community integration.
This issue affects 1 projects,
 and has been outstanding for 4 runs.
The current state of this project is 'Failed', with reason 'Build Failed'.
For reference only, the following projects are affected by this:
    - castor-test :  Java to XML, SQL, LDAP bindings


Full details are available at:
    http://vmgump.apache.org/gump/public/castor/castor-test/index.html

That said, some information snippets are provided here.

The following annotations (debug/informational/warning/error messages) were provided:
 -WARNING- Overriding Maven2 settings: [/srv/gump/public/workspace/castor/gump_mvn_settings.xml]
 -DEBUG- (Gump generated) Maven2 Settings in: /srv/gump/public/workspace/castor/gump_mvn_settings.xml
 -INFO- Failed with reason build failed
 -DEBUG- Maven POM in: /srv/gump/public/workspace/castor/pom.xml



The following work was performed:
http://vmgump.apache.org/gump/public/castor/castor-test/gump_work/build_castor_castor-test.html
Work Name: build_castor_castor-test (Type: Build)
Work ended in a state of : Failed
Elapsed: 6 mins 21 secs
Command Line: mvn --batch-mode --settings /srv/gump/public/workspace/castor/gump_mvn_settings.xml package 
[Working Directory: /srv/gump/public/workspace/castor]
CLASSPATH: /usr/lib/jvm/java-6-sun/lib/tools.jar
---------------------------------------------
199K downloaded
Downloading: http://localhost:8192/maven2/org/apache/maven/maven-archiver/2.3/maven-archiver-2.3.jar
17K downloaded
Downloading: http://localhost:8192/maven2/org/codehaus/plexus/plexus-archiver/1.0-alpha-9/plexus-archiver-1.0-alpha-9.jar
153K downloaded
Downloading: http://localhost:8192/maven2/org/codehaus/plexus/plexus-io/1.0-alpha-1/plexus-io-1.0-alpha-1.jar
11K downloaded
[INFO] [jar:jar]
[INFO] Preparing source:jar
[WARNING] Removing: jar from forked lifecycle, to prevent recursive invocation.
[INFO] No goals needed for project - skipping
[INFO] [source:jar {execution: default}]
[INFO] Building jar: /srv/gump/public/workspace/castor/core/target/castor-core-1.3.1-SNAPSHOT-sources.jar
[INFO] ------------------------------------------------------------------------
[INFO] Building Castor XML - core
[INFO]    task-segment: [package]
[INFO] ------------------------------------------------------------------------
[INFO] snapshot org.codehaus.mojo:castor-maven-plugin:2.0-SNAPSHOT: checking for updates from Maven Codehaus Snapshots
[WARNING] repository metadata for: 'snapshot org.codehaus.mojo:castor-maven-plugin:2.0-SNAPSHOT' could not be retrieved from repository: Maven Codehaus Snapshots due to an error: Error transferring file
[INFO] Repository 'Maven Codehaus Snapshots' will be blacklisted
[INFO] snapshot org.codehaus.mojo:castor-maven-plugin:2.0-SNAPSHOT: checking for updates from codehaus-snapshots
[WARNING] repository metadata for: 'snapshot org.codehaus.mojo:castor-maven-plugin:2.0-SNAPSHOT' could not be retrieved from repository: codehaus-snapshots due to an error: Error transferring file
[INFO] Repository 'codehaus-snapshots' will be blacklisted
[INFO] ------------------------------------------------------------------------
[ERROR] BUILD ERROR
[INFO] ------------------------------------------------------------------------
[INFO] Error building POM (may not be this project's POM).


Project ID: org.codehaus.mojo:castor-maven-plugin

Reason: POM 'org.codehaus.mojo:castor-maven-plugin' not found in repository: Unable to download the artifact from any repository

  org.codehaus.mojo:castor-maven-plugin:pom:2.0-SNAPSHOT

from the specified remote repositories:
  Maven Codehaus Snapshots (http://snapshots.maven.codehaus.org/maven2/),
  gump-central (http://localhost:8192/maven2),
  codehaus-snapshots (http://snapshots.repository.codehaus.org)

 for project org.codehaus.mojo:castor-maven-plugin


[INFO] ------------------------------------------------------------------------
[INFO] For more information, run Maven with the -e switch
[INFO] ------------------------------------------------------------------------
[INFO] Total time: 6 minutes 20 seconds
[INFO] Finished at: Sat Aug 22 02:47:55 PDT 2009
[INFO] Final Memory: 16M/29M
[INFO] ------------------------------------------------------------------------
---------------------------------------------

To subscribe to this information via syndicated feeds:
- RSS: http://vmgump.apache.org/gump/public/castor/castor-test/rss.xml
- Atom: http://vmgump.apache.org/gump/public/castor/castor-test/atom.xml

============================== Gump Tracking Only ===
Produced by Gump version 2.3.
Gump Run 25000022082009, vmgump:vmgump-public:25000022082009
Gump E-mail Identifier (unique within run) #21.

*********************************************************** G U M P
[GUMP@vmgump]: Project ws-commons-xmlschema (in module ws-axis2-commons) failed
To whom it may engage...
        
This is an automated request, but not an unsolicited one. For 
more information please visit http://gump.apache.org/nagged.html, 
and/or contact the folk at general@gump.apache.org.

Project ws-commons-xmlschema has an issue affecting its community integration.
This issue affects 1 projects,
 and has been outstanding for 253 runs.
The current state of this project is 'Failed', with reason 'Missing Build Outputs'.
For reference only, the following projects are affected by this:
    - ws-commons-xmlschema :  Common stuff for the WS projects.


Full details are available at:
    http://vmgump.apache.org/gump/public/ws-axis2-commons/ws-commons-xmlschema/index.html

That said, some information snippets are provided here.

The following annotations (debug/informational/warning/error messages) were provided:
 -DEBUG- Sole output [ws-commons-xmlschema-22082009.jar] identifier set to project name
 -INFO- Optional dependency velocity-engine prerequisite failed with reason build failed
 -INFO- Optional dependency commons-validator prerequisite failed with reason build failed
 -INFO- Optional dependency commons-beanutils prerequisite failed with reason build failed
 -INFO- Optional dependency commons-logging prerequisite failed with reason build failed
 -DEBUG- (Gump generated) Maven2 Settings in: /srv/gump/public/workspace/ws-axis2-commons/XmlSchema/gump_mvn_settings.xml
 -DEBUG- Maven POM in: /srv/gump/public/workspace/ws-axis2-commons/XmlSchema/pom.xml
 -INFO- Failed with reason missing build outputs
 -ERROR- Missing Output: /srv/gump/public/workspace/ws-axis2-commons/XmlSchema/build/lib/ws-commons-xmlschema-22082009.jar
 -ERROR- No such directory (where output is expected) : /srv/gump/public/workspace/ws-axis2-commons/XmlSchema/build/lib
 -INFO- Failed to extract fallback artifacts from Gump Repository



The following work was performed:
http://vmgump.apache.org/gump/public/ws-axis2-commons/ws-commons-xmlschema/gump_work/build_ws-axis2-commons_ws-commons-xmlschema.html
Work Name: build_ws-axis2-commons_ws-commons-xmlschema (Type: Build)
Work ended in a state of : Success
Elapsed: 1 min 34 secs
Command Line: mvn --batch-mode --settings /srv/gump/public/workspace/ws-axis2-commons/XmlSchema/gump_mvn_settings.xml install 
[Working Directory: /srv/gump/public/workspace/ws-axis2-commons/XmlSchema]
CLASSPATH: /usr/lib/jvm/java-6-sun/lib/tools.jar:/srv/gump/public/workspace/xml-commons/java/external/build/xml-apis-ext.jar:/srv/gump/public/workspace/xmlunit/build/java/lib/xmlunit-sumo-22082009.jar:/srv/gump/public/workspace/xmlunit/build/java/lib/xmlunit-legacy-22082009.jar:/srv/gump/public/workspace/xmlunit/build/java/lib/xmlunit-core-22082009.jar:/srv/gump/public/workspace/ant/dist/lib/ant-jmf.jar:/srv/gump/public/workspace/ant/dist/lib/ant-swing.jar:/srv/gump/public/workspace/ant/dist/lib/ant-apache-resolver.jar:/srv/gump/public/workspace/ant/dist/lib/ant-apache-xalan2.jar:/srv/gump/public/workspace/ant/dist/lib/ant-trax.jar:/srv/gump/public/workspace/ant/dist/lib/ant-junit.jar:/srv/gump/public/workspace/ant/dist/lib/ant-launcher.jar:/srv/gump/public/workspace/ant/dist/lib/ant-nodeps.jar:/srv/gump/public/workspace/ant/dist/lib/ant.jar:/srv/gump/packages/junit3.8.1/junit.jar:/srv/gump/public/workspace/xml-commons/java/build/resolver.jar:/srv/gump/packages/stax/jsr173_1.
 0_api.jar:/srv/gump/packages/stax/jsr173_1.0_ri.jar:/srv/gump/public/workspace/junit/dist/junit-22082009.jar:commons-beanutils-gump-21082009.jar:/srv/gump/public/workspace/apache-commons/collections/build/commons-collections-22082009.jar:commons-logging-gump-21082009.jar:commons-logging-api-gump-21082009.jar:commons-validator-gump-21082009.jar:velocity-gump-21082009.jar:velocity-dep-gump-21082009.jar
---------------------------------------------
Tests run: 1, Failures: 0, Errors: 0, Skipped: 0, Time elapsed: 0.004 sec
Running tests.customext.attrib.CustomExtensionSerializerTest
Tests run: 1, Failures: 0, Errors: 0, Skipped: 0, Time elapsed: 0.011 sec
Running tests.WSCOMMONS377Test
Tests run: 1, Failures: 0, Errors: 0, Skipped: 0, Time elapsed: 0.008 sec
Running tests.FacetsTest
Tests run: 9, Failures: 0, Errors: 0, Skipped: 0, Time elapsed: 0.022 sec
Running tests.TestUnqualifiedSchema
Tests run: 1, Failures: 0, Errors: 0, Skipped: 0, Time elapsed: 0.007 sec
Running tests.AnnotationDeepTest
Tests run: 2, Failures: 0, Errors: 0, Skipped: 0, Time elapsed: 0.007 sec
Running tests.UnionTest
Tests run: 1, Failures: 0, Errors: 0, Skipped: 0, Time elapsed: 0.012 sec
Running tests.CircularSchemaTest
Tests run: 1, Failures: 0, Errors: 0, Skipped: 0, Time elapsed: 0.004 sec
Running tests.GroupTest
Tests run: 1, Failures: 0, Errors: 0, Skipped: 0, Time elapsed: 0.004 sec
Running tests.AnnotationTest
Tests run: 5, Failures: 0, Errors: 0, Skipped: 0, Time elapsed: 0.011 sec
Running tests.TestElementForm
Tests run: 1, Failures: 0, Errors: 0, Skipped: 0, Time elapsed: 0.005 sec
Running tests.TestLocalUnnamedSimpleType
Tests run: 1, Failures: 0, Errors: 0, Skipped: 0, Time elapsed: 0.003 sec
Running tests.RecursiveImportTest
Tests run: 1, Failures: 0, Errors: 0, Skipped: 0, Time elapsed: 0.008 sec
Running tests.NotationTest
Tests run: 1, Failures: 0, Errors: 0, Skipped: 0, Time elapsed: 0.005 sec

Results :

Tests run: 4036, Failures: 0, Errors: 0, Skipped: 3

Downloading: http://localhost:8192/maven2/biz/aQute/bndlib/0.0.311/bndlib-0.0.311.pom
864b downloaded
Downloading: http://localhost:8192/maven2/biz/aQute/bndlib/0.0.311/bndlib-0.0.311.jar
527K downloaded
[INFO] [bundle:bundle]
[INFO] [install:install]
[INFO] Installing /srv/gump/public/workspace/ws-axis2-commons/XmlSchema/target/XmlSchema-2.0-SNAPSHOT.jar to /srv/gump/public/workspace/mvnlocalrepo/org/apache/ws/commons/schema/XmlSchema/2.0-SNAPSHOT/XmlSchema-2.0-SNAPSHOT.jar
[INFO] [bundle:install]
[INFO] Parsing file:/srv/gump/public/workspace/mvnlocalrepo/repository.xml
[INFO] Installing org/apache/ws/commons/schema/XmlSchema/2.0-SNAPSHOT/XmlSchema-2.0-SNAPSHOT.jar
[INFO] Writing OBR metadata
[INFO] ------------------------------------------------------------------------
[INFO] BUILD SUCCESSFUL
[INFO] ------------------------------------------------------------------------
[INFO] Total time: 1 minute 32 seconds
[INFO] Finished at: Sat Aug 22 02:53:35 PDT 2009
[INFO] Final Memory: 21M/48M
[INFO] ------------------------------------------------------------------------
---------------------------------------------

To subscribe to this information via syndicated feeds:
- RSS: http://vmgump.apache.org/gump/public/ws-axis2-commons/ws-commons-xmlschema/rss.xml
- Atom: http://vmgump.apache.org/gump/public/ws-axis2-commons/ws-commons-xmlschema/atom.xml

============================== Gump Tracking Only ===
Produced by Gump version 2.3.
Gump Run 25000022082009, vmgump:vmgump-public:25000022082009
Gump E-mail Identifier (unique within run) #24.

*********************************************************** G U M P
[GUMP@vmgump]: Project ws-commons-axiom (in module ws-axis2-commons) failed
To whom it may engage...
        
This is an automated request, but not an unsolicited one. For 
more information please visit http://gump.apache.org/nagged.html, 
and/or contact the folk at general@gump.apache.org.

Project ws-commons-axiom has an issue affecting its community integration.
This issue affects 2 projects,
 and has been outstanding for 580 runs.
The current state of this project is 'Failed', with reason 'Missing Build Outputs'.
For reference only, the following projects are affected by this:
    - ws-commons-axiom :  Common stuff for the WS projects.
    - ws-commons-axiom-test :  Common stuff for the WS projects.


Full details are available at:
    http://vmgump.apache.org/gump/public/ws-axis2-commons/ws-commons-axiom/index.html

That said, some information snippets are provided here.

The following annotations (debug/informational/warning/error messages) were provided:
 -INFO- Optional dependency xml-security prerequisite failed with reason build failed
 -DEBUG- (Gump generated) Maven2 Settings in: /srv/gump/public/workspace/ws-axis2-commons/axiom/gump_mvn_settings.xml
 -DEBUG- Maven POM in: /srv/gump/public/workspace/ws-axis2-commons/axiom/pom.xml
 -INFO- Failed with reason missing build outputs
 -ERROR- Missing Output: /srv/gump/public/workspace/ws-axis2-commons/axiom/modules/axiom-api/target/axiom-api-SNAPSHOT.jar
 -ERROR- Missing Output: /srv/gump/public/workspace/ws-axis2-commons/axiom/modules/axiom-impl/target/axiom-impl-SNAPSHOT.jar
 -ERROR- Missing Output: /srv/gump/public/workspace/ws-axis2-commons/axiom/modules/axiom-dom/target/axiom-dom-SNAPSHOT.jar
 -ERROR- See Directory Listing Work for Missing Outputs
 -INFO- Failed to extract fallback artifacts from Gump Repository



The following work was performed:
http://vmgump.apache.org/gump/public/ws-axis2-commons/ws-commons-axiom/gump_work/build_ws-axis2-commons_ws-commons-axiom.html
Work Name: build_ws-axis2-commons_ws-commons-axiom (Type: Build)
Work ended in a state of : Success
Elapsed: 2 mins 45 secs
Command Line: mvn --batch-mode -Dmaven.test.skip.exec=true --settings /srv/gump/public/workspace/ws-axis2-commons/axiom/gump_mvn_settings.xml install 
[Working Directory: /srv/gump/public/workspace/ws-axis2-commons/axiom]
CLASSPATH: /usr/lib/jvm/java-6-sun/lib/tools.jar:/srv/gump/public/workspace/logging-log4j-12/dist/lib/log4j-22082009.jar:/srv/gump/packages/jaf-1.1ea/activation.jar:/srv/gump/packages/javamail-1.4/mail.jar:/srv/gump/packages/javamail-1.4/lib/mailapi.jar:/srv/gump/public/workspace/jaxen/target/jaxen-22082009.jar:/srv/gump/packages/jsse1.0.3/lib/jcert.jar:/srv/gump/packages/jsse1.0.3/lib/jnet.jar:/srv/gump/packages/jsse1.0.3/lib/jsse.jar:/srv/gump/packages/jms1.1/lib/jms.jar:/srv/gump/public/workspace/xml-commons/java/external/build/xml-apis-ext.jar:xml-security-gump-21082009.jar:/srv/gump/public/workspace/xmlunit/build/java/lib/xmlunit-sumo-22082009.jar:/srv/gump/public/workspace/xmlunit/build/java/lib/xmlunit-legacy-22082009.jar:/srv/gump/public/workspace/xmlunit/build/java/lib/xmlunit-core-22082009.jar:/srv/gump/public/workspace/junit/dist/junit-22082009.jar
---------------------------------------------
Downloading: http://localhost:8192/maven2/org/apache/maven/maven-project/2.0.6/maven-project-2.0.6.jar
113K downloaded
Downloading: http://dist.wso2.org/maven2//org/apache/maven/maven-settings/2.0.6/maven-settings-2.0.6.jar
Downloading: http://localhost:8192/maven2/org/apache/maven/maven-settings/2.0.6/maven-settings-2.0.6.jar
47K downloaded
Downloading: http://dist.wso2.org/maven2//org/apache/maven/maven-plugin-registry/2.0.6/maven-plugin-registry-2.0.6.jar
Downloading: http://localhost:8192/maven2/org/apache/maven/maven-plugin-registry/2.0.6/maven-plugin-registry-2.0.6.jar
28K downloaded
Downloading: http://dist.wso2.org/maven2//org/apache/maven/maven-plugin-api/2.0.6/maven-plugin-api-2.0.6.jar
Downloading: http://localhost:8192/maven2/org/apache/maven/maven-plugin-api/2.0.6/maven-plugin-api-2.0.6.jar
12K downloaded
[INFO] [compiler:testCompile]
[INFO] Compiling 9 source files to /srv/gump/public/workspace/ws-axis2-commons/axiom/modules/axiom-integration/target/test-classes
[INFO] [surefire:test]
[INFO] Tests are skipped.
[INFO] [jar:jar]
[WARNING] JAR will be empty - no content was marked for inclusion!
[INFO] Building jar: /srv/gump/public/workspace/ws-axis2-commons/axiom/modules/axiom-integration/target/axiom-integration-1.2.9-SNAPSHOT.jar
[INFO] Preparing source:jar
[WARNING] Removing: jar from forked lifecycle, to prevent recursive invocation.
[INFO] No goals needed for project - skipping
[INFO] [source:jar {execution: default}]
[INFO] Building jar: /srv/gump/public/workspace/ws-axis2-commons/axiom/modules/axiom-integration/target/axiom-integration-1.2.9-SNAPSHOT-sources.jar
[INFO] [install:install]
[INFO] Installing /srv/gump/public/workspace/ws-axis2-commons/axiom/modules/axiom-integration/target/axiom-integration-1.2.9-SNAPSHOT.jar to /srv/gump/public/workspace/mvnlocalrepo/org/apache/ws/commons/axiom/axiom-integration/1.2.9-SNAPSHOT/axiom-integration-1.2.9-SNAPSHOT.jar
[INFO] Installing /srv/gump/public/workspace/ws-axis2-commons/axiom/modules/axiom-integration/target/axiom-integration-1.2.9-SNAPSHOT-sources.jar to /srv/gump/public/workspace/mvnlocalrepo/org/apache/ws/commons/axiom/axiom-integration/1.2.9-SNAPSHOT/axiom-integration-1.2.9-SNAPSHOT-sources.jar
[INFO] 
[INFO] 
[INFO] ------------------------------------------------------------------------
[INFO] Reactor Summary:
[INFO] ------------------------------------------------------------------------
[INFO] Axiom ................................................. SUCCESS [8.954s]
[INFO] Axiom API ............................................. SUCCESS [44.520s]
[INFO] Axiom Impl ............................................ SUCCESS [17.300s]
[INFO] Axiom DOM ............................................. SUCCESS [5.324s]
[INFO] Axiom C14N ............................................ SUCCESS [4.280s]
[INFO] Axiom Test Suite ...................................... SUCCESS [2.376s]
[INFO] Axiom OSGI Test Suite Parent .......................... SUCCESS [0.009s]
[INFO] Axiom OSGI Test Suite - Build ......................... SUCCESS [5.684s]
[INFO] Axiom OSGI Test Suite - Run ........................... SUCCESS [30.163s]
[INFO] Axiom Parser Compatibility Test Suite ................. SUCCESS [19.452s]
[INFO] Axiom Integration Test Suite .......................... SUCCESS [24.151s]
[INFO] ------------------------------------------------------------------------
[INFO] ------------------------------------------------------------------------
[INFO] BUILD SUCCESSFUL
[INFO] ------------------------------------------------------------------------
[INFO] Total time: 2 minutes 43 seconds
[INFO] Finished at: Sat Aug 22 03:09:03 PDT 2009
[INFO] Final Memory: 45M/110M
[INFO] ------------------------------------------------------------------------
---------------------------------------------

To subscribe to this information via syndicated feeds:
- RSS: http://vmgump.apache.org/gump/public/ws-axis2-commons/ws-commons-axiom/rss.xml
- Atom: http://vmgump.apache.org/gump/public/ws-axis2-commons/ws-commons-axiom/atom.xml

============================== Gump Tracking Only ===
Produced by Gump version 2.3.
Gump Run 25000022082009, vmgump:vmgump-public:25000022082009
Gump E-mail Identifier (unique within run) #26.

*********************************************************** G U M P
[GUMP@vmgump]: Project authx-script-test (in module authx) failed
To whom it may engage...
        
This is an automated request, but not an unsolicited one. For 
more information please visit http://gump.apache.org/nagged.html, 
and/or contact the folk at general@gump.apache.org.

Project authx-script-test has an issue affecting its community integration.
This issue affects 1 projects,
 and has been outstanding for 4 runs.
The current state of this project is 'Failed', with reason 'Build Failed'.
For reference only, the following projects are affected by this:
    - authx-script-test :  Apache Authentication and Authorization Framework


Full details are available at:
    http://vmgump.apache.org/gump/public/authx/authx-script-test/index.html

That said, some information snippets are provided here.

The following annotations (debug/informational/warning/error messages) were provided:
 -DEBUG- Dependency on xml-xerces exists, no need to add for property maven.jar.xercesImpl.
 -DEBUG- Dependency on asm exists, no need to add for property maven.jar.asm-util.
 -DEBUG- Dependency on packaged-jmock exists, no need to add for property maven.jar.jmock.
 -WARNING- Overriding Maven properties: [/srv/gump/public/workspace/authx/script/build.properties]
 -DEBUG- (Gump generated) Maven Properties in: /srv/gump/public/workspace/authx/script/build.properties
 -INFO- Failed with reason build failed
 -DEBUG- Maven POM in: /srv/gump/public/workspace/authx/script/project.xml
 -DEBUG- Maven project properties in: /srv/gump/public/workspace/authx/script/project.properties
 -INFO- Project Reports in: /srv/gump/public/workspace/authx/script/target/test-reports



The following work was performed:
http://vmgump.apache.org/gump/public/authx/authx-script-test/gump_work/build_authx_authx-script-test.html
Work Name: build_authx_authx-script-test (Type: Build)
Work ended in a state of : Failed
Elapsed: 6 secs
Command Line: maven --offline test 
[Working Directory: /srv/gump/public/workspace/authx/script]
CLASSPATH: /usr/lib/jvm/java-6-sun/lib/tools.jar:/srv/gump/public/workspace/asm/output/dist/lib/asm-util-22082009.jar:/srv/gump/public/workspace/authx/core/target/authx-core-22082009.jar:/srv/gump/public/workspace/dom4j/build/dom4j.jar:/srv/gump/packages/groovy-1.0-jsr-03/groovy-1.0-jsr-03.jar:/srv/gump/packages/jmock/jmock-1.0.1.jar:/srv/gump/packages/picocontainer-1.1/picocontainer-1.1.jar:/srv/gump/public/workspace/xml-commons/java/external/build/xml-apis-ext.jar:/srv/gump/public/workspace/authx/script/target/authx-script-22082009.jar
---------------------------------------------
java:prepare-filesystem:

java:compile:
    [echo] Compiling to /srv/gump/public/workspace/authx/script/target/classes

java:jar-resources:

test:prepare-filesystem:

test:test-resources:
Copying 4 files to /srv/gump/public/workspace/authx/script/target/test-classes

test:compile:
    [javac] Compiling 17 source files to /srv/gump/public/workspace/authx/script/target/test-classes

test:test:
    [junit] Running org.apache.authx.script.groovy.GroovyRuleLoaderTest
    [junit] Tests run: 1, Failures: 0, Errors: 1, Time elapsed: 0.091 sec
    [junit] [ERROR] TEST org.apache.authx.script.groovy.GroovyRuleLoaderTest FAILED
    [junit] Running org.apache.authx.script.groovy.GroovyScriptClassLoaderTest
    [junit] Tests run: 2, Failures: 0, Errors: 2, Time elapsed: 0.039 sec
    [junit] [ERROR] TEST org.apache.authx.script.groovy.GroovyScriptClassLoaderTest FAILED
    [junit] Running org.apache.authx.script.xml.Dom4JGroupBuilderTest
    [junit] Tests run: 4, Failures: 0, Errors: 0, Time elapsed: 0.316 sec
    [junit] Running org.apache.authx.script.xml.Dom4JRealmBuilderTest
    [junit] Tests run: 2, Failures: 0, Errors: 0, Time elapsed: 0.147 sec
    [junit] Running org.apache.authx.script.xml.Dom4JRuleSetBuilderTest
    [junit] Tests run: 10, Failures: 0, Errors: 0, Time elapsed: 0.158 sec
    [junit] Running org.apache.authx.script.xml.Dom4JRoleBuilderTest
    [junit] Tests run: 3, Failures: 0, Errors: 0, Time elapsed: 0.138 sec
    [junit] Running org.apache.authx.script.common.PicoContainerFactoryTest
    [junit] Tests run: 2, Failures: 0, Errors: 0, Time elapsed: 0.071 sec
    [junit] Running org.apache.authx.script.common.DynamicRuleProxyTest
    [junit] Tests run: 1, Failures: 0, Errors: 1, Time elapsed: 0.036 sec
    [junit] [ERROR] TEST org.apache.authx.script.common.DynamicRuleProxyTest FAILED
    [junit] Running org.apache.authx.script.common.ScriptedRuleSetBuilderTest
    [junit] Tests run: 1, Failures: 0, Errors: 0, Time elapsed: 0.202 sec
    [junit] Running org.apache.authx.script.common.SmartCachingScriptClassLoaderTest
    [junit] Tests run: 2, Failures: 0, Errors: 2, Time elapsed: 0.049 sec
    [junit] [ERROR] TEST org.apache.authx.script.common.SmartCachingScriptClassLoaderTest FAILED

BUILD FAILED
File...... /home/gump/.maven/cache/maven-test-plugin-1.6.2/plugin.jelly
Element... fail
Line...... 181
Column.... 54
There were test failures.
Total time: 5 seconds
Finished at: Sat Aug 22 03:17:25 PDT 2009

---------------------------------------------

To subscribe to this information via syndicated feeds:
- RSS: http://vmgump.apache.org/gump/public/authx/authx-script-test/rss.xml
- Atom: http://vmgump.apache.org/gump/public/authx/authx-script-test/atom.xml

============================== Gump Tracking Only ===
Produced by Gump version 2.3.
Gump Run 25000022082009, vmgump:vmgump-public:25000022082009
Gump E-mail Identifier (unique within run) #28.

*********************************************************** G U M P
[GUMP@vmgump]: Project ws-commons-policy (in module ws-axis2-commons) failed
To whom it may engage...
        
This is an automated request, but not an unsolicited one. For 
more information please visit http://gump.apache.org/nagged.html, 
and/or contact the folk at general@gump.apache.org.

Project ws-commons-policy has an issue affecting its community integration.
This issue affects 1 projects,
 and has been outstanding for 1135 runs.
The current state of this project is 'Failed', with reason 'Missing Build Outputs'.
For reference only, the following projects are affected by this:
    - ws-commons-policy :  Common stuff for the WS projects.


Full details are available at:
    http://vmgump.apache.org/gump/public/ws-axis2-commons/ws-commons-policy/index.html

That said, some information snippets are provided here.

The following annotations (debug/informational/warning/error messages) were provided:
 -DEBUG- Sole output [ws-commons-policy-22082009.jar] identifier set to project name
 -INFO- Optional dependency commons-logging prerequisite failed with reason build failed
 -INFO- Optional dependency ws-commons-axiom failed with reason missing build outputs
 -DEBUG- (Gump generated) Maven2 Settings in: /srv/gump/public/workspace/ws-axis2-commons/neethi/gump_mvn_settings.xml
 -DEBUG- Maven POM in: /srv/gump/public/workspace/ws-axis2-commons/neethi/pom.xml
 -INFO- Failed with reason missing build outputs
 -ERROR- Missing Output: /srv/gump/public/workspace/ws-axis2-commons/neethi/target/ws-commons-policy-22082009.jar
 -ERROR- See Directory Listing Work for Missing Outputs
 -INFO- Failed to extract fallback artifacts from Gump Repository



The following work was performed:
http://vmgump.apache.org/gump/public/ws-axis2-commons/ws-commons-policy/gump_work/build_ws-axis2-commons_ws-commons-policy.html
Work Name: build_ws-axis2-commons_ws-commons-policy (Type: Build)
Work ended in a state of : Success
Elapsed: 20 secs
Command Line: mvn --batch-mode --settings /srv/gump/public/workspace/ws-axis2-commons/neethi/gump_mvn_settings.xml package 
[Working Directory: /srv/gump/public/workspace/ws-axis2-commons/neethi]
CLASSPATH: /usr/lib/jvm/java-6-sun/lib/tools.jar:commons-logging-gump-21082009.jar:commons-logging-api-gump-21082009.jar:/srv/gump/public/workspace/ws-axis2-commons/axiom/modules/axiom-api/target/axiom-api-SNAPSHOT.jar:/srv/gump/public/workspace/ws-axis2-commons/axiom/modules/axiom-impl/target/axiom-impl-SNAPSHOT.jar:/srv/gump/public/workspace/ws-axis2-commons/axiom/modules/axiom-dom/target/axiom-dom-SNAPSHOT.jar:/srv/gump/public/workspace/wsdl4j/build/lib/qname.jar:/srv/gump/public/workspace/wsdl4j/build/lib/wsdl4j.jar
---------------------------------------------
Downloading: http://localhost:8192/maven2/org/codehaus/woodstox/wstx-asl/3.2.4/wstx-asl-3.2.4.pom
1K downloaded
Downloading: http://localhost:8192/maven2/wsdl4j/wsdl4j/1.6.2/wsdl4j-1.6.2.pom
939b downloaded
Downloading: http://localhost:8192/maven2/org/apache/ws/commons/axiom/axiom-api/1.2.8/axiom-api-1.2.8.jar
240K downloaded
Downloading: http://localhost:8192/maven2/org/apache/geronimo/specs/geronimo-activation_1.1_spec/1.0.1/geronimo-activation_1.1_spec-1.0.1.jar
34K downloaded
Downloading: http://localhost:8192/maven2/org/apache/geronimo/specs/geronimo-javamail_1.4_spec/1.2/geronimo-javamail_1.4_spec-1.2.jar
194K downloaded
Downloading: http://localhost:8192/maven2/org/apache/ws/commons/axiom/axiom-impl/1.2.8/axiom-impl-1.2.8.jar
128K downloaded
Downloading: http://localhost:8192/maven2/org/codehaus/woodstox/wstx-asl/3.2.4/wstx-asl-3.2.4.jar
507K downloaded
Downloading: http://localhost:8192/maven2/wsdl4j/wsdl4j/1.6.2/wsdl4j-1.6.2.jar
188K downloaded
[INFO] [compiler:compile]
[INFO] Compiling 18 source files to /srv/gump/public/workspace/ws-axis2-commons/neethi/target/classes
[INFO] [resources:testResources]
[WARNING] Using platform encoding (UTF-8 actually) to copy filtered resources, i.e. build is platform dependent!
[INFO] skip non existing resourceDirectory /srv/gump/public/workspace/ws-axis2-commons/neethi/src/test/resources
[INFO] [compiler:testCompile]
[INFO] Compiling 2 source files to /srv/gump/public/workspace/ws-axis2-commons/neethi/target/test-classes
[INFO] [surefire:test]
[INFO] Surefire report directory: /srv/gump/public/workspace/ws-axis2-commons/neethi/target/surefire-reports

-------------------------------------------------------
 T E S T S
-------------------------------------------------------
Running org.apache.neethi.NormalizeTest
Tests run: 1, Failures: 0, Errors: 0, Skipped: 0, Time elapsed: 0.793 sec

Results :

Tests run: 1, Failures: 0, Errors: 0, Skipped: 0

[INFO] [jar:jar]
[INFO] Building jar: /srv/gump/public/workspace/ws-axis2-commons/neethi/target/neethi-3.0.0-SNAPSHOT.jar
[INFO] Preparing source:jar
[WARNING] Removing: jar from forked lifecycle, to prevent recursive invocation.
[INFO] No goals needed for project - skipping
[INFO] [source:jar {execution: default}]
[INFO] Building jar: /srv/gump/public/workspace/ws-axis2-commons/neethi/target/neethi-3.0.0-SNAPSHOT-sources.jar
[INFO] ------------------------------------------------------------------------
[INFO] BUILD SUCCESSFUL
[INFO] ------------------------------------------------------------------------
[INFO] Total time: 19 seconds
[INFO] Finished at: Sat Aug 22 03:23:37 PDT 2009
[INFO] Final Memory: 19M/34M
[INFO] ------------------------------------------------------------------------
---------------------------------------------

To subscribe to this information via syndicated feeds:
- RSS: http://vmgump.apache.org/gump/public/ws-axis2-commons/ws-commons-policy/rss.xml
- Atom: http://vmgump.apache.org/gump/public/ws-axis2-commons/ws-commons-policy/atom.xml

============================== Gump Tracking Only ===
Produced by Gump version 2.3.
Gump Run 25000022082009, vmgump:vmgump-public:25000022082009
Gump E-mail Identifier (unique within run) #30.

*********************************************************** G U M P
[GUMP@vmgump]: Project jetty (in module jetty) failed
To whom it may engage...
        
This is an automated request, but not an unsolicited one. For 
more information please visit http://gump.apache.org/nagged.html, 
and/or contact the folk at general@gump.apache.org.

Project jetty has an issue affecting its community integration.
This issue affects 2 projects,
 and has been outstanding for 196 runs.
The current state of this project is 'Failed', with reason 'Build Failed'.
For reference only, the following projects are affected by this:
    - jetty :  Java HTTP Servlet Server
    - jetty-test :  Java HTTP Servlet Server


Full details are available at:
    http://vmgump.apache.org/gump/public/jetty/jetty/index.html

That said, some information snippets are provided here.

The following annotations (debug/informational/warning/error messages) were provided:
 -INFO- Optional dependency slide-webdavlib prerequisite failed with reason build failed
 -INFO- Optional dependency commons-digester prerequisite failed with reason build failed
 -INFO- Optional dependency commons-beanutils prerequisite failed with reason build failed
 -INFO- Optional dependency commons-httpclient prerequisite failed with reason build failed
 -INFO- Optional dependency mx4j-tools prerequisite failed with reason build failed
 -INFO- Optional dependency mx4j prerequisite failed with reason build failed
 -DEBUG- (Gump generated) Maven2 Settings in: /srv/gump/public/workspace/jetty/gump_mvn_settings.xml
 -INFO- Failed with reason build failed
 -DEBUG- Maven POM in: /srv/gump/public/workspace/jetty/pom.xml
 -INFO- Failed to extract fallback artifacts from Gump Repository



The following work was performed:
http://vmgump.apache.org/gump/public/jetty/jetty/gump_work/build_jetty_jetty.html
Work Name: build_jetty_jetty (Type: Build)
Work ended in a state of : Failed
Elapsed: 1 min 42 secs
Command Line: mvn --batch-mode -Dmaven.test.skip.exec=true --settings /srv/gump/public/workspace/jetty/gump_mvn_settings.xml package 
[Working Directory: /srv/gump/public/workspace/jetty]
CLASSPATH: /usr/lib/jvm/java-6-sun/lib/tools.jar:/srv/gump/public/workspace/ant/dist/lib/ant-jmf.jar:/srv/gump/public/workspace/ant/dist/lib/ant-swing.jar:/srv/gump/public/workspace/ant/dist/lib/ant-apache-resolver.jar:/srv/gump/public/workspace/ant/dist/lib/ant-apache-xalan2.jar:/srv/gump/public/workspace/ant/dist/lib/ant-trax.jar:/srv/gump/public/workspace/ant/dist/lib/ant-junit.jar:/srv/gump/public/workspace/ant/dist/lib/ant-launcher.jar:/srv/gump/public/workspace/ant/dist/lib/ant-nodeps.jar:/srv/gump/public/workspace/ant/dist/lib/ant.jar:/srv/gump/packages/bsh-2.0b4/bsh-commands-2.0b4.jar:/srv/gump/packages/bsh-2.0b4/bsh-classpath-2.0b4.jar:/srv/gump/packages/bsh-2.0b4/bsh-core-2.0b4.jar:/srv/gump/packages/bsh-2.0b4/bsh-bsf-2.0b4.jar:/srv/gump/packages/bsh-2.0b4/bsh-2.0b4.jar:/srv/gump/packages/bsh-2.0b4/bsh-reflect-2.0b4.jar:/srv/gump/packages/bsh-2.0b4/bsh-util-2.0b4.jar:commons-beanutils-gump-21082009.jar:commons-digester-gump-21082009.jar:/srv/gump/packages/commons-el
 -1.0/commons-el.jar:commons-httpclient-gump-21082009.jar:/srv/gump/packages/jaf-1.1ea/activation.jar:/srv/gump/public/workspace/jakarta-servletapi-5/jsr154/dist/lib/servlet-api.jar:/srv/gump/packages/javamail-1.4/mail.jar:/srv/gump/packages/javamail-1.4/lib/mailapi.jar:/srv/gump/packages/jtidy-04aug2000r7-dev/build/Tidy.jar:/srv/gump/public/workspace/junit/dist/junit-22082009.jar:mx4j-impl-gump-21082009.jar:mx4j-jmx-gump-21082009.jar:mx4j-gump-21082009.jar:mx4j-tools-gump-21082009.jar:/srv/gump/public/workspace/slf4j/slf4j-migrator/target/slf4j-migrator-1.5.9-SNAPSHOT.jar:/srv/gump/public/workspace/slf4j/slf4j-nop/target/slf4j-nop-1.5.9-SNAPSHOT.jar:/srv/gump/public/workspace/slf4j/log4j-over-slf4j/target/log4j-over-slf4j-1.5.9-SNAPSHOT.jar:/srv/gump/public/workspace/slf4j/slf4j-log4j12/target/slf4j-log4j12-1.5.9-SNAPSHOT.jar:/srv/gump/public/workspace/slf4j/slf4j-jcl/target/slf4j-jcl-1.5.9-SNAPSHOT.jar:/srv/gump/public/workspace/slf4j/slf4j-api/target/slf4j-api-1.5.9-SNAPSH
 OT.jar:/srv/gump/public/workspace/slf4j/jcl104-over-slf4j/target/jcl104-over-slf4j-1.5.9-SNAPSHOT.jar:/srv/gump/public/workspace/slf4j/slf4j-jdk14/target/slf4j-jdk14-1.5.9-SNAPSHOT.jar:/srv/gump/public/workspace/slf4j/slf4j-simple/target/slf4j-simple-1.5.9-SNAPSHOT.jar:/srv/gump/public/workspace/slf4j/slf4j-ext/target/slf4j-ext-1.5.9-SNAPSHOT.jar:/srv/gump/public/workspace/slf4j/jcl-over-slf4j/target/jcl-over-slf4j-1.5.9-SNAPSHOT.jar:/srv/gump/public/workspace/slf4j/jul-to-slf4j/target/jul-to-slf4j-1.5.9-SNAPSHOT.jar:slide-webdavlib-gump-21082009.jar:/srv/gump/public/workspace/xml-commons/java/external/build/xml-apis-ext.jar
---------------------------------------------
[INFO] Using 'UTF-8' encoding to copy filtered resources.
[INFO] skip non existing resourceDirectory /srv/gump/public/workspace/jetty/jetty-continuation/src/test/resources
[INFO] Copying 1 resource
[INFO] [compiler:testCompile]
[INFO] No sources to compile
[INFO] [surefire:test]
[INFO] Tests are skipped.
[INFO] [jar:jar]
[INFO] Building jar: /srv/gump/public/workspace/jetty/jetty-continuation/target/jetty-continuation-7.0.0.RC5-SNAPSHOT.jar
[INFO] [jar:jar {execution: artifact-jar}]
[INFO] [jar:test-jar {execution: test-jar}]
[INFO] Building jar: /srv/gump/public/workspace/jetty/jetty-continuation/target/jetty-continuation-7.0.0.RC5-SNAPSHOT-tests.jar
[INFO] Preparing source:jar
[WARNING] Removing: jar from forked lifecycle, to prevent recursive invocation.
[INFO] [enforcer:enforce {execution: enforce-java}]
[INFO] [source:jar {execution: attach-sources}]
[INFO] Building jar: /srv/gump/public/workspace/jetty/jetty-continuation/target/jetty-continuation-7.0.0.RC5-SNAPSHOT-sources.jar
[INFO] ------------------------------------------------------------------------
[INFO] Building Jetty :: Server Core
[INFO]    task-segment: [package]
[INFO] ------------------------------------------------------------------------
[INFO] [enforcer:enforce {execution: enforce-java}]
[INFO] [remote-resources:process {execution: default}]
[INFO] [resources:resources]
[INFO] Using 'UTF-8' encoding to copy filtered resources.
[INFO] Copying 1 resource
[INFO] Copying 1 resource
[INFO] [compiler:compile]
[INFO] Compiling 59 source files to /srv/gump/public/workspace/jetty/jetty-server/target/classes
[INFO] ------------------------------------------------------------------------
[ERROR] BUILD FAILURE
[INFO] ------------------------------------------------------------------------
[INFO] Compilation failure

/srv/gump/public/workspace/jetty/jetty-server/src/main/java/org/eclipse/jetty/server/Server.java:[359,96] cannot find symbol
symbol  : method getContextPath()
location: interface javax.servlet.ServletContext

/srv/gump/public/workspace/jetty/jetty-server/src/main/java/org/eclipse/jetty/server/Server.java:[361,62] cannot find symbol
symbol  : method getContextPath()
location: interface javax.servlet.ServletContext


[INFO] ------------------------------------------------------------------------
[INFO] For more information, run Maven with the -e switch
[INFO] ------------------------------------------------------------------------
[INFO] Total time: 1 minute 39 seconds
[INFO] Finished at: Sat Aug 22 03:28:44 PDT 2009
[INFO] Final Memory: 47M/84M
[INFO] ------------------------------------------------------------------------
---------------------------------------------

To subscribe to this information via syndicated feeds:
- RSS: http://vmgump.apache.org/gump/public/jetty/jetty/rss.xml
- Atom: http://vmgump.apache.org/gump/public/jetty/jetty/atom.xml

============================== Gump Tracking Only ===
Produced by Gump version 2.3.
Gump Run 25000022082009, vmgump:vmgump-public:25000022082009
Gump E-mail Identifier (unique within run) #31.

*********************************************************** G U M P
[GUMP@vmgump]: Project commons-jci (in module apache-commons) failed
To whom it may engage...
        
This is an automated request, but not an unsolicited one. For 
more information please visit http://gump.apache.org/nagged.html, 
and/or contact the folk at general@gump.apache.org.

Project commons-jci has an issue affecting its community integration.
This issue affects 2 projects,
 and has been outstanding for 1154 runs.
The current state of this project is 'Failed', with reason 'Build Failed'.
For reference only, the following projects are affected by this:
    - commons-jci :  Commons JCI
    - commons-jci-test :  Apache Commons


Full details are available at:
    http://vmgump.apache.org/gump/public/apache-commons/commons-jci/index.html

That said, some information snippets are provided here.

The following annotations (debug/informational/warning/error messages) were provided:
 -DEBUG- Sole output [commons-jci-22082009.jar] identifier set to project name
 -INFO- Optional dependency commons-logging prerequisite failed with reason build failed
 -DEBUG- (Gump generated) Maven2 Settings in: /srv/gump/public/workspace/apache-commons/jci/gump_mvn_settings.xml
 -INFO- Failed with reason build failed
 -DEBUG- Maven POM in: /srv/gump/public/workspace/apache-commons/jci/pom.xml
 -INFO- Failed to extract fallback artifacts from Gump Repository



The following work was performed:
http://vmgump.apache.org/gump/public/apache-commons/commons-jci/gump_work/build_apache-commons_commons-jci.html
Work Name: build_apache-commons_commons-jci (Type: Build)
Work ended in a state of : Failed
Elapsed: 48 secs
Command Line: mvn --batch-mode -Dmaven.test.skip.exec=true --settings /srv/gump/public/workspace/apache-commons/jci/gump_mvn_settings.xml package 
[Working Directory: /srv/gump/public/workspace/apache-commons/jci]
CLASSPATH: /usr/lib/jvm/java-6-sun/lib/tools.jar:/srv/gump/public/workspace/jakarta-bcel/target/bcel-5.3-SNAPSHOT.jar:/srv/gump/public/workspace/apache-commons/collections/build/commons-collections-22082009.jar:/srv/gump/public/workspace/apache-commons/io/target/commons-io-22082009.jar:/srv/gump/public/workspace/apache-commons/lang/target/commons-lang-3.0-SNAPSHOT.jar:commons-logging-gump-21082009.jar:commons-logging-api-gump-21082009.jar:/srv/gump/packages/eclipse/plugins/org.eclipse.jdt.core_3.4.2/jdtcore.jar:/srv/gump/packages/jarjar/jarjar-0.6.jar:/srv/gump/public/workspace/asm/output/dist/lib/asm-analysis-22082009.jar:/srv/gump/public/workspace/asm/output/dist/lib/asm-util-22082009.jar:/srv/gump/public/workspace/asm/output/dist/lib/asm-xml-22082009.jar:/srv/gump/public/workspace/asm/output/dist/lib/asm-commons-22082009.jar:/srv/gump/public/workspace/asm/output/dist/lib/asm-22082009.jar:/srv/gump/public/workspace/asm/output/dist/lib/asm-tree-22082009.jar:/srv/gump/package
 s/antlr/antlr-3.1.3.jar:/srv/gump/packages/groovy-1.0-jsr-03/groovy-1.0-jsr-03.jar:/srv/gump/packages/maven-cobertura-plugin/maven-cobertura-plugin-1.1.jar
---------------------------------------------
1K downloaded
Downloading: http://localhost:8192/maven2/asm/asm-analysis/2.2.1/asm-analysis-2.2.1.pom
1K downloaded
Downloading: http://localhost:8192/maven2/asm/asm-attrs/2.2.1/asm-attrs-2.2.1.pom
1K downloaded
Downloading: http://localhost:8192/maven2/commons-io/commons-io/1.1/commons-io-1.1.pom
5K downloaded
Downloading: http://localhost:8192/maven2/asm/asm/2.2/asm-2.2.pom
807b downloaded
Downloading: http://localhost:8192/maven2/org/vafer/dependency/0.2/dependency-0.2.jar
17K downloaded
Downloading: http://localhost:8192/maven2/asm/asm-commons/2.2.1/asm-commons-2.2.1.jar
32K downloaded
Downloading: http://localhost:8192/maven2/asm/asm/2.2/asm-2.2.jar
42K downloaded
Downloading: http://localhost:8192/maven2/asm/asm-util/2.2.1/asm-util-2.2.1.jar
34K downloaded
Downloading: http://localhost:8192/maven2/asm/asm-analysis/2.2.1/asm-analysis-2.2.1.jar
17K downloaded
Downloading: http://localhost:8192/maven2/asm/asm-attrs/2.2.1/asm-attrs-2.2.1.jar
6K downloaded
[INFO] [antrun:run {execution: javadoc.resources}]
[INFO] Executing tasks
[INFO] Executed tasks
[INFO] [resources:resources]
[WARNING] Using platform encoding (UTF-8 actually) to copy filtered resources, i.e. build is platform dependent!
[INFO] Copying 0 resource to META-INF
[INFO] [compiler:compile]
[INFO] Compiling 6 source files to /srv/gump/public/workspace/apache-commons/jci/compilers/javac/target/classes
[INFO] ------------------------------------------------------------------------
[ERROR] BUILD FAILURE
[INFO] ------------------------------------------------------------------------
[INFO] Compilation failure

/srv/gump/public/workspace/apache-commons/jci/compilers/javac/src/main/java/org/apache/commons/jci/compilers/JavacClassLoader.java:[108,46] cannot find symbol
symbol  : constructor ClassWriter(boolean,boolean)
location: class org.objectweb.asm.ClassWriter

/srv/gump/public/workspace/apache-commons/jci/compilers/javac/src/main/java/org/apache/commons/jci/compilers/JavacClassLoader.java:[109,44] cannot find symbol
symbol  : method accept(org.vafer.dependency.asm.RenamingVisitor,boolean)
location: class org.objectweb.asm.ClassReader


[INFO] ------------------------------------------------------------------------
[INFO] For more information, run Maven with the -e switch
[INFO] ------------------------------------------------------------------------
[INFO] Total time: 46 seconds
[INFO] Finished at: Sat Aug 22 03:49:02 PDT 2009
[INFO] Final Memory: 39M/69M
[INFO] ------------------------------------------------------------------------
---------------------------------------------

To subscribe to this information via syndicated feeds:
- RSS: http://vmgump.apache.org/gump/public/apache-commons/commons-jci/rss.xml
- Atom: http://vmgump.apache.org/gump/public/apache-commons/commons-jci/atom.xml

============================== Gump Tracking Only ===
Produced by Gump version 2.3.
Gump Run 25000022082009, vmgump:vmgump-public:25000022082009
Gump E-mail Identifier (unique within run) #32.

*********************************************************** G U M P
[GUMP@vmgump]: Project httpcomponents-core (in module httpcomponents) failed
To whom it may engage...
        
This is an automated request, but not an unsolicited one. For 
more information please visit http://gump.apache.org/nagged.html, 
and/or contact the folk at general@gump.apache.org.

Project httpcomponents-core has an issue affecting its community integration.
This issue affects 2 projects,
 and has been outstanding for 73 runs.
The current state of this project is 'Failed', with reason 'Build Failed'.
For reference only, the following projects are affected by this:
    - httpcomponents-core :  HttpComponents Core
    - httpcomponents-core-tests :  Unit Tests for HttpComponents Core


Full details are available at:
    http://vmgump.apache.org/gump/public/httpcomponents/httpcomponents-core/index.html

That said, some information snippets are provided here.

The following annotations (debug/informational/warning/error messages) were provided:
 -INFO- Optional dependency velocity-engine prerequisite failed with reason build failed
 -DEBUG- (Gump generated) Maven2 Settings in: /srv/gump/public/workspace/httpcomponents/httpcore/gump_mvn_settings.xml
 -INFO- Failed with reason build failed
 -DEBUG- Maven POM in: /srv/gump/public/workspace/httpcomponents/httpcore/pom.xml
 -INFO- Project Reports in: /srv/gump/public/workspace/httpcomponents/httpcore/httpcore/target/surefire-reports
 -WARNING- No directory [/srv/gump/public/workspace/httpcomponents/httpcore/httpcore/target/surefire-reports]
 -INFO- Failed to extract fallback artifacts from Gump Repository



The following work was performed:
http://vmgump.apache.org/gump/public/httpcomponents/httpcomponents-core/gump_work/build_httpcomponents_httpcomponents-core.html
Work Name: build_httpcomponents_httpcomponents-core (Type: Build)
Work ended in a state of : Failed
Elapsed: 36 secs
Command Line: mvn --batch-mode -Dmaven.test.skip.exec=true --settings /srv/gump/public/workspace/httpcomponents/httpcore/gump_mvn_settings.xml install 
[Working Directory: /srv/gump/public/workspace/httpcomponents/httpcore]
CLASSPATH: /usr/lib/jvm/java-6-sun/lib/tools.jar:/srv/gump/public/workspace/apache-commons/collections/build/commons-collections-22082009.jar:/srv/gump/public/workspace/apache-commons/lang/target/commons-lang-3.0-SNAPSHOT.jar:/srv/gump/public/workspace/jakarta-oro/jakarta-oro-22082009.jar:/srv/gump/public/workspace/junit/dist/junit-22082009.jar:velocity-gump-21082009.jar:velocity-dep-gump-21082009.jar
---------------------------------------------
urls[10] = file:/srv/gump/public/workspace/mvnlocalrepo/org/apache/maven/shared/maven-osgi/0.2.0/maven-osgi-0.2.0.jar
[FATAL ERROR] Container realm = plexus.core
urls[0] = file:/opt/maven2/lib/maven-2.0.10-uber.jar
[INFO] ------------------------------------------------------------------------
[ERROR] FATAL ERROR
[INFO] ------------------------------------------------------------------------
[INFO] aQute/lib/reporter/Reporter
aQute.lib.reporter.Reporter
[INFO] ------------------------------------------------------------------------
[INFO] Trace
java.lang.NoClassDefFoundError: aQute/lib/reporter/Reporter
	at org.apache.felix.bundleplugin.BundlePlugin.buildOSGiBundle(BundlePlugin.java:360)
	at org.apache.felix.bundleplugin.BundlePlugin.execute(BundlePlugin.java:273)
	at org.apache.felix.bundleplugin.BundlePlugin.execute(BundlePlugin.java:227)
	at org.apache.felix.bundleplugin.BundlePlugin.execute(BundlePlugin.java:218)
	at org.apache.maven.plugin.DefaultPluginManager.executeMojo(DefaultPluginManager.java:453)
	at org.apache.maven.lifecycle.DefaultLifecycleExecutor.executeGoals(DefaultLifecycleExecutor.java:559)
	at org.apache.maven.lifecycle.DefaultLifecycleExecutor.executeGoalWithLifecycle(DefaultLifecycleExecutor.java:500)
	at org.apache.maven.lifecycle.DefaultLifecycleExecutor.executeGoal(DefaultLifecycleExecutor.java:479)
	at org.apache.maven.lifecycle.DefaultLifecycleExecutor.executeGoalAndHandleFailures(DefaultLifecycleExecutor.java:331)
	at org.apache.maven.lifecycle.DefaultLifecycleExecutor.executeTaskSegments(DefaultLifecycleExecutor.java:292)
	at org.apache.maven.lifecycle.DefaultLifecycleExecutor.execute(DefaultLifecycleExecutor.java:142)
	at org.apache.maven.DefaultMaven.doExecute(DefaultMaven.java:336)
	at org.apache.maven.DefaultMaven.execute(DefaultMaven.java:129)
	at org.apache.maven.cli.MavenCli.main(MavenCli.java:301)
	at sun.reflect.NativeMethodAccessorImpl.invoke0(Native Method)
	at sun.reflect.NativeMethodAccessorImpl.invoke(NativeMethodAccessorImpl.java:39)
	at sun.reflect.DelegatingMethodAccessorImpl.invoke(DelegatingMethodAccessorImpl.java:25)
	at java.lang.reflect.Method.invoke(Method.java:597)
	at org.codehaus.classworlds.Launcher.launchEnhanced(Launcher.java:315)
	at org.codehaus.classworlds.Launcher.launch(Launcher.java:255)
	at org.codehaus.classworlds.Launcher.mainWithExitCode(Launcher.java:430)
	at org.codehaus.classworlds.Launcher.main(Launcher.java:375)
Caused by: java.lang.ClassNotFoundException: aQute.lib.reporter.Reporter
	at java.net.URLClassLoader$1.run(URLClassLoader.java:200)
	at java.security.AccessController.doPrivileged(Native Method)
	at java.net.URLClassLoader.findClass(URLClassLoader.java:188)
	at java.lang.ClassLoader.loadClass(ClassLoader.java:306)
	at org.codehaus.classworlds.RealmClassLoader.loadClassDirect(RealmClassLoader.java:195)
	at org.codehaus.classworlds.DefaultClassRealm.loadClass(DefaultClassRealm.java:255)
	at org.codehaus.classworlds.DefaultClassRealm.loadClass(DefaultClassRealm.java:274)
	at org.codehaus.classworlds.RealmClassLoader.loadClass(RealmClassLoader.java:214)
	at java.lang.ClassLoader.loadClass(ClassLoader.java:251)
	at java.lang.ClassLoader.loadClassInternal(ClassLoader.java:319)
	... 22 more
[INFO] ------------------------------------------------------------------------
[INFO] Total time: 34 seconds
[INFO] Finished at: Sat Aug 22 03:51:28 PDT 2009
[INFO] Final Memory: 40M/75M
[INFO] ------------------------------------------------------------------------
---------------------------------------------

To subscribe to this information via syndicated feeds:
- RSS: http://vmgump.apache.org/gump/public/httpcomponents/httpcomponents-core/rss.xml
- Atom: http://vmgump.apache.org/gump/public/httpcomponents/httpcomponents-core/atom.xml

============================== Gump Tracking Only ===
Produced by Gump version 2.3.
Gump Run 25000022082009, vmgump:vmgump-public:25000022082009
Gump E-mail Identifier (unique within run) #33.

*********************************************************** G U M P
[GUMP@vmgump]: Project asn1-codec (in module directory-shared) failed
To whom it may engage...
        
This is an automated request, but not an unsolicited one. For 
more information please visit http://gump.apache.org/nagged.html, 
and/or contact the folk at general@gump.apache.org.

Project asn1-codec has an issue affecting its community integration.
This issue affects 2 projects,
 and has been outstanding for 2 runs.
The current state of this project is 'Failed', with reason 'Build Failed'.
For reference only, the following projects are affected by this:
    - asn1-codec :  Apache ASN.1 Tools
    - ldap-protocol :  Apache Directory Server


Full details are available at:
    http://vmgump.apache.org/gump/public/directory-shared/asn1-codec/index.html

That said, some information snippets are provided here.

The following annotations (debug/informational/warning/error messages) were provided:
 -INFO- Optional dependency velocity-engine prerequisite failed with reason build failed
 -DEBUG- (Gump generated) Maven2 Settings in: /srv/gump/public/workspace/directory-shared/asn1-codec/gump_mvn_settings.xml
 -INFO- Failed with reason build failed
 -DEBUG- Maven POM in: /srv/gump/public/workspace/directory-shared/asn1-codec/pom.xml
 -INFO- Failed to extract fallback artifacts from Gump Repository



The following work was performed:
http://vmgump.apache.org/gump/public/directory-shared/asn1-codec/gump_work/build_directory-shared_asn1-codec.html
Work Name: build_directory-shared_asn1-codec (Type: Build)
Work ended in a state of : Failed
Elapsed: 4 secs
Command Line: mvn --batch-mode --settings /srv/gump/public/workspace/directory-shared/asn1-codec/gump_mvn_settings.xml package 
[Working Directory: /srv/gump/public/workspace/directory-shared/asn1-codec]
CLASSPATH: /usr/lib/jvm/java-6-sun/lib/tools.jar:/srv/gump/public/workspace/directory-shared/asn1/target/shared-asn1-0.9.16-SNAPSHOT.jar:/srv/gump/public/workspace/apache-commons/collections/build/commons-collections-22082009.jar:/srv/gump/public/workspace/apache-commons/lang/target/commons-lang-3.0-SNAPSHOT.jar:/srv/gump/public/workspace/junit/dist/junit-22082009.jar:/srv/gump/public/workspace/logging-log4j-12/dist/lib/log4j-22082009.jar:velocity-gump-21082009.jar:velocity-dep-gump-21082009.jar
---------------------------------------------
[INFO] Scanning for projects...
[INFO] ------------------------------------------------------------------------
[INFO] Building Apache Directory MINA ASN.1 Codec Shared
[INFO]    task-segment: [package]
[INFO] ------------------------------------------------------------------------
[INFO] snapshot org.apache.directory.shared:shared-asn1:0.9.16-SNAPSHOT: checking for updates from apache.snapshots
[WARNING] *** CHECKSUM FAILED - Checksum failed on download: local = '6145a85f3b83e0628e15c6e4edd9a76147fd61f2'; remote = '<html>
<head>
' - RETRYING
[WARNING] *** CHECKSUM FAILED - Checksum failed on download: local = '6145a85f3b83e0628e15c6e4edd9a76147fd61f2'; remote = '<html>
<head>
' - IGNORING
[INFO] ------------------------------------------------------------------------
[ERROR] BUILD ERROR
[INFO] ------------------------------------------------------------------------
[INFO] Error building POM (may not be this project's POM).


Project ID: org.apache.directory.shared:shared-asn1

Reason: Error getting POM for 'org.apache.directory.shared:shared-asn1' from the repository: Unable to read local copy of metadata: Cannot read metadata from '/srv/gump/public/workspace/mvnlocalrepo/org/apache/directory/shared/shared-asn1/0.9.16-SNAPSHOT/maven-metadata-apache.snapshots.xml': end tag name </p> must match start tag name <br> from line 6 (position: TEXT seen ...<a href="/">home page</a>.\n</p>... @8:5) 
  org.apache.directory.shared:shared-asn1:pom:0.9.16-SNAPSHOT


 for project org.apache.directory.shared:shared-asn1


[INFO] ------------------------------------------------------------------------
[INFO] For more information, run Maven with the -e switch
[INFO] ------------------------------------------------------------------------
[INFO] Total time: 3 seconds
[INFO] Finished at: Sat Aug 22 03:55:43 PDT 2009
[INFO] Final Memory: 6M/12M
[INFO] ------------------------------------------------------------------------
---------------------------------------------

To subscribe to this information via syndicated feeds:
- RSS: http://vmgump.apache.org/gump/public/directory-shared/asn1-codec/rss.xml
- Atom: http://vmgump.apache.org/gump/public/directory-shared/asn1-codec/atom.xml

============================== Gump Tracking Only ===
Produced by Gump version 2.3.
Gump Run 25000022082009, vmgump:vmgump-public:25000022082009
Gump E-mail Identifier (unique within run) #34.

*********************************************************** G U M P
[GUMP@vmgump]: Project mina (in module mina) failed
To whom it may engage...
        
This is an automated request, but not an unsolicited one. For 
more information please visit http://gump.apache.org/nagged.html, 
and/or contact the folk at general@gump.apache.org.

Project mina has an issue affecting its community integration.
This issue affects 3 projects,
 and has been outstanding for 2 runs.
The current state of this project is 'Failed', with reason 'Build Failed'.
For reference only, the following projects are affected by this:
    - kerberos-protocol :  Apache Kerberos Server
    - mina :  A Multipurpose Infrastrusture for Network Applications
    - mina-test :  A Multipurpose Infrastrusture for Network Applications


Full details are available at:
    http://vmgump.apache.org/gump/public/mina/mina/index.html

That said, some information snippets are provided here.

The following annotations (debug/informational/warning/error messages) were provided:
 -INFO- Optional dependency ant-contrib prerequisite failed with reason build failed
 -DEBUG- (Gump generated) Maven2 Settings in: /srv/gump/public/workspace/mina/gump_mvn_settings.xml
 -INFO- Failed with reason build failed
 -DEBUG- Maven POM in: /srv/gump/public/workspace/mina/pom.xml
 -INFO- Failed to extract fallback artifacts from Gump Repository



The following work was performed:
http://vmgump.apache.org/gump/public/mina/mina/gump_work/build_mina_mina.html
Work Name: build_mina_mina (Type: Build)
Work ended in a state of : Failed
Elapsed: 18 secs
Command Line: mvn --batch-mode -Dmaven.test.skip.exec=true --settings /srv/gump/public/workspace/mina/gump_mvn_settings.xml install 
[Working Directory: /srv/gump/public/workspace/mina]
CLASSPATH: /usr/lib/jvm/java-6-sun/lib/tools.jar:/srv/gump/public/workspace/mina/legal/target/mina-legal-2.0.0-M7-SNAPSHOT.jar:/srv/gump/public/workspace/ant/dist/lib/ant-jmf.jar:/srv/gump/public/workspace/ant/dist/lib/ant-swing.jar:/srv/gump/public/workspace/ant/dist/lib/ant-apache-resolver.jar:/srv/gump/public/workspace/ant/dist/lib/ant-apache-xalan2.jar:/srv/gump/public/workspace/ant/dist/lib/ant-trax.jar:/srv/gump/public/workspace/ant/dist/lib/ant-junit.jar:/srv/gump/public/workspace/ant/dist/lib/ant-launcher.jar:/srv/gump/public/workspace/ant/dist/lib/ant-nodeps.jar:/srv/gump/public/workspace/ant/dist/lib/ant.jar:/srv/gump/packages/cglib/cglib-nodep-2.1_3.jar:/srv/gump/public/workspace/apache-commons/net/dist/commons-net-22082009.jar:/srv/gump/packages/easymock1.2_Java1.3/easymock.jar:/srv/gump/packages/easymockclassextension1.2/easymockclassextension.jar:/srv/gump/packages/emma-2.0.5312/lib/emma.jar:/srv/gump/packages/emma-2.0.5312/lib/emma_ant.jar:/srv/gump/public/work
 space/junit/dist/junit-22082009.jar:/srv/gump/public/workspace/maven-emma-plugin/target/maven-emma-plugin-22082009.jar:/srv/gump/packages/maven-site-plugin/maven-site-plugin-1.6.1.jar:/srv/gump/public/workspace/slf4j/slf4j-simple/target/slf4j-simple-1.5.9-SNAPSHOT.jar:/srv/gump/packages/spring-framework-1.2.6/dist/spring-beans.jar:/srv/gump/packages/spring-framework-1.2.6/dist/spring-core.jar:/srv/gump/packages/jsse1.0.3/lib/jcert.jar:/srv/gump/packages/jsse1.0.3/lib/jnet.jar:/srv/gump/packages/jsse1.0.3/lib/jsse.jar:/srv/gump/public/workspace/ant-contrib/target/ant-contrib-22082009.jar
---------------------------------------------
214b downloaded
Downloading: http://localhost:8192/maven2/com/agical/rmock/rmock/2.0.0/rmock-2.0.0.pom
3K downloaded
Downloading: http://localhost:8192/maven2/com/agical/rmock/parent/2.0.0/parent-2.0.0.pom
2K downloaded
Downloading: http://localhost:8192/maven2/cglib/cglib-nodep/2.1_2/cglib-nodep-2.1_2.pom
214b downloaded
Downloading: http://localhost:8192/maven2/org/slf4j/slf4j-api/1.5.2/slf4j-api-1.5.2.jar
22K downloaded
Downloading: http://localhost:8192/maven2/org/slf4j/jcl-over-slf4j/1.5.2/jcl-over-slf4j-1.5.2.jar
16K downloaded
Downloading: http://localhost:8192/maven2/org/slf4j/slf4j-log4j12/1.5.2/slf4j-log4j12-1.5.2.jar
9K downloaded
Downloading: http://localhost:8192/maven2/org/easymock/easymock/2.3/easymock-2.3.jar
69K downloaded
Downloading: http://localhost:8192/maven2/org/easymock/easymockclassextension/2.3/easymockclassextension-2.3.jar
50K downloaded
Downloading: http://localhost:8192/maven2/cglib/cglib-nodep/2.1_3/cglib-nodep-2.1_3.jar
316K downloaded
Downloading: http://localhost:8192/maven2/com/agical/rmock/rmock/2.0.0/rmock-2.0.0.jar
194K downloaded
[INFO] snapshot org.apache.mina:mina-legal:2.0.0-M7-SNAPSHOT: checking for updates from apache.snapshots
[WARNING] *** CHECKSUM FAILED - Checksum failed on download: local = '6145a85f3b83e0628e15c6e4edd9a76147fd61f2'; remote = '<html>
<head>
' - RETRYING
[WARNING] *** CHECKSUM FAILED - Checksum failed on download: local = '6145a85f3b83e0628e15c6e4edd9a76147fd61f2'; remote = '<html>
<head>
' - IGNORING
[INFO] ------------------------------------------------------------------------
[ERROR] BUILD ERROR
[INFO] ------------------------------------------------------------------------
[INFO] Failed to resolve artifact.

Unable to read local copy of metadata: Cannot read metadata from '/srv/gump/public/workspace/mvnlocalrepo/org/apache/mina/mina-legal/2.0.0-M7-SNAPSHOT/maven-metadata-apache.snapshots.xml': end tag name </p> must match start tag name <br> from line 6 (position: TEXT seen ...<a href="/">home page</a>.\n</p>... @8:5) 
  org.apache.mina:mina-legal:jar:2.0.0-M7-SNAPSHOT


Path to dependency: 
	1) org.apache.maven.plugins:maven-remote-resources-plugin:maven-plugin:1.0
	2) org.apache.mina:mina-legal:jar:2.0.0-M7-SNAPSHOT



[INFO] ------------------------------------------------------------------------
[INFO] For more information, run Maven with the -e switch
[INFO] ------------------------------------------------------------------------
[INFO] Total time: 16 seconds
[INFO] Finished at: Sat Aug 22 03:56:06 PDT 2009
[INFO] Final Memory: 20M/37M
[INFO] ------------------------------------------------------------------------
---------------------------------------------

To subscribe to this information via syndicated feeds:
- RSS: http://vmgump.apache.org/gump/public/mina/mina/rss.xml
- Atom: http://vmgump.apache.org/gump/public/mina/mina/atom.xml

============================== Gump Tracking Only ===
Produced by Gump version 2.3.
Gump Run 25000022082009, vmgump:vmgump-public:25000022082009
Gump E-mail Identifier (unique within run) #35.

*********************************************************** G U M P
[GUMP@vmgump]: Project groovy (in module groovy) failed
To whom it may engage...
        
This is an automated request, but not an unsolicited one. For 
more information please visit http://gump.apache.org/nagged.html, 
and/or contact the folk at general@gump.apache.org.

Project groovy has an issue affecting its community integration.
This issue affects 1 projects,
 and has been outstanding for 39 runs.
The current state of this project is 'Failed', with reason 'Missing Build Outputs'.
For reference only, the following projects are affected by this:
    - groovy :  New agile dynamic language using a Java-like syntax for the ...


Full details are available at:
    http://vmgump.apache.org/gump/public/groovy/groovy/index.html

That said, some information snippets are provided here.

The following annotations (debug/informational/warning/error messages) were provided:
 -DEBUG- Sole output [groovy-1.7-beta-1-SNAPSHOT.jar] identifier set to project name
 -INFO- Optional dependency jakarta-bsf prerequisite failed with reason build failed
 -INFO- Optional dependency commons-httpclient prerequisite failed with reason build failed
 -INFO- Optional dependency mx4j prerequisite failed with reason build failed
 -INFO- Optional dependency commons-logging prerequisite failed with reason build failed
 -DEBUG- (Gump generated) Maven2 Settings in: /srv/gump/public/workspace/groovy/gump_mvn_settings.xml
 -DEBUG- Maven POM in: /srv/gump/public/workspace/groovy/pom.xml
 -INFO- Failed with reason missing build outputs
 -ERROR- Missing Output: /srv/gump/public/workspace/groovy/target/groovy-1.7-beta-1-SNAPSHOT.jar
 -ERROR- See Directory Listing Work for Missing Outputs
 -INFO- Failed to extract fallback artifacts from Gump Repository



The following work was performed:
http://vmgump.apache.org/gump/public/groovy/groovy/gump_work/build_groovy_groovy.html
Work Name: build_groovy_groovy (Type: Build)
Work ended in a state of : Success
Elapsed: 21 secs
Command Line: mvn --batch-mode --settings /srv/gump/public/workspace/groovy/gump_mvn_settings.xml package 
[Working Directory: /srv/gump/public/workspace/groovy]
CLASSPATH: /usr/lib/jvm/java-6-sun/lib/tools.jar:/srv/gump/public/workspace/ant/dist/lib/ant-jmf.jar:/srv/gump/public/workspace/ant/dist/lib/ant-swing.jar:/srv/gump/public/workspace/ant/dist/lib/ant-apache-resolver.jar:/srv/gump/public/workspace/ant/dist/lib/ant-apache-xalan2.jar:/srv/gump/public/workspace/ant/dist/lib/ant-trax.jar:/srv/gump/public/workspace/ant/dist/lib/ant-junit.jar:/srv/gump/public/workspace/ant/dist/lib/ant-launcher.jar:/srv/gump/public/workspace/ant/dist/lib/ant-nodeps.jar:/srv/gump/public/workspace/ant/dist/lib/ant.jar:/srv/gump/packages/antlr/antlr-3.1.3.jar:/srv/gump/public/workspace/asm/output/dist/lib/asm-analysis-22082009.jar:/srv/gump/public/workspace/asm/output/dist/lib/asm-util-22082009.jar:/srv/gump/public/workspace/asm/output/dist/lib/asm-xml-22082009.jar:/srv/gump/public/workspace/asm/output/dist/lib/asm-commons-22082009.jar:/srv/gump/public/workspace/asm/output/dist/lib/asm-22082009.jar:/srv/gump/public/workspace/asm/output/dist/lib/asm-tree
 -22082009.jar:/srv/gump/packages/axion-1.0-M2/axion-1.0-M2.jar:/srv/gump/packages/cglib/cglib-nodep-2.1_3.jar:/srv/gump/public/workspace/apache-commons/cli/target/commons-cli-22082009.jar:/srv/gump/public/workspace/apache-commons/collections/build/commons-collections-22082009.jar:commons-httpclient-gump-21082009.jar:commons-logging-gump-21082009.jar:commons-logging-api-gump-21082009.jar:/srv/gump/public/workspace/apache-commons/primitives/target/commons-primitives-22082009.jar:/srv/gump/public/workspace/hsqldb/lib/hsqldb.jar:bsf-gump-21082009.jar:/srv/gump/public/workspace/jakarta-regexp/build/jakarta-regexp-22082009.jar:/srv/gump/public/workspace/jakarta-servletapi-5/jsr154/dist/lib/servlet-api.jar:/srv/gump/public/workspace/jakarta-servletapi-5/jsr152/dist/lib/jsp-api.jar:/srv/gump/packages/jarjar/jarjar-0.6.jar:/srv/gump/public/workspace/jmock/build/dist/jmock-core-22082009.jar:/srv/gump/public/workspace/jmock/build/dist/jmock-cglib-22082009.jar:/srv/gump/public/workspace
 /junit/dist/junit-22082009.jar:/srv/gump/packages/mockobjects-0.09/mockobjects-core-0.09.jar:/srv/gump/packages/mockobjects-0.09/mockobjects-jdk1.4-0.09.jar:/srv/gump/packages/mockobjects-0.09/mockobjects-alt-jdk1.4-0.09.jar:mx4j-impl-gump-21082009.jar:mx4j-jmx-gump-21082009.jar:mx4j-gump-21082009.jar:/srv/gump/packages/nekohtml-0.9.5/nekohtml.jar:/srv/gump/packages/openejb-0.9.2/dist/openejb_loader-0.9.2.jar:/srv/gump/packages/openejb-0.9.2/dist/openejb_ejb_tests-0.9.2.jar:/srv/gump/packages/openejb-0.9.2/dist/openejb_server-0.9.2.jar:/srv/gump/packages/openejb-0.9.2/dist/openejb_client-0.9.2.jar:/srv/gump/packages/openejb-0.9.2/dist/openejb-0.9.2.jar:/srv/gump/packages/qdox-1.6.3/qdox-1.6.3.jar:/srv/gump/packages/radeox-1.0-BETA-2/lib/radeox-api.jar:/srv/gump/packages/radeox-1.0-BETA-2/lib/radeox.jar:/srv/gump/public/workspace/xml-commons/java/external/build/xml-apis-ext.jar:/srv/gump/public/workspace/xmlunit/build/java/lib/xmlunit-sumo-22082009.jar:/srv/gump/public/worksp
 ace/xmlunit/build/java/lib/xmlunit-legacy-22082009.jar:/srv/gump/public/workspace/xmlunit/build/java/lib/xmlunit-core-22082009.jar:/srv/gump/public/workspace/xpp/build/xpp3-22082009.jar:/srv/gump/public/workspace/xstream/xstream/target/xstream-1.4-SNAPSHOT.jar
---------------------------------------------
34K downloaded
Downloading: http://localhost:8192/maven2/asm/asm-analysis/3.2/asm-analysis-3.2.jar
17K downloaded
Downloading: http://localhost:8192/maven2/bsf/bsf/2.4.0/bsf-2.4.0.jar
103K downloaded
Downloading: http://localhost:8192/maven2/org/livetribe/livetribe-jsr223/2.0.4/livetribe-jsr223-2.0.4.jar
14K downloaded
Downloading: http://localhost:8192/maven2/javax/servlet/jsp-api/2.0/jsp-api-2.0.jar
48K downloaded
Downloading: http://localhost:8192/maven2/com/thoughtworks/xstream/xstream/1.3.1/xstream-1.3.1.jar
421K downloaded
Downloading: http://localhost:8192/maven2/jline/jline/0.9.94/jline-0.9.94.jar
85K downloaded
Downloading: http://localhost:8192/maven2/org/apache/ivy/ivy/2.1.0-rc2/ivy-2.1.0-rc2.jar
889K downloaded
[INFO] [compiler:compile]
[INFO] Nothing to compile - all classes are up to date
[INFO] [resources:testResources]
[WARNING] Using platform encoding (UTF-8 actually) to copy filtered resources, i.e. build is platform dependent!
[INFO] skip non existing resourceDirectory /srv/gump/public/workspace/groovy/src/test/resources
Downloading: http://localhost:8192/maven2/org/apache/ant/ant-junit/1.7.1/ant-junit-1.7.1.jar
99K downloaded
Downloading: http://localhost:8192/maven2/jmock/jmock/1.2.0/jmock-1.2.0.jar
168K downloaded
Downloading: http://localhost:8192/maven2/jmock/jmock-cglib/1.2.0/jmock-cglib-1.2.0.jar
6K downloaded
Downloading: http://localhost:8192/maven2/hsqldb/hsqldb/1.8.0.7/hsqldb-1.8.0.7.jar
729K downloaded
[INFO] [compiler:testCompile]
[INFO] Not compiling test sources
Downloading: http://localhost:8192/maven2/org/apache/maven/surefire/surefire-booter/2.3/surefire-booter-2.3.pom
1K downloaded
Downloading: http://localhost:8192/maven2/org/apache/maven/surefire/surefire-api/2.3/surefire-api-2.3.pom
887b downloaded
Downloading: http://localhost:8192/maven2/org/apache/maven/surefire/surefire-booter/2.3/surefire-booter-2.3.jar
28K downloaded
Downloading: http://localhost:8192/maven2/org/apache/maven/surefire/surefire-api/2.3/surefire-api-2.3.jar
49K downloaded
[INFO] [surefire:test]
[INFO] Tests are skipped.
[INFO] [jar:jar]
[WARNING] JAR will be empty - no content was marked for inclusion!
[INFO] Building jar: /srv/gump/public/workspace/groovy/target/groovy-1.7-beta-2-SNAPSHOT.jar
[INFO] ------------------------------------------------------------------------
[INFO] BUILD SUCCESSFUL
[INFO] ------------------------------------------------------------------------
[INFO] Total time: 19 seconds
[INFO] Finished at: Sat Aug 22 03:56:47 PDT 2009
[INFO] Final Memory: 10M/18M
[INFO] ------------------------------------------------------------------------
---------------------------------------------

To subscribe to this information via syndicated feeds:
- RSS: http://vmgump.apache.org/gump/public/groovy/groovy/rss.xml
- Atom: http://vmgump.apache.org/gump/public/groovy/groovy/atom.xml

============================== Gump Tracking Only ===
Produced by Gump version 2.3.
Gump Run 25000022082009, vmgump:vmgump-public:25000022082009
Gump E-mail Identifier (unique within run) #36.

*********************************************************** G U M P
[GUMP@vmgump]: Project httpcomponents-client (in module httpcomponents) failed
To whom it may engage...
        
This is an automated request, but not an unsolicited one. For 
more information please visit http://gump.apache.org/nagged.html, 
and/or contact the folk at general@gump.apache.org.

Project httpcomponents-client has an issue affecting its community integration.
This issue affects 1 projects,
 and has been outstanding for 111 runs.
The current state of this project is 'Failed', with reason 'Build Failed'.
For reference only, the following projects are affected by this:
    - httpcomponents-client :  HttpComponents Client


Full details are available at:
    http://vmgump.apache.org/gump/public/httpcomponents/httpcomponents-client/index.html

That said, some information snippets are provided here.

The following annotations (debug/informational/warning/error messages) were provided:
 -INFO- Optional dependency commons-logging prerequisite failed with reason build failed
 -INFO- Optional dependency httpcomponents-core failed with reason build failed
 -DEBUG- (Gump generated) Maven2 Settings in: /srv/gump/public/workspace/httpcomponents/httpclient/gump_mvn_settings.xml
 -INFO- Failed with reason build failed
 -DEBUG- Maven POM in: /srv/gump/public/workspace/httpcomponents/httpclient/pom.xml
 -INFO- Project Reports in: /srv/gump/public/workspace/httpcomponents/httpclient/target/surefire-reports
 -WARNING- No directory [/srv/gump/public/workspace/httpcomponents/httpclient/target/surefire-reports]
 -INFO- Failed to extract fallback artifacts from Gump Repository



The following work was performed:
http://vmgump.apache.org/gump/public/httpcomponents/httpcomponents-client/gump_work/build_httpcomponents_httpcomponents-client.html
Work Name: build_httpcomponents_httpcomponents-client (Type: Build)
Work ended in a state of : Failed
Elapsed: 31 secs
Command Line: mvn --batch-mode -Dmaven.test.skip.exec=true --settings /srv/gump/public/workspace/httpcomponents/httpclient/gump_mvn_settings.xml package 
[Working Directory: /srv/gump/public/workspace/httpcomponents/httpclient]
CLASSPATH: /usr/lib/jvm/java-6-sun/lib/tools.jar:/srv/gump/public/workspace/httpcomponents/httpcore/httpcore/target/httpcore-4.1-SNAPSHOT.jar:commons-logging-gump-21082009.jar:commons-logging-api-gump-21082009.jar:/srv/gump/public/workspace/apache-commons/codec/dist/commons-codec-22082009.jar
---------------------------------------------
urls[10] = file:/srv/gump/public/workspace/mvnlocalrepo/org/apache/maven/shared/maven-osgi/0.2.0/maven-osgi-0.2.0.jar
[FATAL ERROR] Container realm = plexus.core
urls[0] = file:/opt/maven2/lib/maven-2.0.10-uber.jar
[INFO] ------------------------------------------------------------------------
[ERROR] FATAL ERROR
[INFO] ------------------------------------------------------------------------
[INFO] aQute/lib/reporter/Reporter
aQute.lib.reporter.Reporter
[INFO] ------------------------------------------------------------------------
[INFO] Trace
java.lang.NoClassDefFoundError: aQute/lib/reporter/Reporter
	at org.apache.felix.bundleplugin.BundlePlugin.buildOSGiBundle(BundlePlugin.java:360)
	at org.apache.felix.bundleplugin.BundlePlugin.execute(BundlePlugin.java:273)
	at org.apache.felix.bundleplugin.BundlePlugin.execute(BundlePlugin.java:227)
	at org.apache.felix.bundleplugin.BundlePlugin.execute(BundlePlugin.java:218)
	at org.apache.maven.plugin.DefaultPluginManager.executeMojo(DefaultPluginManager.java:453)
	at org.apache.maven.lifecycle.DefaultLifecycleExecutor.executeGoals(DefaultLifecycleExecutor.java:559)
	at org.apache.maven.lifecycle.DefaultLifecycleExecutor.executeGoalWithLifecycle(DefaultLifecycleExecutor.java:500)
	at org.apache.maven.lifecycle.DefaultLifecycleExecutor.executeGoal(DefaultLifecycleExecutor.java:479)
	at org.apache.maven.lifecycle.DefaultLifecycleExecutor.executeGoalAndHandleFailures(DefaultLifecycleExecutor.java:331)
	at org.apache.maven.lifecycle.DefaultLifecycleExecutor.executeTaskSegments(DefaultLifecycleExecutor.java:292)
	at org.apache.maven.lifecycle.DefaultLifecycleExecutor.execute(DefaultLifecycleExecutor.java:142)
	at org.apache.maven.DefaultMaven.doExecute(DefaultMaven.java:336)
	at org.apache.maven.DefaultMaven.execute(DefaultMaven.java:129)
	at org.apache.maven.cli.MavenCli.main(MavenCli.java:301)
	at sun.reflect.NativeMethodAccessorImpl.invoke0(Native Method)
	at sun.reflect.NativeMethodAccessorImpl.invoke(NativeMethodAccessorImpl.java:39)
	at sun.reflect.DelegatingMethodAccessorImpl.invoke(DelegatingMethodAccessorImpl.java:25)
	at java.lang.reflect.Method.invoke(Method.java:597)
	at org.codehaus.classworlds.Launcher.launchEnhanced(Launcher.java:315)
	at org.codehaus.classworlds.Launcher.launch(Launcher.java:255)
	at org.codehaus.classworlds.Launcher.mainWithExitCode(Launcher.java:430)
	at org.codehaus.classworlds.Launcher.main(Launcher.java:375)
Caused by: java.lang.ClassNotFoundException: aQute.lib.reporter.Reporter
	at java.net.URLClassLoader$1.run(URLClassLoader.java:200)
	at java.security.AccessController.doPrivileged(Native Method)
	at java.net.URLClassLoader.findClass(URLClassLoader.java:188)
	at java.lang.ClassLoader.loadClass(ClassLoader.java:306)
	at org.codehaus.classworlds.RealmClassLoader.loadClassDirect(RealmClassLoader.java:195)
	at org.codehaus.classworlds.DefaultClassRealm.loadClass(DefaultClassRealm.java:255)
	at org.codehaus.classworlds.DefaultClassRealm.loadClass(DefaultClassRealm.java:274)
	at org.codehaus.classworlds.RealmClassLoader.loadClass(RealmClassLoader.java:214)
	at java.lang.ClassLoader.loadClass(ClassLoader.java:251)
	at java.lang.ClassLoader.loadClassInternal(ClassLoader.java:319)
	... 22 more
[INFO] ------------------------------------------------------------------------
[INFO] Total time: 28 seconds
[INFO] Finished at: Sat Aug 22 03:59:45 PDT 2009
[INFO] Final Memory: 45M/81M
[INFO] ------------------------------------------------------------------------
---------------------------------------------

To subscribe to this information via syndicated feeds:
- RSS: http://vmgump.apache.org/gump/public/httpcomponents/httpcomponents-client/rss.xml
- Atom: http://vmgump.apache.org/gump/public/httpcomponents/httpcomponents-client/atom.xml

============================== Gump Tracking Only ===
Produced by Gump version 2.3.
Gump Run 25000022082009, vmgump:vmgump-public:25000022082009
Gump E-mail Identifier (unique within run) #37.

*********************************************************** G U M P
[GUMP@vmgump]: Project rat-test (in module rat) failed
To whom it may engage...
        
This is an automated request, but not an unsolicited one. For 
more information please visit http://gump.apache.org/nagged.html, 
and/or contact the folk at general@gump.apache.org.

Project rat-test has an issue affecting its community integration.
This issue affects 1 projects,
 and has been outstanding for 4 runs.
The current state of this project is 'Failed', with reason 'Build Failed'.
For reference only, the following projects are affected by this:
    - rat-test :  Release Audit Tool


Full details are available at:
    http://vmgump.apache.org/gump/public/rat/rat-test/index.html

That said, some information snippets are provided here.

The following annotations (debug/informational/warning/error messages) were provided:
 -WARNING- Overriding Maven2 settings: [/srv/gump/public/workspace/rat/gump_mvn_settings.xml]
 -DEBUG- (Gump generated) Maven2 Settings in: /srv/gump/public/workspace/rat/gump_mvn_settings.xml
 -INFO- Failed with reason build failed
 -DEBUG- Maven POM in: /srv/gump/public/workspace/rat/pom.xml



The following work was performed:
http://vmgump.apache.org/gump/public/rat/rat-test/gump_work/build_rat_rat-test.html
Work Name: build_rat_rat-test (Type: Build)
Work ended in a state of : Failed
Elapsed: 1 min 38 secs
Command Line: mvn --batch-mode --settings /srv/gump/public/workspace/rat/gump_mvn_settings.xml package 
[Working Directory: /srv/gump/public/workspace/rat]
CLASSPATH: /usr/lib/jvm/java-6-sun/lib/tools.jar:/srv/gump/public/workspace/rat/apache-rat-tasks/target/apache-rat-tasks-0.7-SNAPSHOT.jar:/srv/gump/public/workspace/rat/apache-rat-core/target/apache-rat-core-0.7-SNAPSHOT.jar:/srv/gump/public/workspace/rat/apache-rat-plugin/target/apache-rat-plugin-0.7-SNAPSHOT.jar
---------------------------------------------
[INFO] Using 2 extractors.
[INFO] Applying extractor for language: java
[INFO] Extractor for language: java found 2 mojo descriptors.
[INFO] Applying extractor for language: bsh
[INFO] Extractor for language: bsh found 0 mojo descriptors.
[INFO] [resources:resources]
[INFO] Using 'UTF-8' encoding to copy filtered resources.
[INFO] Copying 1 resource
[INFO] Copying 1 resource
[INFO] Copying 2 resources to META-INF
[INFO] [compiler:compile]
[INFO] Nothing to compile - all classes are up to date
[INFO] [resources:testResources]
[INFO] Using 'UTF-8' encoding to copy filtered resources.
[INFO] skip non existing resourceDirectory /srv/gump/public/workspace/rat/apache-rat-plugin/src/test/resources
[INFO] Copying 0 resource
Downloading: http://localhost:8192/maven2/junit/junit/3.8.2/junit-3.8.2.jar
229K downloaded
[INFO] [compiler:testCompile]
[INFO] Nothing to compile - all classes are up to date
[INFO] [surefire:test]
[INFO] Surefire report directory: /srv/gump/public/workspace/rat/apache-rat-plugin/target/surefire-reports

-------------------------------------------------------
 T E S T S
-------------------------------------------------------
Running org.apache.rat.mp.RatCheckMojoTest
Tests run: 2, Failures: 0, Errors: 2, Skipped: 0, Time elapsed: 0.217 sec <<< FAILURE!

Results :

Tests in error: 
  testIt1(org.apache.rat.mp.RatCheckMojoTest)
  testIt2(org.apache.rat.mp.RatCheckMojoTest)

Tests run: 2, Failures: 0, Errors: 2, Skipped: 0

[INFO] ------------------------------------------------------------------------
[ERROR] BUILD FAILURE
[INFO] ------------------------------------------------------------------------
[INFO] There are test failures.

Please refer to /srv/gump/public/workspace/rat/apache-rat-plugin/target/surefire-reports for the individual test results.
[INFO] ------------------------------------------------------------------------
[INFO] For more information, run Maven with the -e switch
[INFO] ------------------------------------------------------------------------
[INFO] Total time: 1 minute 37 seconds
[INFO] Finished at: Sat Aug 22 04:01:46 PDT 2009
[INFO] Final Memory: 18M/34M
[INFO] ------------------------------------------------------------------------
---------------------------------------------

To subscribe to this information via syndicated feeds:
- RSS: http://vmgump.apache.org/gump/public/rat/rat-test/rss.xml
- Atom: http://vmgump.apache.org/gump/public/rat/rat-test/atom.xml

============================== Gump Tracking Only ===
Produced by Gump version 2.3.
Gump Run 25000022082009, vmgump:vmgump-public:25000022082009
Gump E-mail Identifier (unique within run) #38.

*********************************************************** G U M P
[GUMP@vmgump]: Project directory-ldap (in module directory-shared) failed
To whom it may engage...
        
This is an automated request, but not an unsolicited one. For 
more information please visit http://gump.apache.org/nagged.html, 
and/or contact the folk at general@gump.apache.org.

Project directory-ldap has an issue affecting its community integration.
This issue affects 5 projects,
 and has been outstanding for 2 runs.
The current state of this project is 'Failed', with reason 'Build Failed'.
For reference only, the following projects are affected by this:
    - apacheds-shared :  Apache Directory Server
    - apacheds-shared-test :  Apache Directory Server
    - directory-ldap :  Apache ASN.1 Tools
    - directory-ldap-test :  Apache ASN.1 Tools
    - kerberos-common :  Apache Directory Project


Full details are available at:
    http://vmgump.apache.org/gump/public/directory-shared/directory-ldap/index.html

That said, some information snippets are provided here.

The following annotations (debug/informational/warning/error messages) were provided:
 -INFO- Optional dependency asn1-codec failed with reason build failed
 -DEBUG- (Gump generated) Maven2 Settings in: /srv/gump/public/workspace/directory-shared/ldap/gump_mvn_settings.xml
 -INFO- Failed with reason build failed
 -DEBUG- Maven POM in: /srv/gump/public/workspace/directory-shared/ldap/pom.xml
 -INFO- Failed to extract fallback artifacts from Gump Repository



The following work was performed:
http://vmgump.apache.org/gump/public/directory-shared/directory-ldap/gump_work/build_directory-shared_directory-ldap.html
Work Name: build_directory-shared_directory-ldap (Type: Build)
Work ended in a state of : Failed
Elapsed: 7 secs
Command Line: mvn --batch-mode -Dmaven.test.skip.exec=true --settings /srv/gump/public/workspace/directory-shared/ldap/gump_mvn_settings.xml package 
[Working Directory: /srv/gump/public/workspace/directory-shared/ldap]
CLASSPATH: /usr/lib/jvm/java-6-sun/lib/tools.jar:/srv/gump/packages/antlr/antlr-3.1.3.jar:/srv/gump/public/workspace/directory-shared/asn1-codec/target/shared-asn1-codec-0.9.16-SNAPSHOT.jar:/srv/gump/public/workspace/jakarta-oro/jakarta-oro-22082009.jar:/srv/gump/public/workspace/jakarta-regexp/build/jakarta-regexp-22082009.jar:/srv/gump/public/workspace/junit/dist/junit-22082009.jar:/srv/gump/public/workspace/apache-commons/lang/target/commons-lang-3.0-SNAPSHOT.jar:/srv/gump/public/workspace/directory-shared/ldap-constants/target/shared-ldap-constants-0.9.16-SNAPSHOT.jar
---------------------------------------------
[INFO] Scanning for projects...
[INFO] ------------------------------------------------------------------------
[INFO] Building Apache Directory Protocol Ldap Shared
[INFO]    task-segment: [package]
[INFO] ------------------------------------------------------------------------
Downloading: http://localhost:8192/maven2/org/apache/maven/plugins/maven-antlr-plugin/2.0-beta-1/maven-antlr-plugin-2.0-beta-1.pom
2K downloaded
Downloading: http://localhost:8192/maven2/org/apache/maven/plugins/maven-plugin-parent/2.0-beta-1/maven-plugin-parent-2.0-beta-1.pom
6K downloaded
Downloading: http://localhost:8192/maven2/org/apache/maven/plugins/maven-antlr-plugin/2.0-beta-1/maven-antlr-plugin-2.0-beta-1.jar
7K downloaded
[INFO] ------------------------------------------------------------------------
[ERROR] BUILD ERROR
[INFO] ------------------------------------------------------------------------
[INFO] Error building POM (may not be this project's POM).


Project ID: org.apache.directory.shared:shared-asn1

Reason: Error getting POM for 'org.apache.directory.shared:shared-asn1' from the repository: Unable to read local copy of metadata: Cannot read metadata from '/srv/gump/public/workspace/mvnlocalrepo/org/apache/directory/shared/shared-asn1/0.9.16-SNAPSHOT/maven-metadata-apache.snapshots.xml': end tag name </p> must match start tag name <br> from line 6 (position: TEXT seen ...<a href="/">home page</a>.\n</p>... @8:5) 
  org.apache.directory.shared:shared-asn1:pom:0.9.16-SNAPSHOT


 for project org.apache.directory.shared:shared-asn1


[INFO] ------------------------------------------------------------------------
[INFO] For more information, run Maven with the -e switch
[INFO] ------------------------------------------------------------------------
[INFO] Total time: 5 seconds
[INFO] Finished at: Sat Aug 22 04:05:33 PDT 2009
[INFO] Final Memory: 7M/14M
[INFO] ------------------------------------------------------------------------
---------------------------------------------

To subscribe to this information via syndicated feeds:
- RSS: http://vmgump.apache.org/gump/public/directory-shared/directory-ldap/rss.xml
- Atom: http://vmgump.apache.org/gump/public/directory-shared/directory-ldap/atom.xml

============================== Gump Tracking Only ===
Produced by Gump version 2.3.
Gump Run 25000022082009, vmgump:vmgump-public:25000022082009
Gump E-mail Identifier (unique within run) #41.

*********************************************************** G U M P
[GUMP@vmgump]: Project cocoon (in module cocoon) failed
To whom it may engage...
        
This is an automated request, but not an unsolicited one. For 
more information please visit http://gump.apache.org/nagged.html, 
and/or contact the folk at general@gump.apache.org.

Project cocoon has an issue affecting its community integration.
This issue affects 1 projects,
 and has been outstanding for 1158 runs.
The current state of this project is 'Failed', with reason 'Build Failed'.
For reference only, the following projects are affected by this:
    - cocoon :  Java XML Framework


Full details are available at:
    http://vmgump.apache.org/gump/public/cocoon/cocoon/index.html

That said, some information snippets are provided here.

The following annotations (debug/informational/warning/error messages) were provided:
 -INFO- Optional dependency excalibur-datasource prerequisite failed with reason build failed
 -INFO- Optional dependency excalibur-pool-instrumented prerequisite failed with reason build failed
 -INFO- Optional dependency xml-fop prerequisite failed with reason build failed
 -INFO- Optional dependency commons-jxpath prerequisite failed with reason build failed
 -INFO- Optional dependency velocity-engine prerequisite failed with reason build failed
 -INFO- Optional dependency commons-validator prerequisite failed with reason build failed
 -INFO- Optional dependency commons-digester prerequisite failed with reason build failed
 -INFO- Optional dependency htmlunit prerequisite failed with reason build failed
 -INFO- Optional dependency commons-beanutils prerequisite failed with reason build failed
 -INFO- Optional dependency commons-httpclient prerequisite failed with reason build failed
 -INFO- Optional dependency commons-jexl prerequisite failed with reason build failed
 -INFO- Optional dependency commons-logging prerequisite failed with reason build failed
 -INFO- Optional dependency commons-configuration failed with reason build failed
 -DEBUG- (Gump generated) Maven2 Settings in: /srv/gump/public/workspace/cocoon/gump_mvn_settings.xml
 -INFO- Failed with reason build failed
 -DEBUG- Maven POM in: /srv/gump/public/workspace/cocoon/pom.xml



The following work was performed:
http://vmgump.apache.org/gump/public/cocoon/cocoon/gump_work/build_cocoon_cocoon.html
Work Name: build_cocoon_cocoon (Type: Build)
Work ended in a state of : Failed
Elapsed: 2 mins 48 secs
Command Line: mvn --batch-mode --settings /srv/gump/public/workspace/cocoon/gump_mvn_settings.xml package 
[Working Directory: /srv/gump/public/workspace/cocoon]
CLASSPATH: /usr/lib/jvm/java-6-sun/lib/tools.jar:/srv/gump/public/workspace/junit/dist/junit-22082009.jar:/srv/gump/public/workspace/apache-commons/lang/target/commons-lang-3.0-SNAPSHOT.jar:/srv/gump/public/workspace/ant/dist/lib/ant-jmf.jar:/srv/gump/public/workspace/ant/dist/lib/ant-swing.jar:/srv/gump/public/workspace/ant/dist/lib/ant-apache-resolver.jar:/srv/gump/public/workspace/ant/dist/lib/ant-apache-xalan2.jar:/srv/gump/public/workspace/ant/dist/lib/ant-trax.jar:/srv/gump/public/workspace/ant/dist/lib/ant-junit.jar:/srv/gump/public/workspace/ant/dist/lib/ant-launcher.jar:/srv/gump/public/workspace/ant/dist/lib/ant-nodeps.jar:/srv/gump/public/workspace/ant/dist/lib/ant.jar:/srv/gump/public/workspace/aopalliance/build/aopalliance.jar:/srv/gump/packages/bsh-2.0b4/bsh-commands-2.0b4.jar:/srv/gump/packages/bsh-2.0b4/bsh-classpath-2.0b4.jar:/srv/gump/packages/bsh-2.0b4/bsh-core-2.0b4.jar:/srv/gump/packages/bsh-2.0b4/bsh-bsf-2.0b4.jar:/srv/gump/packages/bsh-2.0b4/bsh-2.0b4.j
 ar:/srv/gump/packages/bsh-2.0b4/bsh-reflect-2.0b4.jar:/srv/gump/packages/bsh-2.0b4/bsh-util-2.0b4.jar:commons-beanutils-gump-21082009.jar:/srv/gump/public/workspace/apache-commons/codec/dist/commons-codec-22082009.jar:/srv/gump/public/workspace/apache-commons/collections/build/commons-collections-22082009.jar:commons-configuration-gump-21082009.jar:commons-digester-gump-21082009.jar:commons-httpclient-gump-21082009.jar:/srv/gump/public/workspace/apache-commons/io/target/commons-io-22082009.jar:commons-jexl-gump-21082009.jar:commons-jxpath-gump-21082009.jar:commons-logging-gump-21082009.jar:commons-logging-api-gump-21082009.jar:commons-validator-gump-21082009.jar:/srv/gump/packages/dougLea/concurrent.jar:/srv/gump/public/workspace/dom4j/build/dom4j.jar:excalibur-datasource-gump-21082009.jar:excalibur-pool-instrumented-gump-21082009.jar:/srv/gump/public/workspace/hsqldb/lib/hsqldb.jar:/srv/gump/public/workspace/htmlunit/target/htmlunit-22082009.jar:/srv/gump/public/workspace/j
 akarta-oro/jakarta-oro-22082009.jar:/srv/gump/public/workspace/jakarta-regexp/build/jakarta-regexp-22082009.jar:/srv/gump/public/workspace/jaxen/target/jaxen-22082009.jar:/srv/gump/public/workspace/jdom/build/jdom.jar:/srv/gump/public/workspace/jmock/build/dist/jmock-core-22082009.jar:/srv/gump/public/workspace/jmock/build/dist/jmock-cglib-22082009.jar:/srv/gump/packages/jtidy-04aug2000r7-dev/build/Tidy.jar:/srv/gump/public/workspace/logging-log4j-12/dist/lib/log4j-22082009.jar:/srv/gump/packages/nekohtml-0.9.5/nekohtml.jar:/srv/gump/public/workspace/rhino/build/rhino_22082009/js.jar:velocity-gump-21082009.jar:velocity-dep-gump-21082009.jar:/srv/gump/public/workspace/xml-commons/java/external/build/xml-apis-ext.jar:/srv/gump/public/workspace/xml-commons/java/external/build/xml-apis.jar:/srv/gump/public/workspace/xml-batik/batik-22082009/lib/batik-util.jar:/srv/gump/public/workspace/xml-batik/batik-22082009/lib/batik-swing.jar:/srv/gump/public/workspace/xml-batik/batik-220820
 09/lib/batik-css.jar:/srv/gump/public/workspace/xml-batik/batik-22082009/lib/batik-bridge.jar:/srv/gump/public/workspace/xml-batik/batik-22082009/lib/batik-xml.jar:/srv/gump/public/workspace/xml-batik/batik-22082009/lib/batik-svg-dom.jar:/srv/gump/public/workspace/xml-batik/batik-22082009/lib/batik-awt-util.jar:/srv/gump/public/workspace/xml-batik/batik-22082009/lib/batik-transcoder.jar:/srv/gump/public/workspace/xml-batik/batik-22082009/lib/batik-gui-util.jar:/srv/gump/public/workspace/xml-batik/batik-22082009/lib/batik-dom.jar:/srv/gump/public/workspace/xml-batik/batik-22082009/lib/batik-ext.jar:/srv/gump/public/workspace/xml-batik/batik-22082009/lib/batik-script.jar:/srv/gump/public/workspace/xml-batik/batik-22082009/lib/batik-svggen.jar:/srv/gump/public/workspace/xml-batik/batik-22082009/lib/batik-parser.jar:/srv/gump/public/workspace/xml-batik/batik-22082009/lib/batik-extension.jar:/srv/gump/public/workspace/xml-batik/batik-22082009/lib/batik-gvt.jar:fop-gump-21082009.j
 ar:/srv/gump/public/workspace/xml-commons/java/build/resolver.jar:/srv/gump/public/workspace/xml-xerces2/build/xercesImpl.jar:/srv/gump/public/workspace/xmlunit/build/java/lib/xmlunit-sumo-22082009.jar:/srv/gump/public/workspace/xmlunit/build/java/lib/xmlunit-legacy-22082009.jar:/srv/gump/public/workspace/xmlunit/build/java/lib/xmlunit-core-22082009.jar:/srv/gump/public/workspace/xom/build/xom-22082009.jar
---------------------------------------------
Downloading: http://localhost:8192/maven2/org/apache/maven/maven-repository-metadata/2.0.1/maven-repository-metadata-2.0.1.jar
19K downloaded
Downloading: http://people.apache.org/~gkossakowski/maven2/repository/org/apache/maven/wagon/wagon-provider-api/1.0-alpha-5/wagon-provider-api-1.0-alpha-5.jar
Downloading: http://localhost:8192/maven2/org/apache/maven/wagon/wagon-provider-api/1.0-alpha-5/wagon-provider-api-1.0-alpha-5.jar
50K downloaded
Downloading: http://localhost:8192/maven2/org/apache/maven/plugins/maven-war-plugin/2.0.2/maven-war-plugin-2.0.2.jar
27K downloaded
Downloading: http://people.apache.org/~gkossakowski/maven2/repository/org/apache/maven/maven-archiver/2.2/maven-archiver-2.2.jar
Downloading: http://localhost:8192/maven2/org/apache/maven/maven-archiver/2.2/maven-archiver-2.2.jar
9K downloaded
Downloading: http://localhost:8192/maven2/javax/servlet/servlet-api/2.4/servlet-api-2.4.jar
91K downloaded
[INFO] [plugin:descriptor]
[WARNING] 

Goal prefix is specified as: 'cocoon'. Maven currently expects it to be 'cocoon'.

[INFO] Using 2 extractors.
[INFO] Applying extractor for language: java
[INFO] Extractor for language: java found 4 mojo descriptors.
[INFO] Applying extractor for language: bsh
[INFO] Extractor for language: bsh found 0 mojo descriptors.
[INFO] [resources:resources]
[WARNING] Using platform encoding (UTF-8 actually) to copy filtered resources, i.e. build is platform dependent!
[INFO] Copying 7 resources
[INFO] Copying 2 resources to META-INF
[INFO] [compiler:compile]
[INFO] Compiling 24 source files to /srv/gump/public/workspace/cocoon/tools/cocoon-maven-plugin/target/classes
[INFO] ------------------------------------------------------------------------
[ERROR] BUILD FAILURE
[INFO] ------------------------------------------------------------------------
[INFO] Compilation failure
/srv/gump/public/workspace/cocoon/tools/cocoon-maven-plugin/src/main/java/org/apache/cocoon/maven/rcl/PrepareWebappMojo.java:[285,8] cannot access org.apache.commons.lang.exception.NestableException
class file for org.apache.commons.lang.exception.NestableException not found
        try {



/srv/gump/public/workspace/cocoon/tools/cocoon-maven-plugin/src/main/java/org/apache/cocoon/maven/rcl/PrepareWebappMojo.java:[285,8] cannot access org.apache.commons.lang.exception.NestableException
class file for org.apache.commons.lang.exception.NestableException not found
        try {


[INFO] ------------------------------------------------------------------------
[INFO] For more information, run Maven with the -e switch
[INFO] ------------------------------------------------------------------------
[INFO] Total time: 2 minutes 46 seconds
[INFO] Finished at: Sat Aug 22 04:13:35 PDT 2009
[INFO] Final Memory: 57M/102M
[INFO] ------------------------------------------------------------------------
---------------------------------------------

To subscribe to this information via syndicated feeds:
- RSS: http://vmgump.apache.org/gump/public/cocoon/cocoon/rss.xml
- Atom: http://vmgump.apache.org/gump/public/cocoon/cocoon/atom.xml

============================== Gump Tracking Only ===
Produced by Gump version 2.3.
Gump Run 25000022082009, vmgump:vmgump-public:25000022082009
Gump E-mail Identifier (unique within run) #42.

*********************************************************** G U M P
[GUMP@vmgump]: Project tapestry (in module tapestry) failed
To whom it may engage...
        
This is an automated request, but not an unsolicited one. For 
more information please visit http://gump.apache.org/nagged.html, 
and/or contact the folk at general@gump.apache.org.

Project tapestry has an issue affecting its community integration.
This issue affects 1 projects,
 and has been outstanding for 1134 runs.
The current state of this project is 'Failed', with reason 'Build Failed'.
For reference only, the following projects are affected by this:
    - tapestry :  Component-based web application framework organized around i...


Full details are available at:
    http://vmgump.apache.org/gump/public/tapestry/tapestry/index.html

That said, some information snippets are provided here.

The following annotations (debug/informational/warning/error messages) were provided:
 -DEBUG- Sole output [tapestry-22082009.jar] identifier set to project name
 -INFO- Optional dependency commons-digester prerequisite failed with reason build failed
 -INFO- Optional dependency commons-digester prerequisite failed with reason build failed
 -INFO- Optional dependency commons-fileupload prerequisite failed with reason build failed
 -INFO- Optional dependency commons-beanutils prerequisite failed with reason build failed
 -INFO- Optional dependency commons-logging prerequisite failed with reason build failed
 -DEBUG- (Gump generated) Maven2 Settings in: /srv/gump/public/workspace/tapestry/gump_mvn_settings.xml
 -INFO- Failed with reason build failed
 -DEBUG- Maven POM in: /srv/gump/public/workspace/tapestry/pom.xml
 -INFO- Failed to extract fallback artifacts from Gump Repository



The following work was performed:
http://vmgump.apache.org/gump/public/tapestry/tapestry/gump_work/build_tapestry_tapestry.html
Work Name: build_tapestry_tapestry (Type: Build)
Work ended in a state of : Failed
Elapsed: 17 secs
Command Line: mvn --batch-mode --settings /srv/gump/public/workspace/tapestry/gump_mvn_settings.xml package 
[Working Directory: /srv/gump/public/workspace/tapestry]
CLASSPATH: /usr/lib/jvm/java-6-sun/lib/tools.jar:commons-beanutils-gump-21082009.jar:/srv/gump/public/workspace/apache-commons/codec/dist/commons-codec-22082009.jar:commons-digester-gump-21082009.jar:commons-fileupload-gump-21082009.jar:/srv/gump/public/workspace/apache-commons/io/target/commons-io-22082009.jar:/srv/gump/public/workspace/apache-commons/lang/target/commons-lang-3.0-SNAPSHOT.jar:commons-logging-gump-21082009.jar:commons-logging-api-gump-21082009.jar:/srv/gump/packages/easymock1.2_Java1.3/easymock.jar:/srv/gump/packages/easymockclassextension1.2/easymockclassextension.jar:/srv/gump/public/workspace/jakarta-oro/jakarta-oro-22082009.jar:/srv/gump/public/workspace/jakarta-servletapi-4/lib/servlet.jar:/srv/gump/public/workspace/javassist/javassist.jar:/srv/gump/public/workspace/jdom/build/jdom.jar:/srv/gump/public/workspace/logging-log4j-12/dist/lib/log4j-22082009.jar:/srv/gump/packages/ognl-2.6.7/ognl-2.6.7.jar:/srv/gump/public/workspace/xml-commons/java/external/b
 uild/xml-apis-ext.jar:/srv/gump/packages/jCharts-0.7.5/jCharts-0.7.5.jar
---------------------------------------------
-----------------------------------------------------
this realm = app0.child-container[org.apache.maven.plugins:maven-site-plugin]
urls[0] = file:/srv/gump/public/workspace/tapestry.mvnlocalrepo/org/apache/maven/plugins/maven-site-plugin/2.0-beta-5/maven-site-plugin-2.0-beta-5.jar
urls[1] = file:/srv/gump/public/workspace/tapestry.mvnlocalrepo/org/codehaus/plexus/plexus-utils/1.1/plexus-utils-1.1.jar
urls[2] = file:/srv/gump/public/workspace/tapestry.mvnlocalrepo/org/apache/maven/doxia/doxia-site-renderer/1.0-alpha-8/doxia-site-renderer-1.0-alpha-8.jar
urls[3] = file:/srv/gump/public/workspace/tapestry.mvnlocalrepo/org/apache/maven/doxia/doxia-core/1.0-alpha-8/doxia-core-1.0-alpha-8.jar
urls[4] = file:/srv/gump/public/workspace/tapestry.mvnlocalrepo/org/codehaus/plexus/plexus-i18n/1.0-beta-6/plexus-i18n-1.0-beta-6.jar
urls[5] = file:/srv/gump/public/workspace/tapestry.mvnlocalrepo/org/codehaus/plexus/plexus-velocity/1.1.3/plexus-velocity-1.1.3.jar
urls[6] = file:/srv/gump/public/workspace/tapestry.mvnlocalrepo/org/apache/maven/doxia/doxia-decoration-model/1.0-alpha-8/doxia-decoration-model-1.0-alpha-8.jar
urls[7] = file:/srv/gump/public/workspace/tapestry.mvnlocalrepo/org/mortbay/jetty/jetty/6.0.0beta12/jetty-6.0.0beta12.jar
urls[8] = file:/srv/gump/public/workspace/tapestry.mvnlocalrepo/org/mortbay/jetty/servlet-api-2.5/6.0.0beta12/servlet-api-2.5-6.0.0beta12.jar
Number of imports: 10
import: org.codehaus.classworlds.Entry@a6c57a42
import: org.codehaus.classworlds.Entry@12f43f3b
import: org.codehaus.classworlds.Entry@20025374
import: org.codehaus.classworlds.Entry@f8e44ca4
import: org.codehaus.classworlds.Entry@92758522
import: org.codehaus.classworlds.Entry@ebf2705b
import: org.codehaus.classworlds.Entry@bb25e54
import: org.codehaus.classworlds.Entry@bece5185
import: org.codehaus.classworlds.Entry@3fee8e37
import: org.codehaus.classworlds.Entry@3fee19d8


this realm = plexus.core
urls[0] = file:/opt/maven2/lib/maven-2.0.10-uber.jar
Number of imports: 10
import: org.codehaus.classworlds.Entry@a6c57a42
import: org.codehaus.classworlds.Entry@12f43f3b
import: org.codehaus.classworlds.Entry@20025374
import: org.codehaus.classworlds.Entry@f8e44ca4
import: org.codehaus.classworlds.Entry@92758522
import: org.codehaus.classworlds.Entry@ebf2705b
import: org.codehaus.classworlds.Entry@bb25e54
import: org.codehaus.classworlds.Entry@bece5185
import: org.codehaus.classworlds.Entry@3fee8e37
import: org.codehaus.classworlds.Entry@3fee19d8
-----------------------------------------------------
[INFO] ------------------------------------------------------------------------
[ERROR] BUILD ERROR
[INFO] ------------------------------------------------------------------------
[INFO] Internal error in the plugin manager executing goal 'org.apache.maven.plugins:maven-site-plugin:2.0-beta-5:attach-descriptor': Unable to find the mojo 'org.apache.maven.plugins:maven-site-plugin:2.0-beta-5:attach-descriptor' in the plugin 'org.apache.maven.plugins:maven-site-plugin'
org.apache.maven.doxia.site.decoration.LinkItem
[INFO] ------------------------------------------------------------------------
[INFO] For more information, run Maven with the -e switch
[INFO] ------------------------------------------------------------------------
[INFO] Total time: 16 seconds
[INFO] Finished at: Sat Aug 22 04:15:58 PDT 2009
[INFO] Final Memory: 3M/8M
[INFO] ------------------------------------------------------------------------
---------------------------------------------

To subscribe to this information via syndicated feeds:
- RSS: http://vmgump.apache.org/gump/public/tapestry/tapestry/rss.xml
- Atom: http://vmgump.apache.org/gump/public/tapestry/tapestry/atom.xml

============================== Gump Tracking Only ===
Produced by Gump version 2.3.
Gump Run 25000022082009, vmgump:vmgump-public:25000022082009
Gump E-mail Identifier (unique within run) #43.


--
Apache Gump
http://gump.apache.org/ [Instance: vmgump]

---------------------------------------------------------------------
To unsubscribe, e-mail: general-unsubscribe@gump.apache.org
For additional commands, e-mail: general-help@gump.apache.org


Mime
View raw message