gump-general mailing list archives

Site index · List index
Message view « Date » · « Thread »
Top « Date » · « Thread »
From g...@vmgump.apache.org
Subject BATCH: All dressed up, with nowhere to go...
Date Wed, 05 Aug 2009 07:55:42 GMT
Dear Gumpmeisters,
            
The following 42 notifys should have been sent

*********************************************************** G U M P
[GUMP@vmgump]: Project gsbase (in module gsbase) failed
[GUMP@vmgump]: Project gsbase-test (in module gsbase) failed
[GUMP@vmgump]: Module apr-util success, but with warnings.
[GUMP@vmgump]: Module jdom success, but with warnings.
[GUMP@vmgump]: Project jmock2 (in module jmock2) failed
[GUMP@vmgump]: Project apr-iconv-configure (in module apr-iconv) failed
[GUMP@vmgump]: Project derby (in module db-derby) failed
[GUMP@vmgump]: Project dotnet-antlib-test (in module ant-antlibs) failed
[GUMP@vmgump]: Project emma (in module emma) failed
[GUMP@vmgump]: Project logging-log4cxx-configure (in module logging-log4cxx) failed
[GUMP@vmgump]: Project jython (in module jython) failed
[GUMP@vmgump]: Project jtidy-cvs (in module jtidy) failed
[GUMP@vmgump]: Project slf4j-test (in module slf4j) failed
[GUMP@vmgump]: Project castor-test (in module castor) failed
[GUMP@vmgump]: Module ws-axis2-commons success, but with warnings.
[GUMP@vmgump]: Project ws-commons-xmlschema (in module ws-axis2-commons) failed
[GUMP@vmgump]: Project xml-security-tests (in module xml-security) failed
[GUMP@vmgump]: Project ws-commons-axiom (in module ws-axis2-commons) failed
[GUMP@vmgump]: Project authx-script-test (in module authx) failed
[GUMP@vmgump]: Project ws-commons-policy (in module ws-axis2-commons) failed
[GUMP@vmgump]: Project JacORB-idllib (in module JacORB) failed
[GUMP@vmgump]: Project jetty (in module jetty) failed
[GUMP@vmgump]: Module ws-axis2 success, but with warnings.
[GUMP@vmgump]: Module ivy success, but with warnings.
[GUMP@vmgump]: Module ggf-cddlm success, but with warnings.
[GUMP@vmgump]: Project commons-jci (in module apache-commons) failed
[GUMP@vmgump]: Project httpcomponents-core (in module httpcomponents) failed
[GUMP@vmgump]: Module poi success, but with warnings.
[GUMP@vmgump]: Project groovy (in module groovy) failed
[GUMP@vmgump]: Project httpcomponents-client (in module httpcomponents) failed
[GUMP@vmgump]: Project maven (in module maven) failed
[GUMP@vmgump]: Project rat-test (in module rat) failed
[GUMP@vmgump]: Project maven-bootstrap (in module maven) failed
[GUMP@vmgump]: Module cocoon success, but with warnings.
[GUMP@vmgump]: Project cocoon (in module cocoon) failed
[GUMP@vmgump]: Project kerberos-common (in module kerberos-shared) failed
[GUMP@vmgump]: Project tapestry (in module tapestry) failed
[GUMP@vmgump]: Project apacheds-shared (in module apacheds) failed
[GUMP@vmgump]: Module lucene-java success, but with warnings.
[GUMP@vmgump]: Project naming-config-test (in module directory-naming) failed
[GUMP@vmgump]: Project ldap-protocol (in module ldap-protocol) failed
[GUMP@vmgump]: Project portals-pluto-portal-1.0 (in module portals-pluto-1.0) failed
*********************************************************** G U M P
[GUMP@vmgump]: Project gsbase (in module gsbase) failed
To whom it may engage...
        
This is an automated request, but not an unsolicited one. For 
more information please visit http://gump.apache.org/nagged.html, 
and/or contact the folk at general@gump.apache.org.

Project gsbase has an issue affecting its community integration.
This issue affects 2 projects,
 and has been outstanding for 23 runs.
The current state of this project is 'Failed', with reason 'Build Failed'.
For reference only, the following projects are affected by this:
    - gsbase :  A collection of java utility classes
    - htmlunit :  A tool for testing web based applications


Full details are available at:
    http://vmgump.apache.org/gump/public/gsbase/gsbase/index.html

That said, some information snippets are provided here.

The following annotations (debug/informational/warning/error messages) were provided:
 -DEBUG- Sole output [gsbase-05082009.jar] identifier set to project name
 -DEBUG- (Gump generated) Maven Properties in: /srv/gump/public/workspace/gsbase/build.properties
 -INFO- Failed with reason build failed
 -DEBUG- Maven POM in: /srv/gump/public/workspace/gsbase/project.xml
 -DEBUG- Maven project properties in: /srv/gump/public/workspace/gsbase/project.properties
 -INFO- Failed to extract fallback artifacts from Gump Repository



The following work was performed:
http://vmgump.apache.org/gump/public/gsbase/gsbase/gump_work/build_gsbase_gsbase.html
Work Name: build_gsbase_gsbase (Type: Build)
Work ended in a state of : Failed
Elapsed: 6 secs
Command Line: maven --offline jar 
[Working Directory: /srv/gump/public/workspace/gsbase]
CLASSPATH: /usr/lib/jvm/java-6-sun/lib/tools.jar:/srv/gump/public/workspace/gsbase/target/classes:/srv/gump/public/workspace/junit/dist/junit-05082009.jar:/srv/gump/packages/junitperf-1.8/lib/junitperf.jar
---------------------------------------------
| |\/| / _` \ V / -_) ' \  ~ intelligent projects ~
|_|  |_\__,_|\_/\___|_||_|  v. 1.0.2

build:start:

java:prepare-filesystem:
    [mkdir] Created dir: /srv/gump/public/workspace/gsbase/target/classes

java:compile:
    [echo] Compiling to /srv/gump/public/workspace/gsbase/target/classes
    [echo] 
==========================================================

  NOTE: Targetting JVM 1.6, classes
  will not run on earlier JVMs

==========================================================
          
    [javac] Compiling 66 source files to /srv/gump/public/workspace/gsbase/target/classes
/srv/gump/public/workspace/gsbase/src/java/com/gargoylesoftware/base/resource/jdbc/StatementWrapper.java:65: com.gargoylesoftware.base.resource.jdbc.StatementWrapper is not abstract and does not override abstract method isPoolable() in java.sql.Statement
public class StatementWrapper implements Statement {
       ^
/srv/gump/public/workspace/gsbase/src/java/com/gargoylesoftware/base/resource/jdbc/PreparedStatementWrapper.java:64: com.gargoylesoftware.base.resource.jdbc.PreparedStatementWrapper is not abstract and does not override abstract method setNClob(int,java.io.Reader) in java.sql.PreparedStatement
public class PreparedStatementWrapper
       ^
/srv/gump/public/workspace/gsbase/src/java/com/gargoylesoftware/base/resource/jdbc/ConnectionWrapper.java:77: com.gargoylesoftware.base.resource.jdbc.ConnectionWrapper is not abstract and does not override abstract method createStruct(java.lang.String,java.lang.Object[]) in java.sql.Connection
public final class ConnectionWrapper implements Connection, ManagedResource {
             ^
/srv/gump/public/workspace/gsbase/src/java/com/gargoylesoftware/base/resource/jdbc/CallableStatementWrapper.java:81: com.gargoylesoftware.base.resource.jdbc.CallableStatementWrapper is not abstract and does not override abstract method setNClob(java.lang.String,java.io.Reader) in java.sql.CallableStatement
public final class CallableStatementWrapper
             ^
/srv/gump/public/workspace/gsbase/src/java/com/gargoylesoftware/base/resource/jdbc/DatabaseMetaDataWrapper.java:54: com.gargoylesoftware.base.resource.jdbc.DatabaseMetaDataWrapper is not abstract and does not override abstract method getFunctionColumns(java.lang.String,java.lang.String,java.lang.String,java.lang.String) in java.sql.DatabaseMetaData
public final class DatabaseMetaDataWrapper implements DatabaseMetaData {
             ^
/srv/gump/public/workspace/gsbase/src/java/com/gargoylesoftware/base/resource/jdbc/ResultSetWrapper.java:150: com.gargoylesoftware.base.resource.jdbc.ResultSetWrapper is not abstract and does not override abstract method updateNClob(java.lang.String,java.io.Reader) in java.sql.ResultSet
public final class ResultSetWrapper implements ResultSet {
             ^
Note: Some input files use unchecked or unsafe operations.
Note: Recompile with -Xlint:unchecked for details.
6 errors

BUILD FAILED
File...... /home/gump/.maven/cache/maven-java-plugin-1.5/plugin.jelly
Element... ant:javac
Line...... 63
Column.... 48
Compile failed; see the compiler error output for details.
Total time: 5 seconds
Finished at: Wed Aug 05 01:33:51 PDT 2009

---------------------------------------------

To subscribe to this information via syndicated feeds:
- RSS: http://vmgump.apache.org/gump/public/gsbase/gsbase/rss.xml
- Atom: http://vmgump.apache.org/gump/public/gsbase/gsbase/atom.xml

============================== Gump Tracking Only ===
Produced by Gump version 2.3.
Gump Run 05000005082009, vmgump:vmgump-public:05000005082009
Gump E-mail Identifier (unique within run) #2.

*********************************************************** G U M P
[GUMP@vmgump]: Project gsbase-test (in module gsbase) failed
To whom it may engage...
        
This is an automated request, but not an unsolicited one. For 
more information please visit http://gump.apache.org/nagged.html, 
and/or contact the folk at general@gump.apache.org.

Project gsbase-test has an issue affecting its community integration.
This issue affects 1 projects,
 and has been outstanding for 23 runs.
The current state of this project is 'Failed', with reason 'Build Failed'.
For reference only, the following projects are affected by this:
    - gsbase-test :  A collection of java utility classes


Full details are available at:
    http://vmgump.apache.org/gump/public/gsbase/gsbase-test/index.html

That said, some information snippets are provided here.

The following annotations (debug/informational/warning/error messages) were provided:
 -WARNING- Overriding Maven properties: [/srv/gump/public/workspace/gsbase/build.properties]
 -DEBUG- (Gump generated) Maven Properties in: /srv/gump/public/workspace/gsbase/build.properties
 -INFO- Failed with reason build failed
 -DEBUG- Maven POM in: /srv/gump/public/workspace/gsbase/project.xml
 -DEBUG- Maven project properties in: /srv/gump/public/workspace/gsbase/project.properties



The following work was performed:
http://vmgump.apache.org/gump/public/gsbase/gsbase-test/gump_work/build_gsbase_gsbase-test.html
Work Name: build_gsbase_gsbase-test (Type: Build)
Work ended in a state of : Failed
Elapsed: 4 secs
Command Line: maven --offline jar 
[Working Directory: /srv/gump/public/workspace/gsbase]
CLASSPATH: /usr/lib/jvm/java-6-sun/lib/tools.jar:/srv/gump/public/workspace/gsbase/target/classes:/srv/gump/public/workspace/junit/dist/junit-05082009.jar:/srv/gump/packages/junitperf-1.8/lib/junitperf.jar
---------------------------------------------
|  \/  |__ _Apache__ ___
| |\/| / _` \ V / -_) ' \  ~ intelligent projects ~
|_|  |_\__,_|\_/\___|_||_|  v. 1.0.2

build:start:

java:prepare-filesystem:

java:compile:
    [echo] Compiling to /srv/gump/public/workspace/gsbase/target/classes
    [echo] 
==========================================================

  NOTE: Targetting JVM 1.6, classes
  will not run on earlier JVMs

==========================================================
          
    [javac] Compiling 60 source files to /srv/gump/public/workspace/gsbase/target/classes
/srv/gump/public/workspace/gsbase/src/java/com/gargoylesoftware/base/resource/jdbc/StatementWrapper.java:65: com.gargoylesoftware.base.resource.jdbc.StatementWrapper is not abstract and does not override abstract method isPoolable() in java.sql.Statement
public class StatementWrapper implements Statement {
       ^
/srv/gump/public/workspace/gsbase/src/java/com/gargoylesoftware/base/resource/jdbc/PreparedStatementWrapper.java:64: com.gargoylesoftware.base.resource.jdbc.PreparedStatementWrapper is not abstract and does not override abstract method setNClob(int,java.io.Reader) in java.sql.PreparedStatement
public class PreparedStatementWrapper
       ^
/srv/gump/public/workspace/gsbase/src/java/com/gargoylesoftware/base/resource/jdbc/ConnectionWrapper.java:77: com.gargoylesoftware.base.resource.jdbc.ConnectionWrapper is not abstract and does not override abstract method createStruct(java.lang.String,java.lang.Object[]) in java.sql.Connection
public final class ConnectionWrapper implements Connection, ManagedResource {
             ^
/srv/gump/public/workspace/gsbase/src/java/com/gargoylesoftware/base/resource/jdbc/CallableStatementWrapper.java:81: com.gargoylesoftware.base.resource.jdbc.CallableStatementWrapper is not abstract and does not override abstract method setNClob(java.lang.String,java.io.Reader) in java.sql.CallableStatement
public final class CallableStatementWrapper
             ^
/srv/gump/public/workspace/gsbase/src/java/com/gargoylesoftware/base/resource/jdbc/DatabaseMetaDataWrapper.java:54: com.gargoylesoftware.base.resource.jdbc.DatabaseMetaDataWrapper is not abstract and does not override abstract method getFunctionColumns(java.lang.String,java.lang.String,java.lang.String,java.lang.String) in java.sql.DatabaseMetaData
public final class DatabaseMetaDataWrapper implements DatabaseMetaData {
             ^
/srv/gump/public/workspace/gsbase/src/java/com/gargoylesoftware/base/resource/jdbc/ResultSetWrapper.java:150: com.gargoylesoftware.base.resource.jdbc.ResultSetWrapper is not abstract and does not override abstract method updateNClob(java.lang.String,java.io.Reader) in java.sql.ResultSet
public final class ResultSetWrapper implements ResultSet {
             ^
Note: Some input files use unchecked or unsafe operations.
Note: Recompile with -Xlint:unchecked for details.
6 errors

BUILD FAILED
File...... /home/gump/.maven/cache/maven-java-plugin-1.5/plugin.jelly
Element... ant:javac
Line...... 63
Column.... 48
Compile failed; see the compiler error output for details.
Total time: 4 seconds
Finished at: Wed Aug 05 01:35:37 PDT 2009

---------------------------------------------

To subscribe to this information via syndicated feeds:
- RSS: http://vmgump.apache.org/gump/public/gsbase/gsbase-test/rss.xml
- Atom: http://vmgump.apache.org/gump/public/gsbase/gsbase-test/atom.xml

============================== Gump Tracking Only ===
Produced by Gump version 2.3.
Gump Run 05000005082009, vmgump:vmgump-public:05000005082009
Gump E-mail Identifier (unique within run) #3.

*********************************************************** G U M P
[GUMP@vmgump]: Module apr-util success, but with warnings.
To whom it may engage...
        
This is an automated request, but not an unsolicited one. For 
more information please visit http://gump.apache.org/nagged.html, 
and/or contact the folk at general@gump.apache.org.

Module apr-util contains errors.
The current state of this module is 'Success'.

Full details are available at:
    http://vmgump.apache.org/gump/public/apr-util/index.html

That said, some information snippets are provided here.

The following annotations (debug/informational/warning/error messages) were provided:
 -ERROR- *** Failed to update from source control.Stale contents ***



The following work was performed:
http://vmgump.apache.org/gump/public/apr-util/gump_work/update_apr-util.html
Work Name: update_apr-util (Type: Update)
Work ended in a state of : Failed
Elapsed: 5 secs
Command Line: svn --quiet update --non-interactive apr-util 
[Working Directory: /srv/gump/public/workspace/cvs]
---------------------------------------------
svn: REPORT of '/repos/asf/!svn/vcc/default': 200 OK (http://svn.apache.org)
---------------------------------------------

To subscribe to this information via syndicated feeds:
- RSS: http://vmgump.apache.org/gump/public/apr-util/rss.xml
- Atom: http://vmgump.apache.org/gump/public/apr-util/atom.xml

============================== Gump Tracking Only ===
Produced by Gump version 2.3.
Gump Run 05000005082009, vmgump:vmgump-public:05000005082009
Gump E-mail Identifier (unique within run) #4.

*********************************************************** G U M P
[GUMP@vmgump]: Module jdom success, but with warnings.
To whom it may engage...
        
This is an automated request, but not an unsolicited one. For 
more information please visit http://gump.apache.org/nagged.html, 
and/or contact the folk at general@gump.apache.org.

Module jdom contains errors.
The current state of this module is 'Success'.

Full details are available at:
    http://vmgump.apache.org/gump/public/jdom/index.html

That said, some information snippets are provided here.

The following annotations (debug/informational/warning/error messages) were provided:
 -ERROR- *** Failed to update from source control.Stale contents ***



The following work was performed:
http://vmgump.apache.org/gump/public/jdom/gump_work/update_jdom.html
Work Name: update_jdom (Type: Update)
Work ended in a state of : Failed
Elapsed: 3 mins 9 secs
Command Line: cvs -q -z3 -d :pserver:anonymous@cvs.jdom.org:/home/cvspublic update -P -d 
[Working Directory: /srv/gump/public/workspace/cvs/jdom]
---------------------------------------------
cvs [update aborted]: connect to cvs.jdom.org(65.212.180.182):2401 failed: Connection timed out
---------------------------------------------

To subscribe to this information via syndicated feeds:
- RSS: http://vmgump.apache.org/gump/public/jdom/rss.xml
- Atom: http://vmgump.apache.org/gump/public/jdom/atom.xml

============================== Gump Tracking Only ===
Produced by Gump version 2.3.
Gump Run 05000005082009, vmgump:vmgump-public:05000005082009
Gump E-mail Identifier (unique within run) #5.

*********************************************************** G U M P
[GUMP@vmgump]: Project jmock2 (in module jmock2) failed
To whom it may engage...
        
This is an automated request, but not an unsolicited one. For 
more information please visit http://gump.apache.org/nagged.html, 
and/or contact the folk at general@gump.apache.org.

Project jmock2 has an issue affecting its community integration.
This issue affects 1 projects,
 and has been outstanding for 23 runs.
The current state of this project is 'Failed', with reason 'Build Failed'.
For reference only, the following projects are affected by this:
    - jmock2 :  jMock is a library for testing Java code using mock objects.


Full details are available at:
    http://vmgump.apache.org/gump/public/jmock2/jmock2/index.html

That said, some information snippets are provided here.

The following annotations (debug/informational/warning/error messages) were provided:
 -INFO- Failed with reason build failed
 -INFO- Failed to extract fallback artifacts from Gump Repository



The following work was performed:
http://vmgump.apache.org/gump/public/jmock2/jmock2/gump_work/build_jmock2_jmock2.html
Work Name: build_jmock2_jmock2 (Type: Build)
Work ended in a state of : Failed
Elapsed: 5 secs
Command Line: /usr/lib/jvm/java-6-sun/bin/java -Djava.awt.headless=true -Xbootclasspath/p:/srv/gump/public/workspace/xml-xerces2/build/xercesImpl.jar:/srv/gump/public/workspace/xml-commons/java/external/build/xml-apis.jar org.apache.tools.ant.Main -Dgump.merge=/srv/gump/public/gump/work/merge.xml -Dbuild.sysclasspath=only -Dversion=05082009 
[Working Directory: /srv/gump/public/workspace/jmock2]
CLASSPATH: /usr/lib/jvm/java-6-sun/lib/tools.jar:/srv/gump/public/workspace/jmock2/build/classes:/srv/gump/public/workspace/jmock2/lib/objenesis-1.0.jar:/srv/gump/public/workspace/ant/dist/lib/ant-jmf.jar:/srv/gump/public/workspace/ant/dist/lib/ant-swing.jar:/srv/gump/public/workspace/ant/dist/lib/ant-apache-resolver.jar:/srv/gump/public/workspace/ant/dist/lib/ant-apache-xalan2.jar:/srv/gump/public/workspace/ant/dist/lib/ant-trax.jar:/srv/gump/public/workspace/ant/dist/lib/ant-junit.jar:/srv/gump/public/workspace/ant/dist/lib/ant-launcher.jar:/srv/gump/public/workspace/ant/dist/lib/ant-nodeps.jar:/srv/gump/public/workspace/ant/dist/lib/ant.jar:/srv/gump/packages/bsh-2.0b4/bsh-commands-2.0b4.jar:/srv/gump/packages/bsh-2.0b4/bsh-classpath-2.0b4.jar:/srv/gump/packages/bsh-2.0b4/bsh-core-2.0b4.jar:/srv/gump/packages/bsh-2.0b4/bsh-bsf-2.0b4.jar:/srv/gump/packages/bsh-2.0b4/bsh-2.0b4.jar:/srv/gump/packages/bsh-2.0b4/bsh-reflect-2.0b4.jar:/srv/gump/packages/bsh-2.0b4/bsh-util-2.0b4.
 jar:/srv/gump/packages/cglib/cglib-nodep-2.1_3.jar:/srv/gump/public/workspace/hamcrest/hamcrest-java/build/hamcrest-core-05082009.jar:/srv/gump/public/workspace/hamcrest/hamcrest-java/build/hamcrest-library-05082009.jar:/srv/gump/public/workspace/junit/dist/junit-05082009.jar:/srv/gump/packages/junit3.8.1/junit.jar:/srv/gump/public/workspace/xml-commons/java/external/build/xml-apis-ext.jar
---------------------------------------------
    [javac] location: class org.jmock.test.unit.lib.CurrentStateMatcherTest
    [javac]         assertTrue("should match", isNotCurrently("S").matches(stateMachine));
    [javac]         ^
    [javac] /srv/gump/public/workspace/jmock2/test/org/jmock/test/unit/lib/CurrentStateMatcherTest.java:38: cannot find symbol
    [javac] symbol  : method assertTrue(java.lang.String,boolean)
    [javac] location: class org.jmock.test.unit.lib.CurrentStateMatcherTest
    [javac]         assertTrue("should not match", !isCurrentlyS.matches(null));
    [javac]         ^
    [javac] /srv/gump/public/workspace/jmock2/test/org/jmock/test/unit/lib/CurrentStateMatcherTest.java:42: cannot find symbol
    [javac] symbol  : method assertTrue(java.lang.String,boolean)
    [javac] location: class org.jmock.test.unit.lib.CurrentStateMatcherTest
    [javac]         assertTrue("should not match", !isCurrentlyS.matches("something else"));
    [javac]         ^
    [javac] /srv/gump/public/workspace/jmock2/test/org/jmock/test/unit/lib/CurrentStateMatcherTest.java:46: cannot find symbol
    [javac] symbol  : method assertEquals(java.lang.String,java.lang.String)
    [javac] location: class org.jmock.test.unit.lib.CurrentStateMatcherTest
    [javac]         assertEquals("a state machine that is S", asString(isCurrently("S")));
    [javac]         ^
    [javac] /srv/gump/public/workspace/jmock2/test/org/jmock/test/unit/lib/CurrentStateMatcherTest.java:47: cannot find symbol
    [javac] symbol  : method assertEquals(java.lang.String,java.lang.String)
    [javac] location: class org.jmock.test.unit.lib.CurrentStateMatcherTest
    [javac]         assertEquals("a state machine that is not S", asString(isNotCurrently("S")));
    [javac]         ^
    [javac] /srv/gump/public/workspace/jmock2/test/org/jmock/test/unit/lib/CurrentStateMatcherTest.java:53: cannot find symbol
    [javac] symbol  : method assertMismatchDescription(java.lang.String,org.hamcrest.Matcher<org.jmock.States>,org.jmock.States)
    [javac] location: class org.jmock.test.unit.lib.CurrentStateMatcherTest
    [javac]         assertMismatchDescription("was not S", isCurrently("S"), stateMachine);
    [javac]         ^
    [javac] /srv/gump/public/workspace/jmock2/test/org/jmock/test/unit/lib/CurrentStateMatcherTest.java:56: method does not override or implement a method from a supertype
    [javac]     @Override
    [javac]     ^
    [javac] /srv/gump/public/workspace/jmock2/test/org/jmock/test/unit/support/SyntheticEmptyInterfaceClassLoader.java:35: cannot find symbol
    [javac] symbol  : variable COMPUTE_MAXS
    [javac] location: class net.sf.cglib.asm.ClassWriter
    [javac]         ClassWriter writer = new ClassWriter(ClassWriter.COMPUTE_MAXS);
    [javac]                                                         ^
    [javac] /srv/gump/public/workspace/jmock2/test/org/jmock/test/unit/support/SyntheticEmptyInterfaceClassLoader.java:35: internal error; cannot instantiate ClassWriter(boolean) at net.sf.cglib.asm.ClassWriter to ()
    [javac]         ClassWriter writer = new ClassWriter(ClassWriter.COMPUTE_MAXS);
    [javac]                              ^
    [javac] /srv/gump/public/workspace/jmock2/test/org/jmock/test/unit/support/SyntheticEmptyInterfaceClassLoader.java:36: visit(int,int,java.lang.String,java.lang.String,java.lang.String[],java.lang.String) in net.sf.cglib.asm.ClassWriter cannot be applied to (int,int,java.lang.String,<nulltype>,java.lang.String,<nulltype>)
    [javac]                 writer.visit(CLASS_FORMAT_VERSION,
    [javac]                       ^
    [javac] Note: /srv/gump/public/workspace/jmock2/src/org/jmock/integration/junit4/JMock.java uses or overrides a deprecated API.
    [javac] Note: Recompile with -Xlint:deprecation for details.
    [javac] 34 errors

BUILD FAILED
/srv/gump/public/workspace/jmock2/build.xml:61: Compile failed; see the compiler error output for details.

Total time: 4 seconds
---------------------------------------------

To subscribe to this information via syndicated feeds:
- RSS: http://vmgump.apache.org/gump/public/jmock2/jmock2/rss.xml
- Atom: http://vmgump.apache.org/gump/public/jmock2/jmock2/atom.xml

============================== Gump Tracking Only ===
Produced by Gump version 2.3.
Gump Run 05000005082009, vmgump:vmgump-public:05000005082009
Gump E-mail Identifier (unique within run) #7.

*********************************************************** G U M P
[GUMP@vmgump]: Project apr-iconv-configure (in module apr-iconv) failed
To whom it may engage...
        
This is an automated request, but not an unsolicited one. For 
more information please visit http://gump.apache.org/nagged.html, 
and/or contact the folk at general@gump.apache.org.

Project apr-iconv-configure has an issue affecting its community integration.
This issue affects 2 projects,
 and has been outstanding for 35 runs.
The current state of this project is 'Failed', with reason 'Build Failed'.
For reference only, the following projects are affected by this:
    - apr-iconv-configure :  Apache Portable Runtime
    - apr-iconv-make :  Apache Portable Runtime


Full details are available at:
    http://vmgump.apache.org/gump/public/apr-iconv/apr-iconv-configure/index.html

That said, some information snippets are provided here.

The following annotations (debug/informational/warning/error messages) were provided:
 -INFO- Failed with reason build failed



The following work was performed:
http://vmgump.apache.org/gump/public/apr-iconv/apr-iconv-configure/gump_work/buildscript_apr-iconv_apr-iconv-configure.html
Work Name: buildscript_apr-iconv_apr-iconv-configure (Type: Build)
Work ended in a state of : Failed
Elapsed: 1 sec
Command Line: /srv/gump/public/workspace/apr-iconv/configure --with-apr=/srv/gump/public/workspace/apr/dest-05082009 --prefix=/srv/gump/public/workspace/apr-iconv/dest-05082009 
[Working Directory: /srv/gump/public/workspace/apr-iconv]
---------------------------------------------
checking for gawk... no
checking for mawk... mawk
checking for a BSD-compatible install... /usr/bin/install -c
checking for APR... configure: error: the --with-apr parameter is incorrect. It must specify an install prefix, a build directory, or an apr-config file.
---------------------------------------------

To subscribe to this information via syndicated feeds:
- RSS: http://vmgump.apache.org/gump/public/apr-iconv/apr-iconv-configure/rss.xml
- Atom: http://vmgump.apache.org/gump/public/apr-iconv/apr-iconv-configure/atom.xml

============================== Gump Tracking Only ===
Produced by Gump version 2.3.
Gump Run 05000005082009, vmgump:vmgump-public:05000005082009
Gump E-mail Identifier (unique within run) #9.

*********************************************************** G U M P
[GUMP@vmgump]: Project derby (in module db-derby) failed
To whom it may engage...
        
This is an automated request, but not an unsolicited one. For 
more information please visit http://gump.apache.org/nagged.html, 
and/or contact the folk at general@gump.apache.org.

Project derby has an issue affecting its community integration.
This issue affects 1 projects.
The current state of this project is 'Failed', with reason 'Build Failed'.
For reference only, the following projects are affected by this:
    - derby :  Apache Derby, 100% Java relational database.


Full details are available at:
    http://vmgump.apache.org/gump/public/db-derby/derby/index.html

That said, some information snippets are provided here.

The following annotations (debug/informational/warning/error messages) were provided:
 -INFO- Failed with reason build failed
 -INFO- Failed to extract fallback artifacts from Gump Repository



The following work was performed:
http://vmgump.apache.org/gump/public/db-derby/derby/gump_work/build_db-derby_derby.html
Work Name: build_db-derby_derby (Type: Build)
Work ended in a state of : Failed
Elapsed: 37 secs
Command Line: /usr/lib/jvm/java-6-sun/bin/java -Djava.awt.headless=true -Xbootclasspath/p:/srv/gump/public/workspace/xml-commons/java/external/build/xml-apis.jar:/srv/gump/public/workspace/xml-xerces2/build/xercesImpl.jar:/srv/gump/public/workspace/xml-xalan/build/serializer.jar:/srv/gump/public/workspace/xml-xalan/build/xalan-unbundled.jar org.apache.tools.ant.Main -Dgump.merge=/srv/gump/public/gump/work/merge.xml -Dbuild.sysclasspath=only -Dsane=false gump_all 
[Working Directory: /srv/gump/public/workspace/db-derby]
CLASSPATH: /usr/lib/jvm/java-6-sun/lib/tools.jar:/srv/gump/public/workspace/db-derby/classes:/srv/gump/public/workspace/ant/dist/lib/ant-jmf.jar:/srv/gump/public/workspace/ant/dist/lib/ant-swing.jar:/srv/gump/public/workspace/ant/dist/lib/ant-apache-resolver.jar:/srv/gump/public/workspace/ant/dist/lib/ant-apache-xalan2.jar:/srv/gump/public/workspace/ant/dist/lib/ant-trax.jar:/srv/gump/public/workspace/ant/dist/lib/ant-junit.jar:/srv/gump/public/workspace/ant/dist/lib/ant-launcher.jar:/srv/gump/public/workspace/ant/dist/lib/ant-nodeps.jar:/srv/gump/public/workspace/ant/dist/lib/ant.jar:/srv/gump/public/workspace/xml-commons/java/external/build/xml-apis-ext.jar:/srv/gump/public/workspace/jakarta-servletapi-5/jsr154/dist/lib/servlet-api.jar:/srv/gump/public/workspace/jakarta-oro/jakarta-oro-05082009.jar:/srv/gump/packages/javacc-3.1/bin/lib/javacc.jar:/srv/gump/public/workspace/junit/dist/junit-05082009.jar
---------------------------------------------
engine_169:

compile_reference:
    [javac] Compiling 11 source files to /srv/gump/public/workspace/db-derby/classes
    [javac] Compiling 2 source files to /srv/gump/public/workspace/db-derby/classes

compile_authentication:
    [javac] Compiling 2 source files to /srv/gump/public/workspace/db-derby/classes

authentication:

compile_security:
    [javac] Compiling 2 source files to /srv/gump/public/workspace/db-derby/classes

security:

compile_mbeans:
    [javac] Compiling 4 source files to /srv/gump/public/workspace/db-derby/classes

compile_io:

storage:

compile_iapi_error_jsr169:

compile_reference:
    [javac] Compiling 2 source files to /srv/gump/public/workspace/db-derby/classes

compile_util:

compile_types:
    [javac] Compiling 1 source file to /srv/gump/public/workspace/db-derby/classes
    [javac] /srv/gump/public/workspace/db-derby/java/engine/org/apache/derby/impl/jdbc/EmbedStatement.java:60: org.apache.derby.impl.jdbc.EmbedStatement is not abstract and does not override abstract method isWrapperFor(java.lang.Class) in java.sql.Wrapper
    [javac] public class EmbedStatement extends ConnectionChild
    [javac]        ^
    [javac] /srv/gump/public/workspace/db-derby/java/engine/org/apache/derby/impl/jdbc/EmbedResultSetMetaData.java:59: org.apache.derby.impl.jdbc.EmbedResultSetMetaData is not abstract and does not override abstract method isWrapperFor(java.lang.Class) in java.sql.Wrapper
    [javac] public class EmbedResultSetMetaData
    [javac]        ^
    [javac] /srv/gump/public/workspace/db-derby/java/engine/org/apache/derby/impl/jdbc/EmbedDatabaseMetaData.java:88: org.apache.derby.impl.jdbc.EmbedDatabaseMetaData is not abstract and does not override abstract method autoCommitFailureClosesAllResultSets() in java.sql.DatabaseMetaData
    [javac] public class EmbedDatabaseMetaData extends ConnectionChild 
    [javac]        ^
    [javac] 3 errors

BUILD FAILED
/srv/gump/public/workspace/db-derby/build.xml:452: The following error occurred while executing this line:
/srv/gump/public/workspace/db-derby/java/engine/build.xml:79: The following error occurred while executing this line:
/srv/gump/public/workspace/db-derby/java/engine/org/apache/derby/iapi/build.xml:65: The following error occurred while executing this line:
/srv/gump/public/workspace/db-derby/java/engine/org/apache/derby/iapi/types/build.xml:53: Compile failed; see the compiler error output for details.

Total time: 36 seconds
---------------------------------------------

To subscribe to this information via syndicated feeds:
- RSS: http://vmgump.apache.org/gump/public/db-derby/derby/rss.xml
- Atom: http://vmgump.apache.org/gump/public/db-derby/derby/atom.xml

============================== Gump Tracking Only ===
Produced by Gump version 2.3.
Gump Run 05000005082009, vmgump:vmgump-public:05000005082009
Gump E-mail Identifier (unique within run) #10.

*********************************************************** G U M P
[GUMP@vmgump]: Project dotnet-antlib-test (in module ant-antlibs) failed
To whom it may engage...
        
This is an automated request, but not an unsolicited one. For 
more information please visit http://gump.apache.org/nagged.html, 
and/or contact the folk at general@gump.apache.org.

Project dotnet-antlib-test has an issue affecting its community integration.
This issue affects 1 projects,
 and has been outstanding for 23 runs.
The current state of this project is 'Failed', with reason 'Build Failed'.
For reference only, the following projects are affected by this:
    - dotnet-antlib-test :  Task and Type Libraries for Apache Ant


Full details are available at:
    http://vmgump.apache.org/gump/public/ant-antlibs/dotnet-antlib-test/index.html

That said, some information snippets are provided here.

The following annotations (debug/informational/warning/error messages) were provided:
 -INFO- Failed with reason build failed



The following work was performed:
http://vmgump.apache.org/gump/public/ant-antlibs/dotnet-antlib-test/gump_work/build_ant-antlibs_dotnet-antlib-test.html
Work Name: build_ant-antlibs_dotnet-antlib-test (Type: Build)
Work ended in a state of : Failed
Elapsed: 18 secs
Command Line: /usr/lib/jvm/java-6-sun/bin/java -Djava.awt.headless=true -Xbootclasspath/p:/srv/gump/public/workspace/xml-xerces2/build/xercesImpl.jar:/srv/gump/public/workspace/xml-commons/java/external/build/xml-apis.jar org.apache.tools.ant.Main -Dgump.merge=/srv/gump/public/gump/work/merge.xml -Dbuild.sysclasspath=only -Dant-testutil.jar=/srv/gump/public/workspace/ant/build/lib/ant-testutil.jar test 
[Working Directory: /srv/gump/public/workspace/ant-antlibs/dotnet]
CLASSPATH: /usr/lib/jvm/java-6-sun/lib/tools.jar:/srv/gump/public/workspace/ant-antlibs/dotnet/build/test-classes:/srv/gump/public/workspace/ant/dist/lib/ant-jmf.jar:/srv/gump/public/workspace/ant/dist/lib/ant-swing.jar:/srv/gump/public/workspace/ant/dist/lib/ant-apache-resolver.jar:/srv/gump/public/workspace/ant/dist/lib/ant-apache-xalan2.jar:/srv/gump/public/workspace/ant/dist/lib/ant-trax.jar:/srv/gump/public/workspace/ant/dist/lib/ant-junit.jar:/srv/gump/public/workspace/ant/dist/lib/ant-launcher.jar:/srv/gump/public/workspace/ant/dist/lib/ant-nodeps.jar:/srv/gump/public/workspace/ant/dist/lib/ant.jar:/srv/gump/public/workspace/ant-antlibs/antunit/build/ant-antunit-05082009.jar:/srv/gump/public/workspace/ant-antlibs/dotnet/build/ant-dotnet-05082009.jar:/srv/gump/public/workspace/xml-commons/java/external/build/xml-apis-ext.jar
---------------------------------------------
[au:antunit] Target: test-passing took 0.005 sec
[au:antunit] Build File: /srv/gump/public/workspace/ant-antlibs/dotnet/src/tests/antunit/dir with spaces/wsdl-test.xml
[au:antunit] Tests run: 1, Failures: 0, Errors: 0, Time elapsed: 1.01 sec
[au:antunit] Target: testWSDL took 1.006 sec
[au:antunit] Build File: /srv/gump/public/workspace/ant-antlibs/dotnet/src/tests/antunit/dotnetexec-test.xml
[au:antunit] Tests run: 2, Failures: 0, Errors: 0, Time elapsed: 1.59 sec
[au:antunit] Target: testCSC took 0.904 sec
[au:antunit] Target: testCSCNoConfig took 0.655 sec
[au:antunit] Build File: /srv/gump/public/workspace/ant-antlibs/dotnet/src/tests/antunit/nunit/nunit-test.xml
[au:antunit] Tests run: 5, Failures: 0, Errors: 0, Time elapsed: 0.093 sec
[au:antunit] Target: test-passing took 0.007 sec
[au:antunit] Target: test-failing took 0.002 sec
[au:antunit] Target: test-failing-errorproperty took 0 sec
[au:antunit] Target: test-failing-with-fail took 0.002 sec
[au:antunit] Target: test-no-assembly took 0.02 sec
[au:antunit] Build File: /srv/gump/public/workspace/ant-antlibs/dotnet/src/tests/antunit/old-core-test.xml
[au:antunit] Tests run: 9, Failures: 0, Errors: 0, Time elapsed: 6.535 sec
[au:antunit] Target: testCSCintrinsicFileset took 0.797 sec
[au:antunit] Target: testCSCresponseFile took 0.627 sec
[au:antunit] Target: testILASM took 0.807 sec
[au:antunit] Target: testCSCdll took 0.642 sec
[au:antunit] Target: testILDASM took 0.864 sec
[au:antunit] Target: testILDASM_empty took 0.072 sec
[au:antunit] Target: testJsharp took 0.123 sec
[au:antunit] Target: testCSCResources took 1.554 sec
[au:antunit] Target: testCSC took 0.85 sec
[au:antunit] Build File: /srv/gump/public/workspace/ant-antlibs/dotnet/src/tests/antunit/wsdl2dotnet-test.xml
[au:antunit] Tests run: 15, Failures: 0, Errors: 0, Time elapsed: 3.537 sec
[au:antunit] Target: testSchemaMustBeSet took 0.03 sec
[au:antunit] Target: testLocalWsdlVB took 0.012 sec
[au:antunit] Target: testInvalidExtraOps took 0.009 sec
[au:antunit] Target: testSrcIsMissing took 0.013 sec
[au:antunit] Target: testNoParams took 0.01 sec
[au:antunit] Target: testBothSrc took 0.014 sec
[au:antunit] Target: testSchemaFileMustHaveOneOptionOnly took 0.016 sec
[au:antunit] Target: testLocalWsdl took 1.438 sec
[au:antunit] Target: testSrcIsDir took 0.019 sec
[au:antunit] Target: testLocalWsdlServerVB took 0.009 sec
[au:antunit] Target: testLocalWsdlServer took 1.644 sec
[au:antunit] Target: testNoSrc took 0.016 sec
[au:antunit] Target: testSchemaFileMustExist took 0.014 sec
[au:antunit] Target: testInvalidExtraOpsVB took 0.007 sec
[au:antunit] Target: testDestIsDir took 0.009 sec

test:

BUILD FAILED
/srv/gump/public/workspace/ant-antlibs/dotnet/common/build.xml:223: At least one AntUnit test has failed.

Total time: 18 seconds
---------------------------------------------

To subscribe to this information via syndicated feeds:
- RSS: http://vmgump.apache.org/gump/public/ant-antlibs/dotnet-antlib-test/rss.xml
- Atom: http://vmgump.apache.org/gump/public/ant-antlibs/dotnet-antlib-test/atom.xml

============================== Gump Tracking Only ===
Produced by Gump version 2.3.
Gump Run 05000005082009, vmgump:vmgump-public:05000005082009
Gump E-mail Identifier (unique within run) #11.

*********************************************************** G U M P
[GUMP@vmgump]: Project emma (in module emma) failed
To whom it may engage...
        
This is an automated request, but not an unsolicited one. For 
more information please visit http://gump.apache.org/nagged.html, 
and/or contact the folk at general@gump.apache.org.

Project emma has an issue affecting its community integration.
This issue affects 1 projects,
 and has been outstanding for 412 runs.
The current state of this project is 'Failed', with reason 'Build Failed'.
For reference only, the following projects are affected by this:
    - emma :  code coverage tool


Full details are available at:
    http://vmgump.apache.org/gump/public/emma/emma/index.html

That said, some information snippets are provided here.

The following annotations (debug/informational/warning/error messages) were provided:
 -INFO- Failed with reason build failed
 -INFO- Failed to extract fallback artifacts from Gump Repository



The following work was performed:
http://vmgump.apache.org/gump/public/emma/emma/gump_work/build_emma_emma.html
Work Name: build_emma_emma (Type: Build)
Work ended in a state of : Failed
Elapsed: 6 secs
Command Line: /usr/lib/jvm/java-6-sun/bin/java -Djava.awt.headless=true -Xbootclasspath/p:/srv/gump/public/workspace/xml-commons/java/external/build/xml-apis.jar:/srv/gump/public/workspace/xml-xerces2/build/xercesImpl.jar org.apache.tools.ant.Main -Dgump.merge=/srv/gump/public/gump/work/merge.xml -Dbuild.sysclasspath=only -Dapp.short.name=emma-05082009 
[Working Directory: /srv/gump/public/workspace/emma]
CLASSPATH: /usr/lib/jvm/java-6-sun/lib/tools.jar:/srv/gump/public/workspace/emma/out/core/classes:/srv/gump/public/workspace/emma/out/ant/classes:/srv/gump/public/workspace/emma/lib/internal/stamptool.jar:/srv/gump/public/workspace/ant/dist/lib/ant-jmf.jar:/srv/gump/public/workspace/ant/dist/lib/ant-swing.jar:/srv/gump/public/workspace/ant/dist/lib/ant-apache-resolver.jar:/srv/gump/public/workspace/ant/dist/lib/ant-apache-xalan2.jar:/srv/gump/public/workspace/ant/dist/lib/ant-trax.jar:/srv/gump/public/workspace/ant/dist/lib/ant-junit.jar:/srv/gump/public/workspace/ant/dist/lib/ant-launcher.jar:/srv/gump/public/workspace/ant/dist/lib/ant-nodeps.jar:/srv/gump/public/workspace/ant/dist/lib/ant.jar:/srv/gump/public/workspace/xml-commons/java/external/build/xml-apis-ext.jar
---------------------------------------------
timestamp:

-pre-compile:

core.bootstrap.compile:
    [javac] Compiling 2 source files to /srv/gump/public/workspace/emma/out/core/classes
    [javac] 
    [javac]           WARNING
    [javac] 
    [javac] The -source switch defaults to 1.5 in JDK 1.5 and 1.6.
    [javac] If you specify -target 1.2 you now must also specify -source 1.2.
    [javac] Ant will implicitly add -source 1.2 for you.  Please change your build file.

core.java14.compile:
    [javac] Compiling 1 source file to /srv/gump/public/workspace/emma/out/core/classes
    [javac] 
    [javac]           WARNING
    [javac] 
    [javac] The -source switch defaults to 1.5 in JDK 1.5 and 1.6.
    [javac] If you specify -target 1.2 you now must also specify -source 1.2.
    [javac] Ant will implicitly add -source 1.2 for you.  Please change your build file.

core.java13.compile:
    [javac] Compiling 1 source file to /srv/gump/public/workspace/emma/out/core/classes
    [javac] 
    [javac]           WARNING
    [javac] 
    [javac] The -source switch defaults to 1.5 in JDK 1.5 and 1.6.
    [javac] If you specify -target 1.2 you now must also specify -source 1.2.
    [javac] Ant will implicitly add -source 1.2 for you.  Please change your build file.

core.compile:
    [javac] Compiling 175 source files to /srv/gump/public/workspace/emma/out/core/classes
    [javac] 
    [javac]           WARNING
    [javac] 
    [javac] The -source switch defaults to 1.5 in JDK 1.5 and 1.6.
    [javac] If you specify -target 1.2 you now must also specify -source 1.2.
    [javac] Ant will implicitly add -source 1.2 for you.  Please change your build file.
    [javac] /srv/gump/public/workspace/emma/core/java12/com/vladium/emma/run/InstrClassLoader.java:346: reference to CodeSource is ambiguous, both method CodeSource(java.net.URL,java.security.cert.Certificate[]) in java.security.CodeSource and method CodeSource(java.net.URL,java.security.CodeSigner[]) in java.security.CodeSource match
    [javac]         final CodeSource csrc = new CodeSource (srcURL, null);
    [javac]                                 ^
    [javac] Note: Some input files use or override a deprecated API.
    [javac] Note: Recompile with -Xlint:deprecation for details.
    [javac] 1 error

BUILD FAILED
/srv/gump/public/workspace/emma/build.xml:297: Compile failed; see the compiler error output for details.

Total time: 5 seconds
---------------------------------------------

To subscribe to this information via syndicated feeds:
- RSS: http://vmgump.apache.org/gump/public/emma/emma/rss.xml
- Atom: http://vmgump.apache.org/gump/public/emma/emma/atom.xml

============================== Gump Tracking Only ===
Produced by Gump version 2.3.
Gump Run 05000005082009, vmgump:vmgump-public:05000005082009
Gump E-mail Identifier (unique within run) #13.

*********************************************************** G U M P
[GUMP@vmgump]: Project logging-log4cxx-configure (in module logging-log4cxx) failed
To whom it may engage...
        
This is an automated request, but not an unsolicited one. For 
more information please visit http://gump.apache.org/nagged.html, 
and/or contact the folk at general@gump.apache.org.

Project logging-log4cxx-configure has an issue affecting its community integration.
This issue affects 3 projects,
 and has been outstanding for 35 runs.
The current state of this project is 'Failed', with reason 'Build Failed'.
For reference only, the following projects are affected by this:
    - logging-log4cxx-configure :  Apache log4cxx
    - logging-log4cxx-make :  Apache log4cxx
    - logging-log4cxx-make-install :  Apache log4cxx


Full details are available at:
    http://vmgump.apache.org/gump/public/logging-log4cxx/logging-log4cxx-configure/index.html

That said, some information snippets are provided here.

The following annotations (debug/informational/warning/error messages) were provided:
 -DEBUG- Dependency on apr-make-install exists, no need to add for property --with-apr.
 -DEBUG- Dependency on apr-util-make-install exists, no need to add for property --with-apr-util.
 -INFO- Failed with reason build failed



The following work was performed:
http://vmgump.apache.org/gump/public/logging-log4cxx/logging-log4cxx-configure/gump_work/buildscript_logging-log4cxx_logging-log4cxx-configure.html
Work Name: buildscript_logging-log4cxx_logging-log4cxx-configure (Type: Build)
Work ended in a state of : Failed
Elapsed: 32 secs
Command Line: /srv/gump/public/workspace/logging-log4cxx/configure --with-apr-util=/srv/gump/public/workspace/apr-util --with-apr=/srv/gump/public/workspace/apr --prefix=/srv/gump/public/workspace/logging-log4cxx/dest-05082009 
[Working Directory: /srv/gump/public/workspace/logging-log4cxx]
---------------------------------------------
checking for f95... no
checking for fort... no
checking for ifort... no
checking for ifc... no
checking for efc... no
checking for pgf95... no
checking for lf95... no
checking for ftn... no
checking whether we are using the GNU Fortran 77 compiler... no
checking whether  accepts -g... no
checking the maximum length of command line arguments... 98304
checking command to parse /usr/bin/nm -B output from ccache gcc object... ok
checking for objdir... .libs
checking for ar... ar
checking for ranlib... ranlib
checking for strip... strip
checking if ccache gcc supports -fno-rtti -fno-exceptions... no
checking for ccache gcc option to produce PIC... -fPIC
checking if ccache gcc PIC flag -fPIC works... yes
checking if ccache gcc static flag -static works... yes
checking if ccache gcc supports -c -o file.o... yes
checking whether the ccache gcc linker (/usr/bin/ld) supports shared libraries... yes
checking whether -lc should be explicitly linked in... no
checking dynamic linker characteristics... GNU/Linux ld.so
checking how to hardcode library paths into programs... immediate
checking whether stripping libraries is possible... yes
checking if libtool supports shared libraries... yes
checking whether to build shared libraries... yes
checking whether to build static libraries... yes
configure: creating libtool
appending configuration tag "CXX" to libtool
checking for ld used by ccache g++... /usr/bin/ld
checking if the linker (/usr/bin/ld) is GNU ld... yes
checking whether the ccache g++ linker (/usr/bin/ld) supports shared libraries... yes
checking for ccache g++ option to produce PIC... -fPIC
checking if ccache g++ PIC flag -fPIC works... yes
checking if ccache g++ static flag -static works... yes
checking if ccache g++ supports -c -o file.o... yes
checking whether the ccache g++ linker (/usr/bin/ld) supports shared libraries... yes
checking dynamic linker characteristics... GNU/Linux ld.so
(cached) (cached) checking how to hardcode library paths into programs... immediate
appending configuration tag "F77" to libtool
checking for a BSD-compatible install... /usr/bin/install -c
checking whether make sets $(MAKE)... (cached) yes
checking whether we are using the GNU C++ compiler... (cached) yes
checking whether ccache g++ accepts -g... (cached) yes
checking dependency style of ccache g++... (cached) gcc3
checking how to run the C++ preprocessor... ccache g++ -E
checking for doxygen... no
checking for APR... configure: error: the --with-apr parameter is incorrect. It must specify an install prefix, a build directory, or an apr-config file.
---------------------------------------------

To subscribe to this information via syndicated feeds:
- RSS: http://vmgump.apache.org/gump/public/logging-log4cxx/logging-log4cxx-configure/rss.xml
- Atom: http://vmgump.apache.org/gump/public/logging-log4cxx/logging-log4cxx-configure/atom.xml

============================== Gump Tracking Only ===
Produced by Gump version 2.3.
Gump Run 05000005082009, vmgump:vmgump-public:05000005082009
Gump E-mail Identifier (unique within run) #14.

*********************************************************** G U M P
[GUMP@vmgump]: Project jython (in module jython) failed
To whom it may engage...
        
This is an automated request, but not an unsolicited one. For 
more information please visit http://gump.apache.org/nagged.html, 
and/or contact the folk at general@gump.apache.org.

Project jython has an issue affecting its community integration.
This issue affects 2 projects,
 and has been outstanding for 41 runs.
The current state of this project is 'Failed', with reason 'Build Failed'.
For reference only, the following projects are affected by this:
    - antbook-sections :  Examples to go with Java Development with Ant
    - jython :  Java Python


Full details are available at:
    http://vmgump.apache.org/gump/public/jython/jython/index.html

That said, some information snippets are provided here.

The following annotations (debug/informational/warning/error messages) were provided:
 -DEBUG- Sole output [jython.jar] identifier set to project name
 -INFO- Failed with reason build failed
 -INFO- Failed to extract fallback artifacts from Gump Repository



The following work was performed:
http://vmgump.apache.org/gump/public/jython/jython/gump_work/build_jython_jython.html
Work Name: build_jython_jython (Type: Build)
Work ended in a state of : Failed
Elapsed: 42 secs
Command Line: /usr/lib/jvm/java-6-sun/bin/java -Djava.awt.headless=true -Xbootclasspath/p:/srv/gump/public/workspace/xml-commons/java/external/build/xml-apis.jar:/srv/gump/public/workspace/xml-xerces2/build/xercesImpl.jar org.apache.tools.ant.Main -Dgump.merge=/srv/gump/public/gump/work/merge.xml -Dbuild.sysclasspath=only -DdistDir=dist -DoutputDir=build jar 
[Working Directory: /srv/gump/public/workspace/jython]
CLASSPATH: /usr/lib/jvm/java-6-sun/lib/tools.jar:/srv/gump/public/workspace/jython/build/classes:/srv/gump/public/workspace/jython/extlibs/constantine-0.4.jar:/srv/gump/public/workspace/jython/extlibs/jna.jar:/srv/gump/public/workspace/jython/extlibs/jna-posix.jar:/srv/gump/public/workspace/jython/extlibs/libreadline-java-0.8.jar:/srv/gump/public/workspace/ant/dist/lib/ant-jmf.jar:/srv/gump/public/workspace/ant/dist/lib/ant-swing.jar:/srv/gump/public/workspace/ant/dist/lib/ant-apache-resolver.jar:/srv/gump/public/workspace/ant/dist/lib/ant-apache-xalan2.jar:/srv/gump/public/workspace/ant/dist/lib/ant-trax.jar:/srv/gump/public/workspace/ant/dist/lib/ant-junit.jar:/srv/gump/public/workspace/ant/dist/lib/ant-launcher.jar:/srv/gump/public/workspace/ant/dist/lib/ant-nodeps.jar:/srv/gump/public/workspace/ant/dist/lib/ant.jar:/srv/gump/packages/junit3.8.1/junit.jar:/srv/gump/public/workspace/xml-commons/java/build/resolver.jar:/srv/gump/packages/antlr/antlr-3.1.3.jar:/srv/gump/publi
 c/workspace/asm/output/dist/lib/asm-analysis-05082009.jar:/srv/gump/public/workspace/asm/output/dist/lib/asm-util-05082009.jar:/srv/gump/public/workspace/asm/output/dist/lib/asm-xml-05082009.jar:/srv/gump/public/workspace/asm/output/dist/lib/asm-commons-05082009.jar:/srv/gump/public/workspace/asm/output/dist/lib/asm-05082009.jar:/srv/gump/public/workspace/asm/output/dist/lib/asm-tree-05082009.jar:/srv/gump/public/workspace/jakarta-servletapi-5/jsr154/dist/lib/servlet-api.jar:/srv/gump/public/workspace/jline/target/jline-0.9.95-SNAPSHOT.jar:/srv/gump/public/workspace/xml-commons/java/external/build/xml-apis-ext.jar
---------------------------------------------
    [javac] 1 warning
    [javac] Compiling 71 source files to /srv/gump/public/workspace/jython/build/classes
    [javac] warning: [path] bad path element "/srv/gump/public/workspace/asm/output/dist/lib/asm-attrs-05082009.jar": no such file or directory
    [javac] Note: /srv/gump/public/workspace/jython/tests/java/javatests/PySetInJavaTest.java uses unchecked or unsafe operations.
    [javac] Note: Recompile with -Xlint:unchecked for details.
    [javac] 1 warning
    [javac] Compiling 1 source file to /srv/gump/public/workspace/jython/tests/data/initializer
    [javac] warning: [path] bad path element "/srv/gump/public/workspace/asm/output/dist/lib/asm-attrs-05082009.jar": no such file or directory
    [javac] 1 warning
     [copy] Copying 1 file to /srv/gump/public/workspace/jython/build/classes/org/python/modules
     [copy] Copying 2 files to /srv/gump/public/workspace/jython/build/classes
     [copy] Copying 1 file to /srv/gump/public/workspace/jython/build/classes/META-INF/services

expose:
   [expose] Exposing 160 classes

BUILD FAILED
java.lang.RuntimeException: java.lang.ClassNotFoundException: org.python.core.PyObject
	at org.objectweb.asm.ClassWriter.getCommonSuperClass(Unknown Source)
	at org.objectweb.asm.ClassWriter.a(Unknown Source)
	at org.objectweb.asm.Frame.a(Unknown Source)
	at org.objectweb.asm.Frame.a(Unknown Source)
	at org.objectweb.asm.MethodWriter.visitMaxs(Unknown Source)
	at org.python.expose.generate.Exposer.endMethod(Exposer.java:213)
	at org.python.expose.generate.DescriptorExposer.generateMethodGetter(DescriptorExposer.java:145)
	at org.python.expose.generate.DescriptorExposer.generate(DescriptorExposer.java:108)
	at org.python.expose.generate.Exposer.generate(Exposer.java:107)
	at org.python.expose.generate.ExposeTask.generate(ExposeTask.java:71)
	at org.python.expose.generate.ExposeTask.expose(ExposeTask.java:59)
	at org.python.expose.generate.ExposeTask.process(ExposeTask.java:39)
	at org.python.util.FileNameMatchingTask.execute(FileNameMatchingTask.java:70)
	at org.apache.tools.ant.UnknownElement.execute(UnknownElement.java:291)
	at sun.reflect.NativeMethodAccessorImpl.invoke0(Native Method)
	at sun.reflect.NativeMethodAccessorImpl.invoke(NativeMethodAccessorImpl.java:39)
	at sun.reflect.DelegatingMethodAccessorImpl.invoke(DelegatingMethodAccessorImpl.java:25)
	at java.lang.reflect.Method.invoke(Method.java:597)
	at org.apache.tools.ant.dispatch.DispatchUtils.execute(DispatchUtils.java:106)
	at org.apache.tools.ant.Task.perform(Task.java:348)
	at org.apache.tools.ant.Target.execute(Target.java:386)
	at org.apache.tools.ant.Target.performTasks(Target.java:407)
	at org.apache.tools.ant.Project.executeSortedTargets(Project.java:1361)
	at org.apache.tools.ant.Project.executeTarget(Project.java:1330)
	at org.apache.tools.ant.helper.DefaultExecutor.executeTargets(DefaultExecutor.java:41)
	at org.apache.tools.ant.Project.executeTargets(Project.java:1213)
	at org.apache.tools.ant.Main.runBuild(Main.java:775)
	at org.apache.tools.ant.Main.startAnt(Main.java:217)
	at org.apache.tools.ant.Main.start(Main.java:179)
	at org.apache.tools.ant.Main.main(Main.java:268)

Total time: 41 seconds
---------------------------------------------

To subscribe to this information via syndicated feeds:
- RSS: http://vmgump.apache.org/gump/public/jython/jython/rss.xml
- Atom: http://vmgump.apache.org/gump/public/jython/jython/atom.xml

============================== Gump Tracking Only ===
Produced by Gump version 2.3.
Gump Run 05000005082009, vmgump:vmgump-public:05000005082009
Gump E-mail Identifier (unique within run) #15.

*********************************************************** G U M P
[GUMP@vmgump]: Project jtidy-cvs (in module jtidy) failed
To whom it may engage...
        
This is an automated request, but not an unsolicited one. For 
more information please visit http://gump.apache.org/nagged.html, 
and/or contact the folk at general@gump.apache.org.

Project jtidy-cvs has an issue affecting its community integration.
This issue affects 1 projects,
 and has been outstanding for 58 runs.
The current state of this project is 'Failed', with reason 'Build Failed'.
For reference only, the following projects are affected by this:
    - jtidy-cvs :  HTML Templates


Full details are available at:
    http://vmgump.apache.org/gump/public/jtidy/jtidy-cvs/index.html

That said, some information snippets are provided here.

The following annotations (debug/informational/warning/error messages) were provided:
 -DEBUG- Sole output [jtidy-05082009.jar] identifier set to project name
 -DEBUG- Dependency on xml-apis exists, no need to add for property maven.jar.dom3-xml-apis.
 -DEBUG- (Gump generated) Maven Properties in: /srv/gump/public/workspace/jtidy/build.properties
 -INFO- Failed with reason build failed
 -DEBUG- Maven POM in: /srv/gump/public/workspace/jtidy/project.xml
 -DEBUG- Maven project properties in: /srv/gump/public/workspace/jtidy/project.properties
 -INFO- Failed to extract fallback artifacts from Gump Repository



The following work was performed:
http://vmgump.apache.org/gump/public/jtidy/jtidy-cvs/gump_work/build_jtidy_jtidy-cvs.html
Work Name: build_jtidy_jtidy-cvs (Type: Build)
Work ended in a state of : Failed
Elapsed: 2 secs
Command Line: maven --offline jar 
[Working Directory: /srv/gump/public/workspace/jtidy]
CLASSPATH: /usr/lib/jvm/java-6-sun/lib/tools.jar:/srv/gump/public/workspace/ant/dist/lib/ant-jmf.jar:/srv/gump/public/workspace/ant/dist/lib/ant-swing.jar:/srv/gump/public/workspace/ant/dist/lib/ant-apache-resolver.jar:/srv/gump/public/workspace/ant/dist/lib/ant-apache-xalan2.jar:/srv/gump/public/workspace/ant/dist/lib/ant-trax.jar:/srv/gump/public/workspace/ant/dist/lib/ant-junit.jar:/srv/gump/public/workspace/ant/dist/lib/ant-launcher.jar:/srv/gump/public/workspace/ant/dist/lib/ant-nodeps.jar:/srv/gump/public/workspace/ant/dist/lib/ant.jar:/srv/gump/packages/junit3.8.1/junit.jar:/srv/gump/public/workspace/xml-commons/java/build/resolver.jar:/srv/gump/public/workspace/xml-commons/java/external/build/xml-apis-ext.jar:/srv/gump/public/workspace/apache-commons/logging/target/commons-logging-05082009.jar:/srv/gump/public/workspace/apache-commons/logging/target/commons-logging-api-05082009.jar
---------------------------------------------
	... 33 more
[MethodExpression] Cannot evaluate expression
java.lang.reflect.InvocationTargetException
	at sun.reflect.NativeMethodAccessorImpl.invoke0(Native Method)
	at sun.reflect.NativeMethodAccessorImpl.invoke(NativeMethodAccessorImpl.java:39)
	at sun.reflect.DelegatingMethodAccessorImpl.invoke(DelegatingMethodAccessorImpl.java:25)
	at java.lang.reflect.Method.invoke(Method.java:597)
	at org.apache.commons.betwixt.expression.MethodExpression.evaluate(MethodExpression.java:96)
	at org.apache.commons.betwixt.io.AbstractBeanWriter.writeContent(AbstractBeanWriter.java:658)
	at org.apache.commons.betwixt.io.AbstractBeanWriter.writeRestOfElement(AbstractBeanWriter.java:539)
	at org.apache.commons.betwixt.io.AbstractBeanWriter.write(AbstractBeanWriter.java:481)
	at org.apache.commons.betwixt.io.AbstractBeanWriter.writeContent(AbstractBeanWriter.java:643)
	at org.apache.commons.betwixt.io.AbstractBeanWriter.writeRestOfElement(AbstractBeanWriter.java:539)
	at org.apache.commons.betwixt.io.AbstractBeanWriter.write(AbstractBeanWriter.java:513)
	at org.apache.commons.betwixt.io.AbstractBeanWriter.write(AbstractBeanWriter.java:233)
	at org.apache.commons.betwixt.io.AbstractBeanWriter.writeContent(AbstractBeanWriter.java:630)
	at org.apache.commons.betwixt.io.AbstractBeanWriter.writeRestOfElement(AbstractBeanWriter.java:539)
	at org.apache.commons.betwixt.io.AbstractBeanWriter.write(AbstractBeanWriter.java:513)
	at org.apache.commons.betwixt.io.AbstractBeanWriter.write(AbstractBeanWriter.java:233)
	at org.apache.commons.betwixt.io.AbstractBeanWriter.write(AbstractBeanWriter.java:162)
	at org.apache.commons.betwixt.io.BeanWriter.write(BeanWriter.java:217)
	at org.apache.maven.MavenUtils.getProjectString(MavenUtils.java:432)
	at org.apache.maven.MavenUtils.getInterpolatedPOM(MavenUtils.java:383)
	at org.apache.maven.MavenUtils.getJellyProject(MavenUtils.java:360)
	at org.apache.maven.MavenUtils.getProject(MavenUtils.java:144)
	at org.apache.maven.MavenUtils.getProject(MavenUtils.java:122)
	at org.apache.maven.MavenSession.initializeRootProject(MavenSession.java:232)
	at org.apache.maven.MavenSession.initialize(MavenSession.java:172)
	at org.apache.maven.cli.App.doMain(App.java:475)
	at org.apache.maven.cli.App.main(App.java:1239)
	at sun.reflect.NativeMethodAccessorImpl.invoke0(Native Method)
	at sun.reflect.NativeMethodAccessorImpl.invoke(NativeMethodAccessorImpl.java:39)
	at sun.reflect.DelegatingMethodAccessorImpl.invoke(DelegatingMethodAccessorImpl.java:25)
	at java.lang.reflect.Method.invoke(Method.java:597)
	at com.werken.forehead.Forehead.run(Forehead.java:551)
	at com.werken.forehead.Forehead.main(Forehead.java:581)
Caused by: java.lang.IllegalArgumentException: cvs repository connection string doesn't contain six tokens
	at org.apache.maven.project.Repository.splitSCMConnection(Repository.java:258)
	at org.apache.maven.project.Repository.getScmType(Repository.java:115)
	... 33 more
The build cannot continue because of the following unsatisfied dependencies:

maven-sourceforge-plugin-1.0.jar (try downloading from http://maven-plugins.sourceforge.net)
maven-statcvs-plugin-2.7.jar
maven-xhtml-plugin-1.2.jar (try downloading from http://maven-validator.sourceforge.net)
maven-checkstyle-plugin-2.4.1.jar (try downloading from http://maven.apache.org/reference/plugins/checkstyle)

Total time: 2 seconds
Finished at: Wed Aug 05 03:12:59 PDT 2009

---------------------------------------------

To subscribe to this information via syndicated feeds:
- RSS: http://vmgump.apache.org/gump/public/jtidy/jtidy-cvs/rss.xml
- Atom: http://vmgump.apache.org/gump/public/jtidy/jtidy-cvs/atom.xml

============================== Gump Tracking Only ===
Produced by Gump version 2.3.
Gump Run 05000005082009, vmgump:vmgump-public:05000005082009
Gump E-mail Identifier (unique within run) #17.

*********************************************************** G U M P
[GUMP@vmgump]: Project slf4j-test (in module slf4j) failed
To whom it may engage...
        
This is an automated request, but not an unsolicited one. For 
more information please visit http://gump.apache.org/nagged.html, 
and/or contact the folk at general@gump.apache.org.

Project slf4j-test has an issue affecting its community integration.
This issue affects 1 projects,
 and has been outstanding for 27 runs.
The current state of this project is 'Failed', with reason 'Build Failed'.
For reference only, the following projects are affected by this:
    - slf4j-test :  Simple Logging Facade for Java


Full details are available at:
    http://vmgump.apache.org/gump/public/slf4j/slf4j-test/index.html

That said, some information snippets are provided here.

The following annotations (debug/informational/warning/error messages) were provided:
 -WARNING- Overriding Maven2 settings: [/srv/gump/public/workspace/slf4j/gump_mvn_settings.xml]
 -DEBUG- (Gump generated) Maven2 Settings in: /srv/gump/public/workspace/slf4j/gump_mvn_settings.xml
 -INFO- Failed with reason build failed
 -DEBUG- Maven POM in: /srv/gump/public/workspace/slf4j/pom.xml



The following work was performed:
http://vmgump.apache.org/gump/public/slf4j/slf4j-test/gump_work/build_slf4j_slf4j-test.html
Work Name: build_slf4j_slf4j-test (Type: Build)
Work ended in a state of : Failed
Elapsed: 38 secs
Command Line: mvn --batch-mode --settings /srv/gump/public/workspace/slf4j/gump_mvn_settings.xml package 
[Working Directory: /srv/gump/public/workspace/slf4j]
CLASSPATH: /usr/lib/jvm/java-6-sun/lib/tools.jar:/srv/gump/public/workspace/slf4j/slf4j-migrator/target/slf4j-migrator-1.5.9-SNAPSHOT.jar:/srv/gump/public/workspace/slf4j/slf4j-nop/target/slf4j-nop-1.5.9-SNAPSHOT.jar:/srv/gump/public/workspace/slf4j/log4j-over-slf4j/target/log4j-over-slf4j-1.5.9-SNAPSHOT.jar:/srv/gump/public/workspace/slf4j/slf4j-log4j12/target/slf4j-log4j12-1.5.9-SNAPSHOT.jar:/srv/gump/public/workspace/slf4j/slf4j-jcl/target/slf4j-jcl-1.5.9-SNAPSHOT.jar:/srv/gump/public/workspace/slf4j/slf4j-api/target/slf4j-api-1.5.9-SNAPSHOT.jar:/srv/gump/public/workspace/slf4j/jcl104-over-slf4j/target/jcl104-over-slf4j-1.5.9-SNAPSHOT.jar:/srv/gump/public/workspace/slf4j/slf4j-jdk14/target/slf4j-jdk14-1.5.9-SNAPSHOT.jar:/srv/gump/public/workspace/slf4j/slf4j-simple/target/slf4j-simple-1.5.9-SNAPSHOT.jar:/srv/gump/public/workspace/slf4j/slf4j-ext/target/slf4j-ext-1.5.9-SNAPSHOT.jar:/srv/gump/public/workspace/slf4j/jcl-over-slf4j/target/jcl-over-slf4j-1.5.9-SNAPSHOT.jar:/srv
 /gump/public/workspace/slf4j/jul-to-slf4j/target/jul-to-slf4j-1.5.9-SNAPSHOT.jar
---------------------------------------------
[WARNING] File encoding has not been set, using platform encoding UTF-8, i.e. build is platform dependent!
[WARNING] Using platform encoding (UTF-8 actually) to copy filtered resources, i.e. build is platform dependent!
[INFO] skip non existing resourceDirectory /srv/gump/public/workspace/slf4j/integration/src/main/resources
[INFO] [compiler:compile]
[INFO] Nothing to compile - all classes are up to date
[INFO] [resources:testResources]
[WARNING] Using platform encoding (UTF-8 actually) to copy filtered resources, i.e. build is platform dependent!
[INFO] skip non existing resourceDirectory /srv/gump/public/workspace/slf4j/integration/src/test/resources
[INFO] [compiler:testCompile]
[INFO] Nothing to compile - all classes are up to date
[INFO] [surefire:test]
[INFO] Surefire report directory: /srv/gump/public/workspace/slf4j/integration/target/surefire-reports

-------------------------------------------------------
 T E S T S
-------------------------------------------------------
There are no tests to run.

Results :

Tests run: 0, Failures: 0, Errors: 0, Skipped: 0

[INFO] [jar:jar]
[WARNING] JAR will be empty - no content was marked for inclusion!
[INFO] [antrun:run {execution: ant-test}]
[INFO] Executing tasks
     [echo] compile classpath: /srv/gump/public/workspace/slf4j/integration/target/classes:/srv/gump/public/workspace/slf4j/slf4j-api/target/classes:/srv/gump/public/workspace/mvnlocalrepo/junit/junit/3.8.1/junit-3.8.1.jar:/srv/gump/public/workspace/mvnlocalrepo/ant/ant-junit/1.6.5/ant-junit-1.6.5.jar
     [echo] runtime classpath: /srv/gump/public/workspace/slf4j/integration/target/classes:/srv/gump/public/workspace/slf4j/slf4j-api/target/slf4j-api-1.5.9-SNAPSHOT.jar:/srv/gump/public/workspace/mvnlocalrepo/junit/junit/3.8.1/junit-3.8.1.jar:/srv/gump/public/workspace/mvnlocalrepo/ant/ant-junit/1.6.5/ant-junit-1.6.5.jar
     [echo] test classpath:    /srv/gump/public/workspace/slf4j/integration/target/test-classes:/srv/gump/public/workspace/slf4j/integration/target/classes:/srv/gump/public/workspace/slf4j/slf4j-api/target/slf4j-api-1.5.9-SNAPSHOT.jar:/srv/gump/public/workspace/mvnlocalrepo/junit/junit/3.8.1/junit-3.8.1.jar:/srv/gump/public/workspace/mvnlocalrepo/ant/ant-junit/1.6.5/ant-junit-1.6.5.jar
     [echo] plugin classpath:  /srv/gump/public/workspace/mvnlocalrepo/org/codehaus/plexus/plexus-utils/1.5.6/plexus-utils-1.5.6.jar:/srv/gump/public/workspace/mvnlocalrepo/org/apache/ant/ant-launcher/1.7.1/ant-launcher-1.7.1.jar:/srv/gump/public/workspace/mvnlocalrepo/org/apache/ant/ant/1.7.1/ant-1.7.1.jar:/opt/maven2/lib/maven-2.0.10-uber.jar
Trying to override old definition of datatype junit

init:

testMismatch:
    [junit] Running org.slf4j.VersionMismatchTest
    [junit] Tests run: 1, Failures: 1, Errors: 0, Time elapsed: 0.04 sec
[INFO] ------------------------------------------------------------------------
[ERROR] BUILD ERROR
[INFO] ------------------------------------------------------------------------
[INFO] An Ant BuildException has occured: The following error occurred while executing this line:
/srv/gump/public/workspace/slf4j/integration/build.xml:64: Test org.slf4j.VersionMismatchTest failed

[INFO] ------------------------------------------------------------------------
[INFO] For more information, run Maven with the -e switch
[INFO] ------------------------------------------------------------------------
[INFO] Total time: 36 seconds
[INFO] Finished at: Wed Aug 05 03:13:53 PDT 2009
[INFO] Final Memory: 20M/37M
[INFO] ------------------------------------------------------------------------
---------------------------------------------

To subscribe to this information via syndicated feeds:
- RSS: http://vmgump.apache.org/gump/public/slf4j/slf4j-test/rss.xml
- Atom: http://vmgump.apache.org/gump/public/slf4j/slf4j-test/atom.xml

============================== Gump Tracking Only ===
Produced by Gump version 2.3.
Gump Run 05000005082009, vmgump:vmgump-public:05000005082009
Gump E-mail Identifier (unique within run) #18.

*********************************************************** G U M P
[GUMP@vmgump]: Project castor-test (in module castor) failed
To whom it may engage...
        
This is an automated request, but not an unsolicited one. For 
more information please visit http://gump.apache.org/nagged.html, 
and/or contact the folk at general@gump.apache.org.

Project castor-test has an issue affecting its community integration.
This issue affects 1 projects.
The current state of this project is 'Failed', with reason 'Build Failed'.
For reference only, the following projects are affected by this:
    - castor-test :  Java to XML, SQL, LDAP bindings


Full details are available at:
    http://vmgump.apache.org/gump/public/castor/castor-test/index.html

That said, some information snippets are provided here.

The following annotations (debug/informational/warning/error messages) were provided:
 -WARNING- Overriding Maven2 settings: [/srv/gump/public/workspace/castor/gump_mvn_settings.xml]
 -DEBUG- (Gump generated) Maven2 Settings in: /srv/gump/public/workspace/castor/gump_mvn_settings.xml
 -INFO- Failed with reason build failed
 -DEBUG- Maven POM in: /srv/gump/public/workspace/castor/pom.xml



The following work was performed:
http://vmgump.apache.org/gump/public/castor/castor-test/gump_work/build_castor_castor-test.html
Work Name: build_castor_castor-test (Type: Build)
Work ended in a state of : Failed
Elapsed: 6 mins 16 secs
Command Line: mvn --batch-mode --settings /srv/gump/public/workspace/castor/gump_mvn_settings.xml package 
[Working Directory: /srv/gump/public/workspace/castor]
CLASSPATH: /usr/lib/jvm/java-6-sun/lib/tools.jar
---------------------------------------------
2K downloaded
Downloading: http://snapshots.repository.codehaus.org/mysql/mysql-connector-java/5.1.6/mysql-connector-java-5.1.6.pom
Downloading: http://localhost:8192/maven2/mysql/mysql-connector-java/5.1.6/mysql-connector-java-5.1.6.pom
1K downloaded
Downloading: http://snapshots.repository.codehaus.org/org/dbunit/dbunit/2.2.3/dbunit-2.2.3.pom
Downloading: http://localhost:8192/maven2/org/dbunit/dbunit/2.2.3/dbunit-2.2.3.pom
18K downloaded
Downloading: http://snapshots.repository.codehaus.org/junit-addons/junit-addons/1.4/junit-addons-1.4.pom
Downloading: http://localhost:8192/maven2/junit-addons/junit-addons/1.4/junit-addons-1.4.pom
626b downloaded
Downloading: http://snapshots.repository.codehaus.org/xerces/xercesImpl/2.6.2/xercesImpl-2.6.2.pom
Downloading: http://localhost:8192/maven2/xerces/xercesImpl/2.6.2/xercesImpl-2.6.2.pom
150b downloaded
Downloading: http://snapshots.repository.codehaus.org/xerces/xmlParserAPIs/2.6.2/xmlParserAPIs-2.6.2.pom
Downloading: http://localhost:8192/maven2/xerces/xmlParserAPIs/2.6.2/xmlParserAPIs-2.6.2.pom
153b downloaded
Downloading: http://snapshots.repository.codehaus.org/poi/poi/2.5.1-final-20040804/poi-2.5.1-final-20040804.pom
Downloading: http://localhost:8192/maven2/poi/poi/2.5.1-final-20040804/poi-2.5.1-final-20040804.pom
191b downloaded
Downloading: http://snapshots.repository.codehaus.org/org/slf4j/slf4j-api/1.4.3/slf4j-api-1.4.3.pom
Downloading: http://localhost:8192/maven2/org/slf4j/slf4j-api/1.4.3/slf4j-api-1.4.3.pom
2K downloaded
Downloading: http://snapshots.repository.codehaus.org/org/slf4j/slf4j-parent/1.4.3/slf4j-parent-1.4.3.pom
Downloading: http://localhost:8192/maven2/org/slf4j/slf4j-parent/1.4.3/slf4j-parent-1.4.3.pom
7K downloaded
Downloading: http://snapshots.repository.codehaus.org/org/slf4j/slf4j-nop/1.4.3/slf4j-nop-1.4.3.pom
Downloading: http://localhost:8192/maven2/org/slf4j/slf4j-nop/1.4.3/slf4j-nop-1.4.3.pom
1K downloaded
[INFO] [compiler:compile]
[INFO] Nothing to compile - all classes are up to date
[INFO] [resources:testResources]
[WARNING] Using platform encoding (UTF-8 actually) to copy filtered resources, i.e. build is platform dependent!
[INFO] Copying 43 resources
Downloading: http://localhost:8192/maven2/org/apache/maven/maven-settings/2.0/maven-settings-2.0.pom
1K downloaded
[INFO] [sql:execute {execution: create schema}]
[INFO] Executing file: /srv/gump/public/workspace/castor/jdo-extensions-it/src/test/resources/org/castor/cpa/functional/create-derby.sql
[ERROR] Failed to execute:  CREATE TABLE book( isbn INTEGER NOT NULL, title VARCHAR(200) NOT NULL, PRIMARY KEY (isbn) )
[INFO] ------------------------------------------------------------------------
[ERROR] BUILD ERROR
[INFO] ------------------------------------------------------------------------
[INFO] Table/View 'BOOK' already exists in Schema 'TEST'.

[INFO] ------------------------------------------------------------------------
[INFO] For more information, run Maven with the -e switch
[INFO] ------------------------------------------------------------------------
[INFO] Total time: 6 minutes 14 seconds
[INFO] Finished at: Wed Aug 05 03:32:50 PDT 2009
[INFO] Final Memory: 25M/45M
[INFO] ------------------------------------------------------------------------
---------------------------------------------

To subscribe to this information via syndicated feeds:
- RSS: http://vmgump.apache.org/gump/public/castor/castor-test/rss.xml
- Atom: http://vmgump.apache.org/gump/public/castor/castor-test/atom.xml

============================== Gump Tracking Only ===
Produced by Gump version 2.3.
Gump Run 05000005082009, vmgump:vmgump-public:05000005082009
Gump E-mail Identifier (unique within run) #19.

*********************************************************** G U M P
[GUMP@vmgump]: Module ws-axis2-commons success, but with warnings.
To whom it may engage...
        
This is an automated request, but not an unsolicited one. For 
more information please visit http://gump.apache.org/nagged.html, 
and/or contact the folk at general@gump.apache.org.

Module ws-axis2-commons contains errors.
The current state of this module is 'Success'.

Full details are available at:
    http://vmgump.apache.org/gump/public/ws-axis2-commons/index.html

That said, some information snippets are provided here.

The following annotations (debug/informational/warning/error messages) were provided:
 -ERROR- *** Failed to update from source control.Stale contents ***



The following work was performed:
http://vmgump.apache.org/gump/public/ws-axis2-commons/gump_work/update_ws-axis2-commons.html
Work Name: update_ws-axis2-commons (Type: Update)
Work ended in a state of : Failed
Elapsed: 
Command Line: svn --quiet update --non-interactive ws-axis2-commons 
[Working Directory: /srv/gump/public/workspace/cvs]
---------------------------------------------
svn: Working copy 'ws-axis2-commons' locked
svn: run 'svn cleanup' to remove locks (type 'svn help cleanup' for details)
---------------------------------------------

To subscribe to this information via syndicated feeds:
- RSS: http://vmgump.apache.org/gump/public/ws-axis2-commons/rss.xml
- Atom: http://vmgump.apache.org/gump/public/ws-axis2-commons/atom.xml

============================== Gump Tracking Only ===
Produced by Gump version 2.3.
Gump Run 05000005082009, vmgump:vmgump-public:05000005082009
Gump E-mail Identifier (unique within run) #22.

*********************************************************** G U M P
[GUMP@vmgump]: Project ws-commons-xmlschema (in module ws-axis2-commons) failed
To whom it may engage...
        
This is an automated request, but not an unsolicited one. For 
more information please visit http://gump.apache.org/nagged.html, 
and/or contact the folk at general@gump.apache.org.

Project ws-commons-xmlschema has an issue affecting its community integration.
This issue affects 4 projects,
 and has been outstanding for 222 runs.
The current state of this project is 'Failed', with reason 'Missing Build Outputs'.
For reference only, the following projects are affected by this:
    - ws-axis2 :  Apache Axis2 SOAP Stack
    - ws-commons-xmlschema :  Common stuff for the WS projects.
    - ws-juddi :  ws-juddi -- UDDI Toolkit/Repository
    - ws-juddi-test :  ws-juddi -- UDDI Toolkit/Repository


Full details are available at:
    http://vmgump.apache.org/gump/public/ws-axis2-commons/ws-commons-xmlschema/index.html

That said, some information snippets are provided here.

The following annotations (debug/informational/warning/error messages) were provided:
 -DEBUG- Sole output [ws-commons-xmlschema-05082009.jar] identifier set to project name
 -DEBUG- (Gump generated) Maven2 Settings in: /srv/gump/public/workspace/ws-axis2-commons/XmlSchema/gump_mvn_settings.xml
 -DEBUG- Maven POM in: /srv/gump/public/workspace/ws-axis2-commons/XmlSchema/pom.xml
 -INFO- Failed with reason missing build outputs
 -ERROR- Missing Output: /srv/gump/public/workspace/ws-axis2-commons/XmlSchema/build/lib/ws-commons-xmlschema-05082009.jar
 -ERROR- No such directory (where output is expected) : /srv/gump/public/workspace/ws-axis2-commons/XmlSchema/build/lib
 -INFO- Failed to extract fallback artifacts from Gump Repository



The following work was performed:
http://vmgump.apache.org/gump/public/ws-axis2-commons/ws-commons-xmlschema/gump_work/build_ws-axis2-commons_ws-commons-xmlschema.html
Work Name: build_ws-axis2-commons_ws-commons-xmlschema (Type: Build)
Work ended in a state of : Success
Elapsed: 2 mins 48 secs
Command Line: mvn --batch-mode --settings /srv/gump/public/workspace/ws-axis2-commons/XmlSchema/gump_mvn_settings.xml install 
[Working Directory: /srv/gump/public/workspace/ws-axis2-commons/XmlSchema]
CLASSPATH: /usr/lib/jvm/java-6-sun/lib/tools.jar:/srv/gump/public/workspace/xml-commons/java/external/build/xml-apis-ext.jar:/srv/gump/public/workspace/xmlunit/build/java/lib/xmlunit-sumo-05082009.jar:/srv/gump/public/workspace/xmlunit/build/java/lib/xmlunit-legacy-05082009.jar:/srv/gump/public/workspace/xmlunit/build/java/lib/xmlunit-core-05082009.jar:/srv/gump/public/workspace/ant/dist/lib/ant-jmf.jar:/srv/gump/public/workspace/ant/dist/lib/ant-swing.jar:/srv/gump/public/workspace/ant/dist/lib/ant-apache-resolver.jar:/srv/gump/public/workspace/ant/dist/lib/ant-apache-xalan2.jar:/srv/gump/public/workspace/ant/dist/lib/ant-trax.jar:/srv/gump/public/workspace/ant/dist/lib/ant-junit.jar:/srv/gump/public/workspace/ant/dist/lib/ant-launcher.jar:/srv/gump/public/workspace/ant/dist/lib/ant-nodeps.jar:/srv/gump/public/workspace/ant/dist/lib/ant.jar:/srv/gump/packages/junit3.8.1/junit.jar:/srv/gump/public/workspace/xml-commons/java/build/resolver.jar:/srv/gump/packages/stax/jsr173_1.
 0_api.jar:/srv/gump/packages/stax/jsr173_1.0_ri.jar:/srv/gump/public/workspace/junit/dist/junit-05082009.jar:/srv/gump/public/workspace/apache-commons/beanutils/dist/commons-beanutils-05082009.jar:/srv/gump/public/workspace/apache-commons/collections/build/commons-collections-05082009.jar:/srv/gump/public/workspace/apache-commons/logging/target/commons-logging-05082009.jar:/srv/gump/public/workspace/apache-commons/logging/target/commons-logging-api-05082009.jar:/srv/gump/public/workspace/apache-commons/validator/dist/commons-validator-05082009.jar:/srv/gump/public/workspace/velocity-engine/bin/velocity-05082009.jar:/srv/gump/public/workspace/velocity-engine/bin/velocity-05082009-dep.jar
---------------------------------------------
Tests run: 3953, Failures: 0, Errors: 0, Skipped: 0, Time elapsed: 66.405 sec
Running tests.ConstraintsTest
Tests run: 1, Failures: 0, Errors: 0, Skipped: 0, Time elapsed: 0.009 sec
Running tests.ChoiceTest
Tests run: 1, Failures: 0, Errors: 0, Skipped: 0, Time elapsed: 0.005 sec
Running tests.customext.attrib.CustomExtensionSerializerTest
Tests run: 1, Failures: 0, Errors: 0, Skipped: 0, Time elapsed: 0.012 sec
Running tests.WSCOMMONS377Test
Tests run: 1, Failures: 0, Errors: 0, Skipped: 0, Time elapsed: 0.009 sec
Running tests.FacetsTest
Tests run: 9, Failures: 0, Errors: 0, Skipped: 0, Time elapsed: 0.021 sec
Running tests.TestUnqualifiedSchema
Tests run: 1, Failures: 0, Errors: 0, Skipped: 0, Time elapsed: 0.012 sec
Running tests.AnnotationDeepTest
Tests run: 2, Failures: 0, Errors: 0, Skipped: 0, Time elapsed: 0.01 sec
Running tests.UnionTest
Tests run: 1, Failures: 0, Errors: 0, Skipped: 0, Time elapsed: 0.003 sec
Running tests.CircularSchemaTest
Tests run: 1, Failures: 0, Errors: 0, Skipped: 0, Time elapsed: 0.004 sec
Running tests.GroupTest
Tests run: 1, Failures: 0, Errors: 0, Skipped: 0, Time elapsed: 0.003 sec
Running tests.AnnotationTest
Tests run: 5, Failures: 0, Errors: 0, Skipped: 0, Time elapsed: 0.01 sec
Running tests.TestElementForm
Tests run: 1, Failures: 0, Errors: 0, Skipped: 0, Time elapsed: 0.007 sec
Running tests.TestLocalUnnamedSimpleType
Tests run: 1, Failures: 0, Errors: 0, Skipped: 0, Time elapsed: 0.003 sec
Running tests.RecursiveImportTest
Tests run: 1, Failures: 0, Errors: 0, Skipped: 0, Time elapsed: 0.006 sec
Running tests.NotationTest
Tests run: 1, Failures: 0, Errors: 0, Skipped: 0, Time elapsed: 0.004 sec

Results :

Tests run: 4036, Failures: 0, Errors: 0, Skipped: 3

[INFO] [bundle:bundle]
[INFO] [install:install]
[INFO] Installing /srv/gump/public/workspace/ws-axis2-commons/XmlSchema/target/XmlSchema-2.0-SNAPSHOT.jar to /srv/gump/public/workspace/mvnlocalrepo/org/apache/ws/commons/schema/XmlSchema/2.0-SNAPSHOT/XmlSchema-2.0-SNAPSHOT.jar
[INFO] [bundle:install]
[INFO] Parsing file:/srv/gump/public/workspace/mvnlocalrepo/repository.xml
[INFO] Installing org/apache/ws/commons/schema/XmlSchema/2.0-SNAPSHOT/XmlSchema-2.0-SNAPSHOT.jar
[INFO] Writing OBR metadata
[INFO] ------------------------------------------------------------------------
[INFO] BUILD SUCCESSFUL
[INFO] ------------------------------------------------------------------------
[INFO] Total time: 2 minutes 46 seconds
[INFO] Finished at: Wed Aug 05 03:42:33 PDT 2009
[INFO] Final Memory: 26M/48M
[INFO] ------------------------------------------------------------------------
---------------------------------------------

To subscribe to this information via syndicated feeds:
- RSS: http://vmgump.apache.org/gump/public/ws-axis2-commons/ws-commons-xmlschema/rss.xml
- Atom: http://vmgump.apache.org/gump/public/ws-axis2-commons/ws-commons-xmlschema/atom.xml

============================== Gump Tracking Only ===
Produced by Gump version 2.3.
Gump Run 05000005082009, vmgump:vmgump-public:05000005082009
Gump E-mail Identifier (unique within run) #23.

*********************************************************** G U M P
[GUMP@vmgump]: Project xml-security-tests (in module xml-security) failed
To whom it may engage...
        
This is an automated request, but not an unsolicited one. For 
more information please visit http://gump.apache.org/nagged.html, 
and/or contact the folk at general@gump.apache.org.

Project xml-security-tests has an issue affecting its community integration.
This issue affects 1 projects.
The current state of this project is 'Failed', with reason 'Build Failed'.
For reference only, the following projects are affected by this:
    - xml-security-tests :  XML-Signature Syntax and Processing


Full details are available at:
    http://vmgump.apache.org/gump/public/xml-security/xml-security-tests/index.html

That said, some information snippets are provided here.

The following annotations (debug/informational/warning/error messages) were provided:
 -DEBUG- Dependency on jce exists, no need to add for property lib.jce.
 -INFO- Failed with reason build failed



The following work was performed:
http://vmgump.apache.org/gump/public/xml-security/xml-security-tests/gump_work/build_xml-security_xml-security-tests.html
Work Name: build_xml-security_xml-security-tests (Type: Build)
Work ended in a state of : Failed
Elapsed: 2 mins 18 secs
Command Line: /usr/lib/jvm/java-6-sun/bin/java -Djava.awt.headless=true -Dant.build.clonevm=true -Xbootclasspath/p:/srv/gump/public/workspace/xml-commons/java/external/build/xml-apis.jar:/srv/gump/public/workspace/xml-xerces2/build/xercesImpl.jar:/srv/gump/public/workspace/xml-xalan/build/serializer.jar:/srv/gump/public/workspace/xml-xalan/build/xalan-unbundled.jar org.apache.tools.ant.Main -Dgump.merge=/srv/gump/public/gump/work/merge.xml -Dbuild.sysclasspath=only -Djce.download.sha1=c1f0e975e8c8e0a0105787b249a50615b485d109 -Dlib.jce=/srv/gump/packages/jce/jce-jdk13-116.jar -Djce.download.md5=85c64cd754719a4bc8da7e9aa0e113fd test 
[Working Directory: /srv/gump/public/workspace/xml-security]
CLASSPATH: /usr/lib/jvm/java-6-sun/lib/tools.jar:/srv/gump/public/workspace/xml-security/build/test:/srv/gump/public/workspace/xml-security:/srv/gump/public/workspace/xml-security/build/xmlsec-05082009.jar:/srv/gump/public/workspace/ant/dist/lib/ant-jmf.jar:/srv/gump/public/workspace/ant/dist/lib/ant-swing.jar:/srv/gump/public/workspace/ant/dist/lib/ant-apache-resolver.jar:/srv/gump/public/workspace/ant/dist/lib/ant-apache-xalan2.jar:/srv/gump/public/workspace/ant/dist/lib/ant-trax.jar:/srv/gump/public/workspace/ant/dist/lib/ant-junit.jar:/srv/gump/public/workspace/ant/dist/lib/ant-launcher.jar:/srv/gump/public/workspace/ant/dist/lib/ant-nodeps.jar:/srv/gump/public/workspace/ant/dist/lib/ant.jar:/srv/gump/packages/junit3.8.1/junit.jar:/srv/gump/public/workspace/xml-commons/java/build/resolver.jar:/srv/gump/public/workspace/xml-commons/java/external/build/xml-apis-ext.jar:/srv/gump/packages/jce/jce-jdk13-116.jar:/srv/gump/public/workspace/apache-commons/logging/target/commons-
 logging-05082009.jar:/srv/gump/public/workspace/apache-commons/logging/target/commons-logging-api-05082009.jar:/srv/gump/public/workspace/junit/dist/junit-05082009.jar
---------------------------------------------
    [junit] 	Caused an ERROR
    [junit] Illegal key size
    [junit] 
    [junit] Testcase: testTrippleDesElementCipher took 0.174 sec
    [junit] Testcase: testAes128ElementCipher took 0.177 sec
    [junit] Testcase: testAes192ElementCipher took 0.129 sec
    [junit] 	Caused an ERROR
    [junit] Illegal key size
    [junit] 
    [junit] Testcase: testAes265ElementCipher took 0.136 sec
    [junit] 	Caused an ERROR
    [junit] Illegal key size
    [junit] 
    [junit] Testcase: testTrippleDesDocumentCipher took 1.181 sec
    [junit] Testcase: testSameDocumentCipherReference took 0.017 sec
    [junit] Testcase: testSerializedData took 0.079 sec
    [junit] Testcase: testEncryptedKeyWithRecipient took 0.03 sec
    [junit] Testcase: test_five_content_3des_cbc took 0.07 sec
    [junit] Testcase: test_five_content_aes256_cbc took 0.044 sec
    [junit] 	Caused an ERROR
    [junit] Illegal key size
    [junit] 
    [junit] Testcase: test_five_content_aes128_cbc_kw_aes192 took 0.045 sec
    [junit] Testcase: test_five_content_3des_cbc_kw_aes128 took 0.047 sec
    [junit] Testcase: test_five_content_aes128_cbc_rsa_15 took 0.277 sec
    [junit] Testcase: test_five_element_aes192_cbc_ref took 0.045 sec
    [junit] 	Caused an ERROR
    [junit] Illegal key size
    [junit] 
    [junit] Testcase: test_five_data_aes128_cbc took 0.027 sec
    [junit] Testcase: test_five_data_aes256_cbc_3des took 0.036 sec
    [junit] 	Caused an ERROR
    [junit] Illegal key size
    [junit] 
    [junit] Testcase: test_five_data_aes192_cbc_aes256 took 0.045 sec
    [junit] 	Caused an ERROR
    [junit] Illegal key size
    [junit] 
    [junit] Testcase: test_five_data_3des_cbc_rsa_oaep took 0.251 sec
    [junit] Testcase: testContentRemoved took 0.011 sec
    [junit] Test org.apache.xml.security.test.AllTests FAILED
[junitreport] Processing /srv/gump/public/workspace/xml-security/build/docs/xml/junit/TESTS-TestSuites.xml to /tmp/null885230434
[junitreport] Loading stylesheet jar:file:/srv/gump/public/workspace/ant/dist/lib/ant-junit.jar!/org/apache/tools/ant/taskdefs/optional/junit/xsl/junit-frames.xsl
[junitreport] Transform time: 3251ms
[junitreport] Deleting: /tmp/null885230434

BUILD FAILED
/srv/gump/public/workspace/xml-security/build.xml:376: Unit Tests Failed

Total time: 2 minutes 17 seconds
---------------------------------------------

To subscribe to this information via syndicated feeds:
- RSS: http://vmgump.apache.org/gump/public/xml-security/xml-security-tests/rss.xml
- Atom: http://vmgump.apache.org/gump/public/xml-security/xml-security-tests/atom.xml

============================== Gump Tracking Only ===
Produced by Gump version 2.3.
Gump Run 05000005082009, vmgump:vmgump-public:05000005082009
Gump E-mail Identifier (unique within run) #24.

*********************************************************** G U M P
[GUMP@vmgump]: Project ws-commons-axiom (in module ws-axis2-commons) failed
To whom it may engage...
        
This is an automated request, but not an unsolicited one. For 
more information please visit http://gump.apache.org/nagged.html, 
and/or contact the folk at general@gump.apache.org.

Project ws-commons-axiom has an issue affecting its community integration.
This issue affects 2 projects,
 and has been outstanding for 549 runs.
The current state of this project is 'Failed', with reason 'Missing Build Outputs'.
For reference only, the following projects are affected by this:
    - ws-commons-axiom :  Common stuff for the WS projects.
    - ws-commons-axiom-test :  Common stuff for the WS projects.


Full details are available at:
    http://vmgump.apache.org/gump/public/ws-axis2-commons/ws-commons-axiom/index.html

That said, some information snippets are provided here.

The following annotations (debug/informational/warning/error messages) were provided:
 -DEBUG- (Gump generated) Maven2 Settings in: /srv/gump/public/workspace/ws-axis2-commons/axiom/gump_mvn_settings.xml
 -DEBUG- Maven POM in: /srv/gump/public/workspace/ws-axis2-commons/axiom/pom.xml
 -INFO- Failed with reason missing build outputs
 -ERROR- Missing Output: /srv/gump/public/workspace/ws-axis2-commons/axiom/modules/axiom-api/target/axiom-api-SNAPSHOT.jar
 -ERROR- Missing Output: /srv/gump/public/workspace/ws-axis2-commons/axiom/modules/axiom-impl/target/axiom-impl-SNAPSHOT.jar
 -ERROR- Missing Output: /srv/gump/public/workspace/ws-axis2-commons/axiom/modules/axiom-dom/target/axiom-dom-SNAPSHOT.jar
 -ERROR- See Directory Listing Work for Missing Outputs
 -INFO- Failed to extract fallback artifacts from Gump Repository



The following work was performed:
http://vmgump.apache.org/gump/public/ws-axis2-commons/ws-commons-axiom/gump_work/build_ws-axis2-commons_ws-commons-axiom.html
Work Name: build_ws-axis2-commons_ws-commons-axiom (Type: Build)
Work ended in a state of : Success
Elapsed: 2 mins 21 secs
Command Line: mvn --batch-mode -Dmaven.test.skip.exec=true --settings /srv/gump/public/workspace/ws-axis2-commons/axiom/gump_mvn_settings.xml install 
[Working Directory: /srv/gump/public/workspace/ws-axis2-commons/axiom]
CLASSPATH: /usr/lib/jvm/java-6-sun/lib/tools.jar:/srv/gump/public/workspace/logging-log4j-12/dist/lib/log4j-05082009.jar:/srv/gump/packages/jaf-1.1ea/activation.jar:/srv/gump/packages/javamail-1.4/mail.jar:/srv/gump/packages/javamail-1.4/lib/mailapi.jar:/srv/gump/public/workspace/jaxen/target/jaxen-05082009.jar:/srv/gump/packages/jsse1.0.3/lib/jcert.jar:/srv/gump/packages/jsse1.0.3/lib/jnet.jar:/srv/gump/packages/jsse1.0.3/lib/jsse.jar:/srv/gump/packages/jms1.1/lib/jms.jar:/srv/gump/public/workspace/xml-commons/java/external/build/xml-apis-ext.jar:/srv/gump/public/workspace/xml-security/build/xmlsec-05082009.jar:/srv/gump/public/workspace/xmlunit/build/java/lib/xmlunit-sumo-05082009.jar:/srv/gump/public/workspace/xmlunit/build/java/lib/xmlunit-legacy-05082009.jar:/srv/gump/public/workspace/xmlunit/build/java/lib/xmlunit-core-05082009.jar:/srv/gump/public/workspace/junit/dist/junit-05082009.jar
---------------------------------------------
Downloading: http://dist.wso2.org/maven2//org/apache/maven/maven-project/2.0.6/maven-project-2.0.6.jar
Downloading: http://localhost:8192/maven2/org/apache/maven/maven-project/2.0.6/maven-project-2.0.6.jar
113K downloaded
Downloading: http://dist.wso2.org/maven2//org/apache/maven/maven-settings/2.0.6/maven-settings-2.0.6.jar
Downloading: http://localhost:8192/maven2/org/apache/maven/maven-settings/2.0.6/maven-settings-2.0.6.jar
47K downloaded
Downloading: http://dist.wso2.org/maven2//org/apache/maven/maven-plugin-registry/2.0.6/maven-plugin-registry-2.0.6.jar
Downloading: http://localhost:8192/maven2/org/apache/maven/maven-plugin-registry/2.0.6/maven-plugin-registry-2.0.6.jar
28K downloaded
Downloading: http://dist.wso2.org/maven2//org/apache/maven/maven-plugin-api/2.0.6/maven-plugin-api-2.0.6.jar
Downloading: http://localhost:8192/maven2/org/apache/maven/maven-plugin-api/2.0.6/maven-plugin-api-2.0.6.jar
12K downloaded
[INFO] [compiler:testCompile]
[INFO] Compiling 9 source files to /srv/gump/public/workspace/ws-axis2-commons/axiom/modules/axiom-integration/target/test-classes
[INFO] [surefire:test]
[INFO] Tests are skipped.
[INFO] [jar:jar]
[WARNING] JAR will be empty - no content was marked for inclusion!
[INFO] Building jar: /srv/gump/public/workspace/ws-axis2-commons/axiom/modules/axiom-integration/target/axiom-integration-1.2.9-SNAPSHOT.jar
[INFO] Preparing source:jar
[WARNING] Removing: jar from forked lifecycle, to prevent recursive invocation.
[INFO] No goals needed for project - skipping
[INFO] [source:jar {execution: default}]
[INFO] Building jar: /srv/gump/public/workspace/ws-axis2-commons/axiom/modules/axiom-integration/target/axiom-integration-1.2.9-SNAPSHOT-sources.jar
[INFO] [install:install]
[INFO] Installing /srv/gump/public/workspace/ws-axis2-commons/axiom/modules/axiom-integration/target/axiom-integration-1.2.9-SNAPSHOT.jar to /srv/gump/public/workspace/mvnlocalrepo/org/apache/ws/commons/axiom/axiom-integration/1.2.9-SNAPSHOT/axiom-integration-1.2.9-SNAPSHOT.jar
[INFO] Installing /srv/gump/public/workspace/ws-axis2-commons/axiom/modules/axiom-integration/target/axiom-integration-1.2.9-SNAPSHOT-sources.jar to /srv/gump/public/workspace/mvnlocalrepo/org/apache/ws/commons/axiom/axiom-integration/1.2.9-SNAPSHOT/axiom-integration-1.2.9-SNAPSHOT-sources.jar
[INFO] 
[INFO] 
[INFO] ------------------------------------------------------------------------
[INFO] Reactor Summary:
[INFO] ------------------------------------------------------------------------
[INFO] Axiom ................................................. SUCCESS [6.184s]
[INFO] Axiom API ............................................. SUCCESS [40.445s]
[INFO] Axiom Impl ............................................ SUCCESS [5.567s]
[INFO] Axiom DOM ............................................. SUCCESS [6.090s]
[INFO] Axiom C14N ............................................ SUCCESS [3.258s]
[INFO] Axiom Test Suite ...................................... SUCCESS [5.193s]
[INFO] Axiom OSGI Test Suite Parent .......................... SUCCESS [0.009s]
[INFO] Axiom OSGI Test Suite - Build ......................... SUCCESS [10.048s]
[INFO] Axiom OSGI Test Suite - Run ........................... SUCCESS [35.926s]
[INFO] Axiom Integration Test Suite .......................... SUCCESS [23.834s]
[INFO] ------------------------------------------------------------------------
[INFO] ------------------------------------------------------------------------
[INFO] BUILD SUCCESSFUL
[INFO] ------------------------------------------------------------------------
[INFO] Total time: 2 minutes 19 seconds
[INFO] Finished at: Wed Aug 05 04:10:21 PDT 2009
[INFO] Final Memory: 36M/89M
[INFO] ------------------------------------------------------------------------
---------------------------------------------

To subscribe to this information via syndicated feeds:
- RSS: http://vmgump.apache.org/gump/public/ws-axis2-commons/ws-commons-axiom/rss.xml
- Atom: http://vmgump.apache.org/gump/public/ws-axis2-commons/ws-commons-axiom/atom.xml

============================== Gump Tracking Only ===
Produced by Gump version 2.3.
Gump Run 05000005082009, vmgump:vmgump-public:05000005082009
Gump E-mail Identifier (unique within run) #28.

*********************************************************** G U M P
[GUMP@vmgump]: Project authx-script-test (in module authx) failed
To whom it may engage...
        
This is an automated request, but not an unsolicited one. For 
more information please visit http://gump.apache.org/nagged.html, 
and/or contact the folk at general@gump.apache.org.

Project authx-script-test has an issue affecting its community integration.
This issue affects 1 projects.
The current state of this project is 'Failed', with reason 'Build Failed'.
For reference only, the following projects are affected by this:
    - authx-script-test :  Apache Authentication and Authorization Framework


Full details are available at:
    http://vmgump.apache.org/gump/public/authx/authx-script-test/index.html

That said, some information snippets are provided here.

The following annotations (debug/informational/warning/error messages) were provided:
 -DEBUG- Dependency on xml-xerces exists, no need to add for property maven.jar.xercesImpl.
 -DEBUG- Dependency on asm exists, no need to add for property maven.jar.asm-util.
 -DEBUG- Dependency on packaged-jmock exists, no need to add for property maven.jar.jmock.
 -WARNING- Overriding Maven properties: [/srv/gump/public/workspace/authx/script/build.properties]
 -DEBUG- (Gump generated) Maven Properties in: /srv/gump/public/workspace/authx/script/build.properties
 -INFO- Failed with reason build failed
 -DEBUG- Maven POM in: /srv/gump/public/workspace/authx/script/project.xml
 -DEBUG- Maven project properties in: /srv/gump/public/workspace/authx/script/project.properties
 -INFO- Project Reports in: /srv/gump/public/workspace/authx/script/target/test-reports



The following work was performed:
http://vmgump.apache.org/gump/public/authx/authx-script-test/gump_work/build_authx_authx-script-test.html
Work Name: build_authx_authx-script-test (Type: Build)
Work ended in a state of : Failed
Elapsed: 33 secs
Command Line: maven --offline test 
[Working Directory: /srv/gump/public/workspace/authx/script]
CLASSPATH: /usr/lib/jvm/java-6-sun/lib/tools.jar:/srv/gump/public/workspace/asm/output/dist/lib/asm-util-05082009.jar:/srv/gump/public/workspace/authx/core/target/authx-core-05082009.jar:/srv/gump/public/workspace/dom4j/build/dom4j.jar:/srv/gump/packages/groovy-1.0-jsr-03/groovy-1.0-jsr-03.jar:/srv/gump/packages/jmock/jmock-1.0.1.jar:/srv/gump/packages/picocontainer-1.1/picocontainer-1.1.jar:/srv/gump/public/workspace/xml-commons/java/external/build/xml-apis-ext.jar:/srv/gump/public/workspace/authx/script/target/authx-script-05082009.jar
---------------------------------------------
java:prepare-filesystem:

java:compile:
    [echo] Compiling to /srv/gump/public/workspace/authx/script/target/classes

java:jar-resources:

test:prepare-filesystem:

test:test-resources:
Copying 4 files to /srv/gump/public/workspace/authx/script/target/test-classes

test:compile:
    [javac] Compiling 17 source files to /srv/gump/public/workspace/authx/script/target/test-classes

test:test:
    [junit] Running org.apache.authx.script.groovy.GroovyRuleLoaderTest
    [junit] Tests run: 1, Failures: 0, Errors: 1, Time elapsed: 0.116 sec
    [junit] [ERROR] TEST org.apache.authx.script.groovy.GroovyRuleLoaderTest FAILED
    [junit] Running org.apache.authx.script.groovy.GroovyScriptClassLoaderTest
    [junit] Tests run: 2, Failures: 0, Errors: 2, Time elapsed: 0.041 sec
    [junit] [ERROR] TEST org.apache.authx.script.groovy.GroovyScriptClassLoaderTest FAILED
    [junit] Running org.apache.authx.script.xml.Dom4JGroupBuilderTest
    [junit] Tests run: 4, Failures: 0, Errors: 0, Time elapsed: 0.146 sec
    [junit] Running org.apache.authx.script.xml.Dom4JRealmBuilderTest
    [junit] Tests run: 2, Failures: 0, Errors: 0, Time elapsed: 0.124 sec
    [junit] Running org.apache.authx.script.xml.Dom4JRuleSetBuilderTest
    [junit] Tests run: 10, Failures: 0, Errors: 0, Time elapsed: 0.145 sec
    [junit] Running org.apache.authx.script.xml.Dom4JRoleBuilderTest
    [junit] Tests run: 3, Failures: 0, Errors: 0, Time elapsed: 0.124 sec
    [junit] Running org.apache.authx.script.common.PicoContainerFactoryTest
    [junit] Tests run: 2, Failures: 0, Errors: 0, Time elapsed: 0.05 sec
    [junit] Running org.apache.authx.script.common.DynamicRuleProxyTest
    [junit] Tests run: 1, Failures: 0, Errors: 1, Time elapsed: 0.034 sec
    [junit] [ERROR] TEST org.apache.authx.script.common.DynamicRuleProxyTest FAILED
    [junit] Running org.apache.authx.script.common.ScriptedRuleSetBuilderTest
    [junit] Tests run: 1, Failures: 0, Errors: 0, Time elapsed: 0.046 sec
    [junit] Running org.apache.authx.script.common.SmartCachingScriptClassLoaderTest
    [junit] Tests run: 2, Failures: 0, Errors: 2, Time elapsed: 0.039 sec
    [junit] [ERROR] TEST org.apache.authx.script.common.SmartCachingScriptClassLoaderTest FAILED

BUILD FAILED
File...... /home/gump/.maven/cache/maven-test-plugin-1.6.2/plugin.jelly
Element... fail
Line...... 181
Column.... 54
There were test failures.
Total time: 32 seconds
Finished at: Wed Aug 05 04:24:57 PDT 2009

---------------------------------------------

To subscribe to this information via syndicated feeds:
- RSS: http://vmgump.apache.org/gump/public/authx/authx-script-test/rss.xml
- Atom: http://vmgump.apache.org/gump/public/authx/authx-script-test/atom.xml

============================== Gump Tracking Only ===
Produced by Gump version 2.3.
Gump Run 05000005082009, vmgump:vmgump-public:05000005082009
Gump E-mail Identifier (unique within run) #29.

*********************************************************** G U M P
[GUMP@vmgump]: Project ws-commons-policy (in module ws-axis2-commons) failed
To whom it may engage...
        
This is an automated request, but not an unsolicited one. For 
more information please visit http://gump.apache.org/nagged.html, 
and/or contact the folk at general@gump.apache.org.

Project ws-commons-policy has an issue affecting its community integration.
This issue affects 1 projects,
 and has been outstanding for 1104 runs.
The current state of this project is 'Failed', with reason 'Build Failed'.
For reference only, the following projects are affected by this:
    - ws-commons-policy :  Common stuff for the WS projects.


Full details are available at:
    http://vmgump.apache.org/gump/public/ws-axis2-commons/ws-commons-policy/index.html

That said, some information snippets are provided here.

The following annotations (debug/informational/warning/error messages) were provided:
 -DEBUG- Sole output [ws-commons-policy-05082009.jar] identifier set to project name
 -INFO- Optional dependency ws-commons-axiom failed with reason missing build outputs
 -DEBUG- (Gump generated) Maven2 Settings in: /srv/gump/public/workspace/ws-axis2-commons/neethi/gump_mvn_settings.xml
 -INFO- Failed with reason build failed
 -DEBUG- Maven POM in: /srv/gump/public/workspace/ws-axis2-commons/neethi/pom.xml
 -INFO- Failed to extract fallback artifacts from Gump Repository



The following work was performed:
http://vmgump.apache.org/gump/public/ws-axis2-commons/ws-commons-policy/gump_work/build_ws-axis2-commons_ws-commons-policy.html
Work Name: build_ws-axis2-commons_ws-commons-policy (Type: Build)
Work ended in a state of : Failed
Elapsed: 11 secs
Command Line: mvn --batch-mode --settings /srv/gump/public/workspace/ws-axis2-commons/neethi/gump_mvn_settings.xml package 
[Working Directory: /srv/gump/public/workspace/ws-axis2-commons/neethi]
CLASSPATH: /usr/lib/jvm/java-6-sun/lib/tools.jar:/srv/gump/public/workspace/apache-commons/logging/target/commons-logging-05082009.jar:/srv/gump/public/workspace/apache-commons/logging/target/commons-logging-api-05082009.jar:/srv/gump/public/workspace/ws-axis2-commons/axiom/modules/axiom-api/target/axiom-api-SNAPSHOT.jar:/srv/gump/public/workspace/ws-axis2-commons/axiom/modules/axiom-impl/target/axiom-impl-SNAPSHOT.jar:/srv/gump/public/workspace/ws-axis2-commons/axiom/modules/axiom-dom/target/axiom-dom-SNAPSHOT.jar:/srv/gump/public/workspace/wsdl4j/build/lib/qname.jar:/srv/gump/public/workspace/wsdl4j/build/lib/wsdl4j.jar
---------------------------------------------
Missing:
----------
1) org.apache.ws.commons.axiom:axiom-api:jar:SNAPSHOT

  Try downloading the file manually from the project website.

  Then, install it using the command: 
      mvn install:install-file -DgroupId=org.apache.ws.commons.axiom -DartifactId=axiom-api -Dversion=SNAPSHOT -Dpackaging=jar -Dfile=/path/to/file

  Alternatively, if you host your own repository you can deploy the file there: 
      mvn deploy:deploy-file -DgroupId=org.apache.ws.commons.axiom -DartifactId=axiom-api -Dversion=SNAPSHOT -Dpackaging=jar -Dfile=/path/to/file -Durl=[url] -DrepositoryId=[id]

  Path to dependency: 
  	1) org.apache.neethi:neethi:jar:SNAPSHOT
  	2) org.apache.ws.commons.axiom:axiom-api:jar:SNAPSHOT

2) org.apache.ws.commons.axiom:axiom-impl:jar:SNAPSHOT

  Try downloading the file manually from the project website.

  Then, install it using the command: 
      mvn install:install-file -DgroupId=org.apache.ws.commons.axiom -DartifactId=axiom-impl -Dversion=SNAPSHOT -Dpackaging=jar -Dfile=/path/to/file

  Alternatively, if you host your own repository you can deploy the file there: 
      mvn deploy:deploy-file -DgroupId=org.apache.ws.commons.axiom -DartifactId=axiom-impl -Dversion=SNAPSHOT -Dpackaging=jar -Dfile=/path/to/file -Durl=[url] -DrepositoryId=[id]

  Path to dependency: 
  	1) org.apache.neethi:neethi:jar:SNAPSHOT
  	2) org.apache.ws.commons.axiom:axiom-impl:jar:SNAPSHOT

----------
2 required artifacts are missing.

for artifact: 
  org.apache.neethi:neethi:jar:SNAPSHOT

from the specified remote repositories:
  gump-central (http://localhost:8192/maven2),
  maven-central (http://repo1.maven.org/maven/),
  apache-ws-snapshots2 (http://ws.zones.apache.org/repository2)



[INFO] ------------------------------------------------------------------------
[INFO] For more information, run Maven with the -e switch
[INFO] ------------------------------------------------------------------------
[INFO] Total time: 9 seconds
[INFO] Finished at: Wed Aug 05 04:32:47 PDT 2009
[INFO] Final Memory: 9M/16M
[INFO] ------------------------------------------------------------------------
---------------------------------------------

To subscribe to this information via syndicated feeds:
- RSS: http://vmgump.apache.org/gump/public/ws-axis2-commons/ws-commons-policy/rss.xml
- Atom: http://vmgump.apache.org/gump/public/ws-axis2-commons/ws-commons-policy/atom.xml

============================== Gump Tracking Only ===
Produced by Gump version 2.3.
Gump Run 05000005082009, vmgump:vmgump-public:05000005082009
Gump E-mail Identifier (unique within run) #32.

*********************************************************** G U M P
[GUMP@vmgump]: Project JacORB-idllib (in module JacORB) failed
To whom it may engage...
        
This is an automated request, but not an unsolicited one. For 
more information please visit http://gump.apache.org/nagged.html, 
and/or contact the folk at general@gump.apache.org.

Project JacORB-idllib has an issue affecting its community integration.
This issue affects 2 projects,
 and has been outstanding for 41 runs.
The current state of this project is 'Failed', with reason 'Build Failed'.
For reference only, the following projects are affected by this:
    - JacORB :  The free Java implementation of the OMG's CORBA standard.
    - JacORB-idllib :  The free Java implementation of the OMG's CORBA standard.


Full details are available at:
    http://vmgump.apache.org/gump/public/JacORB/JacORB-idllib/index.html

That said, some information snippets are provided here.

The following annotations (debug/informational/warning/error messages) were provided:
 -DEBUG- Sole output [idl.jar] identifier set to project name
 -INFO- Failed with reason build failed
 -INFO- Failed to extract fallback artifacts from Gump Repository



The following work was performed:
http://vmgump.apache.org/gump/public/JacORB/JacORB-idllib/gump_work/build_JacORB_JacORB-idllib.html
Work Name: build_JacORB_JacORB-idllib (Type: Build)
Work ended in a state of : Failed
Elapsed: 6 secs
Command Line: /usr/lib/jvm/java-6-sun/bin/java -Djava.awt.headless=true -Xbootclasspath/p:/srv/gump/public/workspace/xml-commons/java/external/build/xml-apis.jar:/srv/gump/public/workspace/xml-xerces2/build/xercesImpl.jar org.apache.tools.ant.Main -Dgump.merge=/srv/gump/public/gump/work/merge.xml -Dbuild.sysclasspath=only init idllib 
[Working Directory: /srv/gump/public/workspace/JacORB]
CLASSPATH: /usr/lib/jvm/java-6-sun/lib/tools.jar:/srv/gump/public/workspace/ant/build/lib/ant-stylebook.jar:/srv/gump/public/workspace/ant/build/lib/ant-swing.jar:/srv/gump/public/workspace/ant/build/lib/ant-apache-resolver.jar:/srv/gump/public/workspace/ant/build/lib/ant-nodeps.jar:/srv/gump/public/workspace/ant/build/lib/ant-apache-xalan2.jar:/srv/gump/public/workspace/ant/build/lib/ant-apache-regexp.jar:/srv/gump/public/workspace/ant/build/lib/ant-commons-net.jar:/srv/gump/public/workspace/ant/build/lib/ant-apache-log4j.jar:/srv/gump/public/workspace/ant/build/lib/ant-commons-logging.jar:/srv/gump/public/workspace/ant/build/lib/ant-jai.jar:/srv/gump/public/workspace/ant/build/lib/ant-jmf.jar:/srv/gump/public/workspace/ant/build/lib/ant-launcher.jar:/srv/gump/public/workspace/ant/build/lib/ant-jdepend.jar:/srv/gump/public/workspace/ant/build/lib/ant-apache-bsf.jar:/srv/gump/public/workspace/ant/build/lib/ant-apache-oro.jar:/srv/gump/public/workspace/ant/build/lib/ant-apache
 -bcel.jar:/srv/gump/public/workspace/ant/build/lib/ant-trax.jar:/srv/gump/public/workspace/ant/build/lib/ant-antlr.jar:/srv/gump/public/workspace/ant/build/lib/ant-junit.jar:/srv/gump/public/workspace/ant/build/lib/ant-jsch.jar:/srv/gump/public/workspace/ant/build/lib/ant-javamail.jar:/srv/gump/public/workspace/ant/build/lib/ant.jar:/srv/gump/public/workspace/xml-commons/java/external/build/xml-apis-ext.jar:/srv/gump/packages/antlr/antlr-3.1.3.jar:/srv/gump/public/workspace/excalibur/framework/api/target/avalon-framework-api-4.3.2-SNAPSHOT.jar:/srv/gump/packages/dougLea/concurrent.jar:/srv/gump/packages/avalon/avalon-logkit-2.1.jar:/srv/gump/public/workspace/xml-xalan/tools/java_cup.jar:/srv/gump/public/workspace/xml-xalan/lib/runtime.jar
---------------------------------------------
    [javac] location: package org.jacorb.idl.runtime
    [javac]               CUP$parser$result = new org.jacorb.idl.runtime.Symbol(91/*parameter_dcls*/, ((org.jacorb.idl.runtime.Symbol)CUP$parser$stack.elementAt(CUP$parser$top-1)).left, ((org.jacorb.idl.runtime.Symbol)CUP$parser$stack.elementAt(CUP$parser$top-0)).right, RESULT);
    [javac]                                                             ^
    [javac] /srv/gump/public/workspace/JacORB/src/org/jacorb/idl/parser.java:2029: cannot find symbol
    [javac] symbol  : class Symbol
    [javac] location: package org.jacorb.idl.runtime
    [javac]               CUP$parser$result = new org.jacorb.idl.runtime.Symbol(91/*parameter_dcls*/, ((org.jacorb.idl.runtime.Symbol)CUP$parser$stack.elementAt(CUP$parser$top-1)).left, ((org.jacorb.idl.runtime.Symbol)CUP$parser$stack.elementAt(CUP$parser$top-0)).right, RESULT);
    [javac]                                                                                                                   ^
    [javac] /srv/gump/public/workspace/JacORB/src/org/jacorb/idl/parser.java:2029: cannot find symbol
    [javac] symbol  : class Symbol
    [javac] location: package org.jacorb.idl.runtime
    [javac]               CUP$parser$result = new org.jacorb.idl.runtime.Symbol(91/*parameter_dcls*/, ((org.jacorb.idl.runtime.Symbol)CUP$parser$stack.elementAt(CUP$parser$top-1)).left, ((org.jacorb.idl.runtime.Symbol)CUP$parser$stack.elementAt(CUP$parser$top-0)).right, RESULT);
    [javac]                                                                                                                                                                                                       ^
    [javac] /srv/gump/public/workspace/JacORB/src/org/jacorb/idl/parser.java:2037: cannot find symbol
    [javac] symbol  : class Symbol
    [javac] location: package org.jacorb.idl.runtime
    [javac] 		int pdsleft = ((org.jacorb.idl.runtime.Symbol)CUP$parser$stack.elementAt(CUP$parser$top-1)).left;
    [javac] 		                                      ^
    [javac] /srv/gump/public/workspace/JacORB/src/org/jacorb/idl/parser.java:2038: cannot find symbol
    [javac] symbol  : class Symbol
    [javac] location: package org.jacorb.idl.runtime
    [javac] 		int pdsright = ((org.jacorb.idl.runtime.Symbol)CUP$parser$stack.elementAt(CUP$parser$top-1)).right;
    [javac] 		                                       ^
    [javac] /srv/gump/public/workspace/JacORB/src/org/jacorb/idl/parser.java:2039: cannot find symbol
    [javac] symbol  : class Symbol
    [javac] location: package org.jacorb.idl.runtime
    [javac] 		SymbolList pds = (SymbolList)((org.jacorb.idl.runtime.Symbol) CUP$parser$stack.elementAt(CUP$parser$top-1)).value;
    [javac] 		                                                     ^
    [javac] /srv/gump/public/workspace/JacORB/src/org/jacorb/idl/parser.java:2043: cannot find symbol
    [javac] symbol  : class Symbol
    [javac] location: package org.jacorb.idl.runtime
    [javac]               CUP$parser$result = new org.jacorb.idl.runtime.Symbol(91/*parameter_dcls*/, ((org.jacorb.idl.runtime.Symbol)CUP$parser$stack.elementAt(CUP$parser$top-2)).left, ((org.jacorb.idl.runtime.Symbol)CUP$parser$stack.elementAt(CUP$parser$top-0)).right, RESULT);
    [javac]                                                             ^
    [javac] /srv/gump/public/workspace/JacORB/src/org/jacorb/idl/parser.java:2043: cannot find symbol
    [javac] symbol  : class Symbol
    [javac] location: package org.jacorb.idl.runtime
    [javac]               CUP$parser$result = new org.jacorb.idl.runtime.Symbol(91/*parameter_dcls*/, ((org.jacorb.idl.runtime.Symbol)CUP$parser$stack.elementAt(CUP$parser$top-2)).left, ((org.jacorb.idl.runtime.Symbol)CUP$parser$stack.elementAt(CUP$parser$top-0)).right, RESULT);
    [javac]                                                                                                                   ^
    [javac] Note: Some input files use or override a deprecated API.
    [javac] Note: Recompile with -Xlint:deprecation for details.
    [javac] Note: Some input files use unchecked or unsafe operations.
    [javac] Note: Recompile with -Xlint:unchecked for details.
    [javac] 100 errors

BUILD FAILED
/srv/gump/public/workspace/JacORB/build.xml:68: The following error occurred while executing this line:
/srv/gump/public/workspace/JacORB/src/org/jacorb/idl/build.xml:18: The following error occurred while executing this line:
/srv/gump/public/workspace/JacORB/etc/common.xml:90: Compile failed; see the compiler error output for details.

Total time: 5 seconds
---------------------------------------------

To subscribe to this information via syndicated feeds:
- RSS: http://vmgump.apache.org/gump/public/JacORB/JacORB-idllib/rss.xml
- Atom: http://vmgump.apache.org/gump/public/JacORB/JacORB-idllib/atom.xml

============================== Gump Tracking Only ===
Produced by Gump version 2.3.
Gump Run 05000005082009, vmgump:vmgump-public:05000005082009
Gump E-mail Identifier (unique within run) #34.

*********************************************************** G U M P
[GUMP@vmgump]: Project jetty (in module jetty) failed
To whom it may engage...
        
This is an automated request, but not an unsolicited one. For 
more information please visit http://gump.apache.org/nagged.html, 
and/or contact the folk at general@gump.apache.org.

Project jetty has an issue affecting its community integration.
This issue affects 2 projects,
 and has been outstanding for 165 runs.
The current state of this project is 'Failed', with reason 'Build Failed'.
For reference only, the following projects are affected by this:
    - jetty :  Java HTTP Servlet Server
    - jetty-test :  Java HTTP Servlet Server


Full details are available at:
    http://vmgump.apache.org/gump/public/jetty/jetty/index.html

That said, some information snippets are provided here.

The following annotations (debug/informational/warning/error messages) were provided:
 -DEBUG- (Gump generated) Maven2 Settings in: /srv/gump/public/workspace/jetty/gump_mvn_settings.xml
 -INFO- Failed with reason build failed
 -DEBUG- Maven POM in: /srv/gump/public/workspace/jetty/pom.xml
 -INFO- Failed to extract fallback artifacts from Gump Repository



The following work was performed:
http://vmgump.apache.org/gump/public/jetty/jetty/gump_work/build_jetty_jetty.html
Work Name: build_jetty_jetty (Type: Build)
Work ended in a state of : Failed
Elapsed: 1 min 36 secs
Command Line: mvn --batch-mode -Dmaven.test.skip.exec=true --settings /srv/gump/public/workspace/jetty/gump_mvn_settings.xml package 
[Working Directory: /srv/gump/public/workspace/jetty]
CLASSPATH: /usr/lib/jvm/java-6-sun/lib/tools.jar:/srv/gump/public/workspace/ant/dist/lib/ant-jmf.jar:/srv/gump/public/workspace/ant/dist/lib/ant-swing.jar:/srv/gump/public/workspace/ant/dist/lib/ant-apache-resolver.jar:/srv/gump/public/workspace/ant/dist/lib/ant-apache-xalan2.jar:/srv/gump/public/workspace/ant/dist/lib/ant-trax.jar:/srv/gump/public/workspace/ant/dist/lib/ant-junit.jar:/srv/gump/public/workspace/ant/dist/lib/ant-launcher.jar:/srv/gump/public/workspace/ant/dist/lib/ant-nodeps.jar:/srv/gump/public/workspace/ant/dist/lib/ant.jar:/srv/gump/packages/bsh-2.0b4/bsh-commands-2.0b4.jar:/srv/gump/packages/bsh-2.0b4/bsh-classpath-2.0b4.jar:/srv/gump/packages/bsh-2.0b4/bsh-core-2.0b4.jar:/srv/gump/packages/bsh-2.0b4/bsh-bsf-2.0b4.jar:/srv/gump/packages/bsh-2.0b4/bsh-2.0b4.jar:/srv/gump/packages/bsh-2.0b4/bsh-reflect-2.0b4.jar:/srv/gump/packages/bsh-2.0b4/bsh-util-2.0b4.jar:/srv/gump/public/workspace/apache-commons/beanutils/dist/commons-beanutils-05082009.jar:/srv/gump/pu
 blic/workspace/apache-commons/digester/dist/commons-digester.jar:/srv/gump/packages/commons-el-1.0/commons-el.jar:/srv/gump/public/workspace/httpcomponents/oac.hc3x/dist/commons-httpclient.jar:/srv/gump/packages/jaf-1.1ea/activation.jar:/srv/gump/public/workspace/jakarta-servletapi-5/jsr154/dist/lib/servlet-api.jar:/srv/gump/packages/javamail-1.4/mail.jar:/srv/gump/packages/javamail-1.4/lib/mailapi.jar:/srv/gump/packages/jtidy-04aug2000r7-dev/build/Tidy.jar:/srv/gump/public/workspace/junit/dist/junit-05082009.jar:/srv/gump/public/workspace/mx4j/dist/lib/mx4j-impl.jar:/srv/gump/public/workspace/mx4j/dist/lib/mx4j-jmx.jar:/srv/gump/public/workspace/mx4j/dist/lib/mx4j.jar:/srv/gump/public/workspace/mx4j/tools-dist/lib/mx4j-tools.jar:/srv/gump/public/workspace/slf4j/slf4j-migrator/target/slf4j-migrator-1.5.9-SNAPSHOT.jar:/srv/gump/public/workspace/slf4j/slf4j-nop/target/slf4j-nop-1.5.9-SNAPSHOT.jar:/srv/gump/public/workspace/slf4j/log4j-over-slf4j/target/log4j-over-slf4j-1.5.9-S
 NAPSHOT.jar:/srv/gump/public/workspace/slf4j/slf4j-log4j12/target/slf4j-log4j12-1.5.9-SNAPSHOT.jar:/srv/gump/public/workspace/slf4j/slf4j-jcl/target/slf4j-jcl-1.5.9-SNAPSHOT.jar:/srv/gump/public/workspace/slf4j/slf4j-api/target/slf4j-api-1.5.9-SNAPSHOT.jar:/srv/gump/public/workspace/slf4j/jcl104-over-slf4j/target/jcl104-over-slf4j-1.5.9-SNAPSHOT.jar:/srv/gump/public/workspace/slf4j/slf4j-jdk14/target/slf4j-jdk14-1.5.9-SNAPSHOT.jar:/srv/gump/public/workspace/slf4j/slf4j-simple/target/slf4j-simple-1.5.9-SNAPSHOT.jar:/srv/gump/public/workspace/slf4j/slf4j-ext/target/slf4j-ext-1.5.9-SNAPSHOT.jar:/srv/gump/public/workspace/slf4j/jcl-over-slf4j/target/jcl-over-slf4j-1.5.9-SNAPSHOT.jar:/srv/gump/public/workspace/slf4j/jul-to-slf4j/target/jul-to-slf4j-1.5.9-SNAPSHOT.jar:/srv/gump/public/workspace/jakarta-slide/webdavclient/dist/lib/jakarta-slide-webdavlib-05082009.jar:/srv/gump/public/workspace/xml-commons/java/external/build/xml-apis-ext.jar
---------------------------------------------
[INFO] Using 'UTF-8' encoding to copy filtered resources.
[INFO] skip non existing resourceDirectory /srv/gump/public/workspace/jetty/jetty-continuation/src/test/resources
[INFO] Copying 1 resource
[INFO] [compiler:testCompile]
[INFO] No sources to compile
[INFO] [surefire:test]
[INFO] Tests are skipped.
[INFO] [jar:jar]
[INFO] Building jar: /srv/gump/public/workspace/jetty/jetty-continuation/target/jetty-continuation-7.0.0.RC3-SNAPSHOT.jar
[INFO] [jar:jar {execution: artifact-jar}]
[INFO] [jar:test-jar {execution: test-jar}]
[INFO] Building jar: /srv/gump/public/workspace/jetty/jetty-continuation/target/jetty-continuation-7.0.0.RC3-SNAPSHOT-tests.jar
[INFO] Preparing source:jar
[WARNING] Removing: jar from forked lifecycle, to prevent recursive invocation.
[INFO] [enforcer:enforce {execution: enforce-java}]
[INFO] [source:jar {execution: attach-sources}]
[INFO] Building jar: /srv/gump/public/workspace/jetty/jetty-continuation/target/jetty-continuation-7.0.0.RC3-SNAPSHOT-sources.jar
[INFO] ------------------------------------------------------------------------
[INFO] Building Jetty :: Server Core
[INFO]    task-segment: [package]
[INFO] ------------------------------------------------------------------------
[INFO] [enforcer:enforce {execution: enforce-java}]
[INFO] [remote-resources:process {execution: default}]
[INFO] [resources:resources]
[INFO] Using 'UTF-8' encoding to copy filtered resources.
[INFO] Copying 1 resource
[INFO] Copying 1 resource
[INFO] [compiler:compile]
[INFO] Compiling 59 source files to /srv/gump/public/workspace/jetty/jetty-server/target/classes
[INFO] ------------------------------------------------------------------------
[ERROR] BUILD FAILURE
[INFO] ------------------------------------------------------------------------
[INFO] Compilation failure

/srv/gump/public/workspace/jetty/jetty-server/src/main/java/org/eclipse/jetty/server/Server.java:[359,96] cannot find symbol
symbol  : method getContextPath()
location: interface javax.servlet.ServletContext

/srv/gump/public/workspace/jetty/jetty-server/src/main/java/org/eclipse/jetty/server/Server.java:[361,62] cannot find symbol
symbol  : method getContextPath()
location: interface javax.servlet.ServletContext


[INFO] ------------------------------------------------------------------------
[INFO] For more information, run Maven with the -e switch
[INFO] ------------------------------------------------------------------------
[INFO] Total time: 1 minute 34 seconds
[INFO] Finished at: Wed Aug 05 04:43:08 PDT 2009
[INFO] Final Memory: 47M/84M
[INFO] ------------------------------------------------------------------------
---------------------------------------------

To subscribe to this information via syndicated feeds:
- RSS: http://vmgump.apache.org/gump/public/jetty/jetty/rss.xml
- Atom: http://vmgump.apache.org/gump/public/jetty/jetty/atom.xml

============================== Gump Tracking Only ===
Produced by Gump version 2.3.
Gump Run 05000005082009, vmgump:vmgump-public:05000005082009
Gump E-mail Identifier (unique within run) #36.

*********************************************************** G U M P
[GUMP@vmgump]: Module ws-axis2 success, but with warnings.
To whom it may engage...
        
This is an automated request, but not an unsolicited one. For 
more information please visit http://gump.apache.org/nagged.html, 
and/or contact the folk at general@gump.apache.org.

Module ws-axis2 contains errors.
The current state of this module is 'Success'.

Full details are available at:
    http://vmgump.apache.org/gump/public/ws-axis2/index.html

That said, some information snippets are provided here.

The following annotations (debug/informational/warning/error messages) were provided:
 -ERROR- *** Failed to update from source control.Stale contents ***



The following work was performed:
http://vmgump.apache.org/gump/public/ws-axis2/gump_work/update_ws-axis2.html
Work Name: update_ws-axis2 (Type: Update)
Work ended in a state of : Failed
Elapsed: 
Command Line: svn --quiet update --non-interactive ws-axis2 
[Working Directory: /srv/gump/public/workspace/cvs]
---------------------------------------------
svn: Working copy 'ws-axis2' locked
svn: run 'svn cleanup' to remove locks (type 'svn help cleanup' for details)
---------------------------------------------

To subscribe to this information via syndicated feeds:
- RSS: http://vmgump.apache.org/gump/public/ws-axis2/rss.xml
- Atom: http://vmgump.apache.org/gump/public/ws-axis2/atom.xml

============================== Gump Tracking Only ===
Produced by Gump version 2.3.
Gump Run 05000005082009, vmgump:vmgump-public:05000005082009
Gump E-mail Identifier (unique within run) #37.

*********************************************************** G U M P
[GUMP@vmgump]: Module ivy success, but with warnings.
To whom it may engage...
        
This is an automated request, but not an unsolicited one. For 
more information please visit http://gump.apache.org/nagged.html, 
and/or contact the folk at general@gump.apache.org.

Module ivy contains errors.
The current state of this module is 'Success'.

Full details are available at:
    http://vmgump.apache.org/gump/public/ivy/index.html

That said, some information snippets are provided here.

The following annotations (debug/informational/warning/error messages) were provided:
 -ERROR- *** Failed to update from source control.Stale contents ***



The following work was performed:
http://vmgump.apache.org/gump/public/ivy/gump_work/update_ivy.html
Work Name: update_ivy (Type: Update)
Work ended in a state of : Failed
Elapsed: 
Command Line: svn --quiet update --non-interactive ivy 
[Working Directory: /srv/gump/public/workspace/cvs]
---------------------------------------------
svn: Working copy 'ivy' locked
svn: run 'svn cleanup' to remove locks (type 'svn help cleanup' for details)
---------------------------------------------

To subscribe to this information via syndicated feeds:
- RSS: http://vmgump.apache.org/gump/public/ivy/rss.xml
- Atom: http://vmgump.apache.org/gump/public/ivy/atom.xml

============================== Gump Tracking Only ===
Produced by Gump version 2.3.
Gump Run 05000005082009, vmgump:vmgump-public:05000005082009
Gump E-mail Identifier (unique within run) #38.

*********************************************************** G U M P
[GUMP@vmgump]: Module ggf-cddlm success, but with warnings.
To whom it may engage...
        
This is an automated request, but not an unsolicited one. For 
more information please visit http://gump.apache.org/nagged.html, 
and/or contact the folk at general@gump.apache.org.

Module ggf-cddlm contains errors.
The current state of this module is 'Success'.

Full details are available at:
    http://vmgump.apache.org/gump/public/ggf-cddlm/index.html

That said, some information snippets are provided here.

The following annotations (debug/informational/warning/error messages) were provided:
 -ERROR- *** Failed to update from source control.Stale contents ***



The following work was performed:
http://vmgump.apache.org/gump/public/ggf-cddlm/gump_work/update_ggf-cddlm.html
Work Name: update_ggf-cddlm (Type: Update)
Work ended in a state of : Failed
Elapsed: 4 secs
Command Line: cvs -q -z3 -d :pserver:anonymous@deployment.cvs.sourceforge.net:/cvsroot/deployment/. update -P -d 
[Working Directory: /srv/gump/public/workspace/cvs/ggf-cddlm]
---------------------------------------------
Fatal error, aborting.
anoncvs_deployment: no such system user
---------------------------------------------

To subscribe to this information via syndicated feeds:
- RSS: http://vmgump.apache.org/gump/public/ggf-cddlm/rss.xml
- Atom: http://vmgump.apache.org/gump/public/ggf-cddlm/atom.xml

============================== Gump Tracking Only ===
Produced by Gump version 2.3.
Gump Run 05000005082009, vmgump:vmgump-public:05000005082009
Gump E-mail Identifier (unique within run) #39.

*********************************************************** G U M P
[GUMP@vmgump]: Project commons-jci (in module apache-commons) failed
To whom it may engage...
        
This is an automated request, but not an unsolicited one. For 
more information please visit http://gump.apache.org/nagged.html, 
and/or contact the folk at general@gump.apache.org.

Project commons-jci has an issue affecting its community integration.
This issue affects 3 projects,
 and has been outstanding for 1123 runs.
The current state of this project is 'Failed', with reason 'Build Failed'.
For reference only, the following projects are affected by this:
    - commons-javaflow :  Commons Javaflow
    - commons-jci :  Commons JCI
    - commons-jci-test :  Apache Commons


Full details are available at:
    http://vmgump.apache.org/gump/public/apache-commons/commons-jci/index.html

That said, some information snippets are provided here.

The following annotations (debug/informational/warning/error messages) were provided:
 -DEBUG- Sole output [commons-jci-05082009.jar] identifier set to project name
 -DEBUG- (Gump generated) Maven2 Settings in: /srv/gump/public/workspace/apache-commons/jci/gump_mvn_settings.xml
 -INFO- Failed with reason build failed
 -DEBUG- Maven POM in: /srv/gump/public/workspace/apache-commons/jci/pom.xml
 -INFO- Failed to extract fallback artifacts from Gump Repository



The following work was performed:
http://vmgump.apache.org/gump/public/apache-commons/commons-jci/gump_work/build_apache-commons_commons-jci.html
Work Name: build_apache-commons_commons-jci (Type: Build)
Work ended in a state of : Failed
Elapsed: 50 secs
Command Line: mvn --batch-mode -Dmaven.test.skip.exec=true --settings /srv/gump/public/workspace/apache-commons/jci/gump_mvn_settings.xml package 
[Working Directory: /srv/gump/public/workspace/apache-commons/jci]
CLASSPATH: /usr/lib/jvm/java-6-sun/lib/tools.jar:/srv/gump/public/workspace/jakarta-bcel/target/bcel-5.3-SNAPSHOT.jar:/srv/gump/public/workspace/apache-commons/collections/build/commons-collections-05082009.jar:/srv/gump/public/workspace/apache-commons/io/target/commons-io-05082009.jar:/srv/gump/public/workspace/apache-commons/lang/target/commons-lang-3.0-SNAPSHOT.jar:/srv/gump/public/workspace/apache-commons/logging/target/commons-logging-05082009.jar:/srv/gump/public/workspace/apache-commons/logging/target/commons-logging-api-05082009.jar:/srv/gump/packages/eclipse/plugins/org.eclipse.jdt.core_3.4.2/jdtcore.jar:/srv/gump/packages/jarjar/jarjar-0.6.jar:/srv/gump/public/workspace/asm/output/dist/lib/asm-analysis-05082009.jar:/srv/gump/public/workspace/asm/output/dist/lib/asm-util-05082009.jar:/srv/gump/public/workspace/asm/output/dist/lib/asm-xml-05082009.jar:/srv/gump/public/workspace/asm/output/dist/lib/asm-commons-05082009.jar:/srv/gump/public/workspace/asm/output/dist/lib
 /asm-05082009.jar:/srv/gump/public/workspace/asm/output/dist/lib/asm-tree-05082009.jar:/srv/gump/packages/antlr/antlr-3.1.3.jar:/srv/gump/packages/groovy-1.0-jsr-03/groovy-1.0-jsr-03.jar:/srv/gump/packages/maven-cobertura-plugin/maven-cobertura-plugin-1.1.jar
---------------------------------------------
1K downloaded
Downloading: http://localhost:8192/maven2/asm/asm-analysis/2.2.1/asm-analysis-2.2.1.pom
1K downloaded
Downloading: http://localhost:8192/maven2/asm/asm-attrs/2.2.1/asm-attrs-2.2.1.pom
1K downloaded
Downloading: http://localhost:8192/maven2/commons-io/commons-io/1.1/commons-io-1.1.pom
5K downloaded
Downloading: http://localhost:8192/maven2/asm/asm/2.2/asm-2.2.pom
807b downloaded
Downloading: http://localhost:8192/maven2/org/vafer/dependency/0.2/dependency-0.2.jar
17K downloaded
Downloading: http://localhost:8192/maven2/asm/asm-commons/2.2.1/asm-commons-2.2.1.jar
32K downloaded
Downloading: http://localhost:8192/maven2/asm/asm/2.2/asm-2.2.jar
42K downloaded
Downloading: http://localhost:8192/maven2/asm/asm-util/2.2.1/asm-util-2.2.1.jar
34K downloaded
Downloading: http://localhost:8192/maven2/asm/asm-analysis/2.2.1/asm-analysis-2.2.1.jar
17K downloaded
Downloading: http://localhost:8192/maven2/asm/asm-attrs/2.2.1/asm-attrs-2.2.1.jar
6K downloaded
[INFO] [antrun:run {execution: javadoc.resources}]
[INFO] Executing tasks
[INFO] Executed tasks
[INFO] [resources:resources]
[WARNING] Using platform encoding (UTF-8 actually) to copy filtered resources, i.e. build is platform dependent!
[INFO] Copying 0 resource to META-INF
[INFO] [compiler:compile]
[INFO] Compiling 6 source files to /srv/gump/public/workspace/apache-commons/jci/compilers/javac/target/classes
[INFO] ------------------------------------------------------------------------
[ERROR] BUILD FAILURE
[INFO] ------------------------------------------------------------------------
[INFO] Compilation failure

/srv/gump/public/workspace/apache-commons/jci/compilers/javac/src/main/java/org/apache/commons/jci/compilers/JavacClassLoader.java:[108,46] cannot find symbol
symbol  : constructor ClassWriter(boolean,boolean)
location: class org.objectweb.asm.ClassWriter

/srv/gump/public/workspace/apache-commons/jci/compilers/javac/src/main/java/org/apache/commons/jci/compilers/JavacClassLoader.java:[109,44] cannot find symbol
symbol  : method accept(org.vafer.dependency.asm.RenamingVisitor,boolean)
location: class org.objectweb.asm.ClassReader


[INFO] ------------------------------------------------------------------------
[INFO] For more information, run Maven with the -e switch
[INFO] ------------------------------------------------------------------------
[INFO] Total time: 48 seconds
[INFO] Finished at: Wed Aug 05 05:33:00 PDT 2009
[INFO] Final Memory: 41M/74M
[INFO] ------------------------------------------------------------------------
---------------------------------------------

To subscribe to this information via syndicated feeds:
- RSS: http://vmgump.apache.org/gump/public/apache-commons/commons-jci/rss.xml
- Atom: http://vmgump.apache.org/gump/public/apache-commons/commons-jci/atom.xml

============================== Gump Tracking Only ===
Produced by Gump version 2.3.
Gump Run 05000005082009, vmgump:vmgump-public:05000005082009
Gump E-mail Identifier (unique within run) #49.

*********************************************************** G U M P
[GUMP@vmgump]: Project httpcomponents-core (in module httpcomponents) failed
To whom it may engage...
        
This is an automated request, but not an unsolicited one. For 
more information please visit http://gump.apache.org/nagged.html, 
and/or contact the folk at general@gump.apache.org.

Project httpcomponents-core has an issue affecting its community integration.
This issue affects 2 projects,
 and has been outstanding for 42 runs.
The current state of this project is 'Failed', with reason 'Build Failed'.
For reference only, the following projects are affected by this:
    - httpcomponents-core :  HttpComponents Core
    - httpcomponents-core-tests :  Unit Tests for HttpComponents Core


Full details are available at:
    http://vmgump.apache.org/gump/public/httpcomponents/httpcomponents-core/index.html

That said, some information snippets are provided here.

The following annotations (debug/informational/warning/error messages) were provided:
 -DEBUG- (Gump generated) Maven2 Settings in: /srv/gump/public/workspace/httpcomponents/httpcore/gump_mvn_settings.xml
 -INFO- Failed with reason build failed
 -DEBUG- Maven POM in: /srv/gump/public/workspace/httpcomponents/httpcore/pom.xml
 -INFO- Project Reports in: /srv/gump/public/workspace/httpcomponents/httpcore/httpcore/target/surefire-reports
 -WARNING- No directory [/srv/gump/public/workspace/httpcomponents/httpcore/httpcore/target/surefire-reports]
 -INFO- Failed to extract fallback artifacts from Gump Repository



The following work was performed:
http://vmgump.apache.org/gump/public/httpcomponents/httpcomponents-core/gump_work/build_httpcomponents_httpcomponents-core.html
Work Name: build_httpcomponents_httpcomponents-core (Type: Build)
Work ended in a state of : Failed
Elapsed: 53 secs
Command Line: mvn --batch-mode -Dmaven.test.skip.exec=true --settings /srv/gump/public/workspace/httpcomponents/httpcore/gump_mvn_settings.xml install 
[Working Directory: /srv/gump/public/workspace/httpcomponents/httpcore]
CLASSPATH: /usr/lib/jvm/java-6-sun/lib/tools.jar:/srv/gump/public/workspace/apache-commons/collections/build/commons-collections-05082009.jar:/srv/gump/public/workspace/apache-commons/lang/target/commons-lang-3.0-SNAPSHOT.jar:/srv/gump/public/workspace/jakarta-oro/jakarta-oro-05082009.jar:/srv/gump/public/workspace/junit/dist/junit-05082009.jar:/srv/gump/public/workspace/velocity-engine/bin/velocity-05082009.jar:/srv/gump/public/workspace/velocity-engine/bin/velocity-05082009-dep.jar
---------------------------------------------
urls[10] = file:/srv/gump/public/workspace/mvnlocalrepo/org/apache/maven/shared/maven-osgi/0.2.0/maven-osgi-0.2.0.jar
[FATAL ERROR] Container realm = plexus.core
urls[0] = file:/opt/maven2/lib/maven-2.0.10-uber.jar
[INFO] ------------------------------------------------------------------------
[ERROR] FATAL ERROR
[INFO] ------------------------------------------------------------------------
[INFO] aQute/lib/reporter/Reporter
aQute.lib.reporter.Reporter
[INFO] ------------------------------------------------------------------------
[INFO] Trace
java.lang.NoClassDefFoundError: aQute/lib/reporter/Reporter
	at org.apache.felix.bundleplugin.BundlePlugin.buildOSGiBundle(BundlePlugin.java:360)
	at org.apache.felix.bundleplugin.BundlePlugin.execute(BundlePlugin.java:273)
	at org.apache.felix.bundleplugin.BundlePlugin.execute(BundlePlugin.java:227)
	at org.apache.felix.bundleplugin.BundlePlugin.execute(BundlePlugin.java:218)
	at org.apache.maven.plugin.DefaultPluginManager.executeMojo(DefaultPluginManager.java:453)
	at org.apache.maven.lifecycle.DefaultLifecycleExecutor.executeGoals(DefaultLifecycleExecutor.java:559)
	at org.apache.maven.lifecycle.DefaultLifecycleExecutor.executeGoalWithLifecycle(DefaultLifecycleExecutor.java:500)
	at org.apache.maven.lifecycle.DefaultLifecycleExecutor.executeGoal(DefaultLifecycleExecutor.java:479)
	at org.apache.maven.lifecycle.DefaultLifecycleExecutor.executeGoalAndHandleFailures(DefaultLifecycleExecutor.java:331)
	at org.apache.maven.lifecycle.DefaultLifecycleExecutor.executeTaskSegments(DefaultLifecycleExecutor.java:292)
	at org.apache.maven.lifecycle.DefaultLifecycleExecutor.execute(DefaultLifecycleExecutor.java:142)
	at org.apache.maven.DefaultMaven.doExecute(DefaultMaven.java:336)
	at org.apache.maven.DefaultMaven.execute(DefaultMaven.java:129)
	at org.apache.maven.cli.MavenCli.main(MavenCli.java:301)
	at sun.reflect.NativeMethodAccessorImpl.invoke0(Native Method)
	at sun.reflect.NativeMethodAccessorImpl.invoke(NativeMethodAccessorImpl.java:39)
	at sun.reflect.DelegatingMethodAccessorImpl.invoke(DelegatingMethodAccessorImpl.java:25)
	at java.lang.reflect.Method.invoke(Method.java:597)
	at org.codehaus.classworlds.Launcher.launchEnhanced(Launcher.java:315)
	at org.codehaus.classworlds.Launcher.launch(Launcher.java:255)
	at org.codehaus.classworlds.Launcher.mainWithExitCode(Launcher.java:430)
	at org.codehaus.classworlds.Launcher.main(Launcher.java:375)
Caused by: java.lang.ClassNotFoundException: aQute.lib.reporter.Reporter
	at java.net.URLClassLoader$1.run(URLClassLoader.java:200)
	at java.security.AccessController.doPrivileged(Native Method)
	at java.net.URLClassLoader.findClass(URLClassLoader.java:188)
	at java.lang.ClassLoader.loadClass(ClassLoader.java:306)
	at org.codehaus.classworlds.RealmClassLoader.loadClassDirect(RealmClassLoader.java:195)
	at org.codehaus.classworlds.DefaultClassRealm.loadClass(DefaultClassRealm.java:255)
	at org.codehaus.classworlds.DefaultClassRealm.loadClass(DefaultClassRealm.java:274)
	at org.codehaus.classworlds.RealmClassLoader.loadClass(RealmClassLoader.java:214)
	at java.lang.ClassLoader.loadClass(ClassLoader.java:251)
	at java.lang.ClassLoader.loadClassInternal(ClassLoader.java:319)
	... 22 more
[INFO] ------------------------------------------------------------------------
[INFO] Total time: 51 seconds
[INFO] Finished at: Wed Aug 05 05:37:29 PDT 2009
[INFO] Final Memory: 40M/77M
[INFO] ------------------------------------------------------------------------
---------------------------------------------

To subscribe to this information via syndicated feeds:
- RSS: http://vmgump.apache.org/gump/public/httpcomponents/httpcomponents-core/rss.xml
- Atom: http://vmgump.apache.org/gump/public/httpcomponents/httpcomponents-core/atom.xml

============================== Gump Tracking Only ===
Produced by Gump version 2.3.
Gump Run 05000005082009, vmgump:vmgump-public:05000005082009
Gump E-mail Identifier (unique within run) #51.

*********************************************************** G U M P
[GUMP@vmgump]: Module poi success, but with warnings.
To whom it may engage...
        
This is an automated request, but not an unsolicited one. For 
more information please visit http://gump.apache.org/nagged.html, 
and/or contact the folk at general@gump.apache.org.

Module poi contains errors.
The current state of this module is 'Success'.

Full details are available at:
    http://vmgump.apache.org/gump/public/poi/index.html

That said, some information snippets are provided here.

The following annotations (debug/informational/warning/error messages) were provided:
 -ERROR- *** Failed to update from source control.Stale contents ***



The following work was performed:
http://vmgump.apache.org/gump/public/poi/gump_work/update_poi.html
Work Name: update_poi (Type: Update)
Work ended in a state of : Failed
Elapsed: 
Command Line: svn --quiet update --non-interactive poi 
[Working Directory: /srv/gump/public/workspace/cvs]
---------------------------------------------
svn: Working copy 'poi' locked
svn: run 'svn cleanup' to remove locks (type 'svn help cleanup' for details)
---------------------------------------------

To subscribe to this information via syndicated feeds:
- RSS: http://vmgump.apache.org/gump/public/poi/rss.xml
- Atom: http://vmgump.apache.org/gump/public/poi/atom.xml

============================== Gump Tracking Only ===
Produced by Gump version 2.3.
Gump Run 05000005082009, vmgump:vmgump-public:05000005082009
Gump E-mail Identifier (unique within run) #52.

*********************************************************** G U M P
[GUMP@vmgump]: Project groovy (in module groovy) failed
To whom it may engage...
        
This is an automated request, but not an unsolicited one. For 
more information please visit http://gump.apache.org/nagged.html, 
and/or contact the folk at general@gump.apache.org.

Project groovy has an issue affecting its community integration.
This issue affects 2 projects,
 and has been outstanding for 8 runs.
The current state of this project is 'Failed', with reason 'Missing Build Outputs'.
For reference only, the following projects are affected by this:
    - authx-example :  Apache Authentication and Authorization Framework
    - groovy :  New agile dynamic language using a Java-like syntax for the ...


Full details are available at:
    http://vmgump.apache.org/gump/public/groovy/groovy/index.html

That said, some information snippets are provided here.

The following annotations (debug/informational/warning/error messages) were provided:
 -DEBUG- Sole output [groovy-1.7-beta-1-SNAPSHOT.jar] identifier set to project name
 -DEBUG- (Gump generated) Maven2 Settings in: /srv/gump/public/workspace/groovy/gump_mvn_settings.xml
 -DEBUG- Maven POM in: /srv/gump/public/workspace/groovy/pom.xml
 -INFO- Failed with reason missing build outputs
 -ERROR- Missing Output: /srv/gump/public/workspace/groovy/target/groovy-1.7-beta-1-SNAPSHOT.jar
 -ERROR- See Directory Listing Work for Missing Outputs
 -INFO- Failed to extract fallback artifacts from Gump Repository



The following work was performed:
http://vmgump.apache.org/gump/public/groovy/groovy/gump_work/build_groovy_groovy.html
Work Name: build_groovy_groovy (Type: Build)
Work ended in a state of : Success
Elapsed: 19 secs
Command Line: mvn --batch-mode --settings /srv/gump/public/workspace/groovy/gump_mvn_settings.xml package 
[Working Directory: /srv/gump/public/workspace/groovy]
CLASSPATH: /usr/lib/jvm/java-6-sun/lib/tools.jar:/srv/gump/public/workspace/ant/dist/lib/ant-jmf.jar:/srv/gump/public/workspace/ant/dist/lib/ant-swing.jar:/srv/gump/public/workspace/ant/dist/lib/ant-apache-resolver.jar:/srv/gump/public/workspace/ant/dist/lib/ant-apache-xalan2.jar:/srv/gump/public/workspace/ant/dist/lib/ant-trax.jar:/srv/gump/public/workspace/ant/dist/lib/ant-junit.jar:/srv/gump/public/workspace/ant/dist/lib/ant-launcher.jar:/srv/gump/public/workspace/ant/dist/lib/ant-nodeps.jar:/srv/gump/public/workspace/ant/dist/lib/ant.jar:/srv/gump/packages/antlr/antlr-3.1.3.jar:/srv/gump/public/workspace/asm/output/dist/lib/asm-analysis-05082009.jar:/srv/gump/public/workspace/asm/output/dist/lib/asm-util-05082009.jar:/srv/gump/public/workspace/asm/output/dist/lib/asm-xml-05082009.jar:/srv/gump/public/workspace/asm/output/dist/lib/asm-commons-05082009.jar:/srv/gump/public/workspace/asm/output/dist/lib/asm-05082009.jar:/srv/gump/public/workspace/asm/output/dist/lib/asm-tree
 -05082009.jar:/srv/gump/packages/axion-1.0-M2/axion-1.0-M2.jar:/srv/gump/packages/cglib/cglib-nodep-2.1_3.jar:/srv/gump/public/workspace/apache-commons/cli/target/commons-cli-05082009.jar:/srv/gump/public/workspace/apache-commons/collections/build/commons-collections-05082009.jar:/srv/gump/public/workspace/httpcomponents/oac.hc3x/dist/commons-httpclient.jar:/srv/gump/public/workspace/apache-commons/logging/target/commons-logging-05082009.jar:/srv/gump/public/workspace/apache-commons/logging/target/commons-logging-api-05082009.jar:/srv/gump/public/workspace/apache-commons/primitives/target/commons-primitives-05082009.jar:/srv/gump/public/workspace/hsqldb/lib/hsqldb.jar:/srv/gump/public/workspace/jakarta-bsf/build/lib/bsf.jar:/srv/gump/public/workspace/jakarta-regexp/build/jakarta-regexp-05082009.jar:/srv/gump/public/workspace/jakarta-servletapi-5/jsr154/dist/lib/servlet-api.jar:/srv/gump/public/workspace/jakarta-servletapi-5/jsr152/dist/lib/jsp-api.jar:/srv/gump/packages/jarj
 ar/jarjar-0.6.jar:/srv/gump/public/workspace/jmock/build/dist/jmock-core-05082009.jar:/srv/gump/public/workspace/jmock/build/dist/jmock-cglib-05082009.jar:/srv/gump/public/workspace/junit/dist/junit-05082009.jar:/srv/gump/packages/mockobjects-0.09/mockobjects-core-0.09.jar:/srv/gump/packages/mockobjects-0.09/mockobjects-jdk1.4-0.09.jar:/srv/gump/packages/mockobjects-0.09/mockobjects-alt-jdk1.4-0.09.jar:/srv/gump/public/workspace/mx4j/dist/lib/mx4j-impl.jar:/srv/gump/public/workspace/mx4j/dist/lib/mx4j-jmx.jar:/srv/gump/public/workspace/mx4j/dist/lib/mx4j.jar:/srv/gump/packages/nekohtml-0.9.5/nekohtml.jar:/srv/gump/packages/openejb-0.9.2/dist/openejb_loader-0.9.2.jar:/srv/gump/packages/openejb-0.9.2/dist/openejb_ejb_tests-0.9.2.jar:/srv/gump/packages/openejb-0.9.2/dist/openejb_server-0.9.2.jar:/srv/gump/packages/openejb-0.9.2/dist/openejb_client-0.9.2.jar:/srv/gump/packages/openejb-0.9.2/dist/openejb-0.9.2.jar:/srv/gump/packages/qdox-1.6.3/qdox-1.6.3.jar:/srv/gump/packages/ra
 deox-1.0-BETA-2/lib/radeox-api.jar:/srv/gump/packages/radeox-1.0-BETA-2/lib/radeox.jar:/srv/gump/public/workspace/xml-commons/java/external/build/xml-apis-ext.jar:/srv/gump/public/workspace/xmlunit/build/java/lib/xmlunit-sumo-05082009.jar:/srv/gump/public/workspace/xmlunit/build/java/lib/xmlunit-legacy-05082009.jar:/srv/gump/public/workspace/xmlunit/build/java/lib/xmlunit-core-05082009.jar:/srv/gump/public/workspace/xpp/build/xpp3-05082009.jar:/srv/gump/public/workspace/xstream/xstream/target/xstream-1.4-SNAPSHOT.jar
---------------------------------------------
32K downloaded
Downloading: http://localhost:8192/maven2/asm/asm-tree/3.2/asm-tree-3.2.jar
21K downloaded
Downloading: http://localhost:8192/maven2/asm/asm-util/3.2/asm-util-3.2.jar
34K downloaded
Downloading: http://localhost:8192/maven2/asm/asm-analysis/3.2/asm-analysis-3.2.jar
17K downloaded
Downloading: http://localhost:8192/maven2/bsf/bsf/2.4.0/bsf-2.4.0.jar
103K downloaded
Downloading: http://localhost:8192/maven2/org/livetribe/livetribe-jsr223/2.0.4/livetribe-jsr223-2.0.4.jar
14K downloaded
Downloading: http://localhost:8192/maven2/com/thoughtworks/xstream/xstream/1.3.1/xstream-1.3.1.jar
421K downloaded
Downloading: http://localhost:8192/maven2/jline/jline/0.9.94/jline-0.9.94.jar
85K downloaded
Downloading: http://localhost:8192/maven2/org/apache/ivy/ivy/2.1.0-rc2/ivy-2.1.0-rc2.jar
889K downloaded
[INFO] [compiler:compile]
[INFO] Nothing to compile - all classes are up to date
[INFO] [resources:testResources]
[WARNING] Using platform encoding (UTF-8 actually) to copy filtered resources, i.e. build is platform dependent!
[INFO] skip non existing resourceDirectory /srv/gump/public/workspace/groovy/src/test/resources
Downloading: http://localhost:8192/maven2/org/apache/ant/ant-junit/1.7.1/ant-junit-1.7.1.jar
99K downloaded
Downloading: http://localhost:8192/maven2/jmock/jmock-cglib/1.2.0/jmock-cglib-1.2.0.jar
6K downloaded
Downloading: http://localhost:8192/maven2/hsqldb/hsqldb/1.8.0.7/hsqldb-1.8.0.7.jar
729K downloaded
[INFO] [compiler:testCompile]
[INFO] Not compiling test sources
Downloading: http://localhost:8192/maven2/org/apache/maven/surefire/surefire-booter/2.3/surefire-booter-2.3.pom
1K downloaded
Downloading: http://localhost:8192/maven2/org/apache/maven/surefire/surefire-api/2.3/surefire-api-2.3.pom
887b downloaded
Downloading: http://localhost:8192/maven2/org/apache/maven/surefire/surefire-booter/2.3/surefire-booter-2.3.jar
28K downloaded
Downloading: http://localhost:8192/maven2/org/apache/maven/surefire/surefire-api/2.3/surefire-api-2.3.jar
49K downloaded
[INFO] [surefire:test]
[INFO] Tests are skipped.
[INFO] [jar:jar]
[WARNING] JAR will be empty - no content was marked for inclusion!
[INFO] Building jar: /srv/gump/public/workspace/groovy/target/groovy-1.7-beta-2-SNAPSHOT.jar
[INFO] ------------------------------------------------------------------------
[INFO] BUILD SUCCESSFUL
[INFO] ------------------------------------------------------------------------
[INFO] Total time: 18 seconds
[INFO] Finished at: Wed Aug 05 05:53:40 PDT 2009
[INFO] Final Memory: 10M/19M
[INFO] ------------------------------------------------------------------------
---------------------------------------------

To subscribe to this information via syndicated feeds:
- RSS: http://vmgump.apache.org/gump/public/groovy/groovy/rss.xml
- Atom: http://vmgump.apache.org/gump/public/groovy/groovy/atom.xml

============================== Gump Tracking Only ===
Produced by Gump version 2.3.
Gump Run 05000005082009, vmgump:vmgump-public:05000005082009
Gump E-mail Identifier (unique within run) #53.

*********************************************************** G U M P
[GUMP@vmgump]: Project httpcomponents-client (in module httpcomponents) failed
To whom it may engage...
        
This is an automated request, but not an unsolicited one. For 
more information please visit http://gump.apache.org/nagged.html, 
and/or contact the folk at general@gump.apache.org.

Project httpcomponents-client has an issue affecting its community integration.
This issue affects 1 projects,
 and has been outstanding for 80 runs.
The current state of this project is 'Failed', with reason 'Build Failed'.
For reference only, the following projects are affected by this:
    - httpcomponents-client :  HttpComponents Client


Full details are available at:
    http://vmgump.apache.org/gump/public/httpcomponents/httpcomponents-client/index.html

That said, some information snippets are provided here.

The following annotations (debug/informational/warning/error messages) were provided:
 -INFO- Optional dependency httpcomponents-core failed with reason build failed
 -DEBUG- (Gump generated) Maven2 Settings in: /srv/gump/public/workspace/httpcomponents/httpclient/gump_mvn_settings.xml
 -INFO- Failed with reason build failed
 -DEBUG- Maven POM in: /srv/gump/public/workspace/httpcomponents/httpclient/pom.xml
 -INFO- Project Reports in: /srv/gump/public/workspace/httpcomponents/httpclient/target/surefire-reports
 -WARNING- No directory [/srv/gump/public/workspace/httpcomponents/httpclient/target/surefire-reports]
 -INFO- Failed to extract fallback artifacts from Gump Repository



The following work was performed:
http://vmgump.apache.org/gump/public/httpcomponents/httpcomponents-client/gump_work/build_httpcomponents_httpcomponents-client.html
Work Name: build_httpcomponents_httpcomponents-client (Type: Build)
Work ended in a state of : Failed
Elapsed: 37 secs
Command Line: mvn --batch-mode -Dmaven.test.skip.exec=true --settings /srv/gump/public/workspace/httpcomponents/httpclient/gump_mvn_settings.xml package 
[Working Directory: /srv/gump/public/workspace/httpcomponents/httpclient]
CLASSPATH: /usr/lib/jvm/java-6-sun/lib/tools.jar:/srv/gump/public/workspace/httpcomponents/httpcore/httpcore/target/httpcore-4.1-SNAPSHOT.jar:/srv/gump/public/workspace/apache-commons/logging/target/commons-logging-05082009.jar:/srv/gump/public/workspace/apache-commons/logging/target/commons-logging-api-05082009.jar:/srv/gump/public/workspace/apache-commons/codec/dist/commons-codec-05082009.jar
---------------------------------------------
urls[10] = file:/srv/gump/public/workspace/mvnlocalrepo/org/apache/maven/shared/maven-osgi/0.2.0/maven-osgi-0.2.0.jar
[FATAL ERROR] Container realm = plexus.core
urls[0] = file:/opt/maven2/lib/maven-2.0.10-uber.jar
[INFO] ------------------------------------------------------------------------
[ERROR] FATAL ERROR
[INFO] ------------------------------------------------------------------------
[INFO] aQute/lib/reporter/Reporter
aQute.lib.reporter.Reporter
[INFO] ------------------------------------------------------------------------
[INFO] Trace
java.lang.NoClassDefFoundError: aQute/lib/reporter/Reporter
	at org.apache.felix.bundleplugin.BundlePlugin.buildOSGiBundle(BundlePlugin.java:360)
	at org.apache.felix.bundleplugin.BundlePlugin.execute(BundlePlugin.java:273)
	at org.apache.felix.bundleplugin.BundlePlugin.execute(BundlePlugin.java:227)
	at org.apache.felix.bundleplugin.BundlePlugin.execute(BundlePlugin.java:218)
	at org.apache.maven.plugin.DefaultPluginManager.executeMojo(DefaultPluginManager.java:453)
	at org.apache.maven.lifecycle.DefaultLifecycleExecutor.executeGoals(DefaultLifecycleExecutor.java:559)
	at org.apache.maven.lifecycle.DefaultLifecycleExecutor.executeGoalWithLifecycle(DefaultLifecycleExecutor.java:500)
	at org.apache.maven.lifecycle.DefaultLifecycleExecutor.executeGoal(DefaultLifecycleExecutor.java:479)
	at org.apache.maven.lifecycle.DefaultLifecycleExecutor.executeGoalAndHandleFailures(DefaultLifecycleExecutor.java:331)
	at org.apache.maven.lifecycle.DefaultLifecycleExecutor.executeTaskSegments(DefaultLifecycleExecutor.java:292)
	at org.apache.maven.lifecycle.DefaultLifecycleExecutor.execute(DefaultLifecycleExecutor.java:142)
	at org.apache.maven.DefaultMaven.doExecute(DefaultMaven.java:336)
	at org.apache.maven.DefaultMaven.execute(DefaultMaven.java:129)
	at org.apache.maven.cli.MavenCli.main(MavenCli.java:301)
	at sun.reflect.NativeMethodAccessorImpl.invoke0(Native Method)
	at sun.reflect.NativeMethodAccessorImpl.invoke(NativeMethodAccessorImpl.java:39)
	at sun.reflect.DelegatingMethodAccessorImpl.invoke(DelegatingMethodAccessorImpl.java:25)
	at java.lang.reflect.Method.invoke(Method.java:597)
	at org.codehaus.classworlds.Launcher.launchEnhanced(Launcher.java:315)
	at org.codehaus.classworlds.Launcher.launch(Launcher.java:255)
	at org.codehaus.classworlds.Launcher.mainWithExitCode(Launcher.java:430)
	at org.codehaus.classworlds.Launcher.main(Launcher.java:375)
Caused by: java.lang.ClassNotFoundException: aQute.lib.reporter.Reporter
	at java.net.URLClassLoader$1.run(URLClassLoader.java:200)
	at java.security.AccessController.doPrivileged(Native Method)
	at java.net.URLClassLoader.findClass(URLClassLoader.java:188)
	at java.lang.ClassLoader.loadClass(ClassLoader.java:306)
	at org.codehaus.classworlds.RealmClassLoader.loadClassDirect(RealmClassLoader.java:195)
	at org.codehaus.classworlds.DefaultClassRealm.loadClass(DefaultClassRealm.java:255)
	at org.codehaus.classworlds.DefaultClassRealm.loadClass(DefaultClassRealm.java:274)
	at org.codehaus.classworlds.RealmClassLoader.loadClass(RealmClassLoader.java:214)
	at java.lang.ClassLoader.loadClass(ClassLoader.java:251)
	at java.lang.ClassLoader.loadClassInternal(ClassLoader.java:319)
	... 22 more
[INFO] ------------------------------------------------------------------------
[INFO] Total time: 36 seconds
[INFO] Finished at: Wed Aug 05 06:01:10 PDT 2009
[INFO] Final Memory: 42M/80M
[INFO] ------------------------------------------------------------------------
---------------------------------------------

To subscribe to this information via syndicated feeds:
- RSS: http://vmgump.apache.org/gump/public/httpcomponents/httpcomponents-client/rss.xml
- Atom: http://vmgump.apache.org/gump/public/httpcomponents/httpcomponents-client/atom.xml

============================== Gump Tracking Only ===
Produced by Gump version 2.3.
Gump Run 05000005082009, vmgump:vmgump-public:05000005082009
Gump E-mail Identifier (unique within run) #54.

*********************************************************** G U M P
[GUMP@vmgump]: Project maven (in module maven) failed
To whom it may engage...
        
This is an automated request, but not an unsolicited one. For 
more information please visit http://gump.apache.org/nagged.html, 
and/or contact the folk at general@gump.apache.org.

Project maven has an issue affecting its community integration.
This issue affects 1 projects.
The current state of this project is 'Failed', with reason 'Build Failed'.
For reference only, the following projects are affected by this:
    - maven :  Project Management Tools


Full details are available at:
    http://vmgump.apache.org/gump/public/maven/maven/index.html

That said, some information snippets are provided here.

The following annotations (debug/informational/warning/error messages) were provided:
 -DEBUG- Sole output [maven-05082009.jar] identifier set to project name
 -INFO- Made directory [/srv/gump/public/workspace/maven/target/classes]
 -INFO- Made directory [/srv/gump/public/workspace/maven/target/test-classes]
 -DEBUG- (Gump generated) Maven Properties in: /srv/gump/public/workspace/maven/build.properties
 -INFO- Failed with reason build failed
 -DEBUG- Maven POM in: /srv/gump/public/workspace/maven/project.xml
 -DEBUG- Maven project properties in: /srv/gump/public/workspace/maven/project.properties
 -INFO- Failed to extract fallback artifacts from Gump Repository



The following work was performed:
http://vmgump.apache.org/gump/public/maven/maven/gump_work/build_maven_maven.html
Work Name: build_maven_maven (Type: Build)
Work ended in a state of : Failed
Elapsed: 3 secs
Command Line: maven --offline jar 
[Working Directory: /srv/gump/public/workspace/maven]
CLASSPATH: /usr/lib/jvm/java-6-sun/lib/tools.jar:/srv/gump/public/workspace/maven/target/classes:/srv/gump/public/workspace/maven/target/test-classes:/srv/gump/public/workspace/ant/dist/lib/ant-jmf.jar:/srv/gump/public/workspace/ant/dist/lib/ant-swing.jar:/srv/gump/public/workspace/ant/dist/lib/ant-apache-resolver.jar:/srv/gump/public/workspace/ant/dist/lib/ant-apache-xalan2.jar:/srv/gump/public/workspace/ant/dist/lib/ant-trax.jar:/srv/gump/public/workspace/ant/dist/lib/ant-junit.jar:/srv/gump/public/workspace/ant/dist/lib/ant-launcher.jar:/srv/gump/public/workspace/ant/dist/lib/ant-nodeps.jar:/srv/gump/public/workspace/ant/dist/lib/ant.jar:/srv/gump/public/workspace/apache-commons/beanutils/dist/commons-beanutils-05082009.jar:/srv/gump/public/workspace/apache-commons/cli/target/commons-cli-05082009.jar:/srv/gump/public/workspace/apache-commons/collections/build/commons-collections-05082009.jar:/srv/gump/public/workspace/apache-commons/digester/dist/commons-digester.jar:/srv/
 gump/public/workspace/commons-dormant/graph2/target/commons-graph-05082009.jar:/srv/gump/public/workspace/httpcomponents/oac.hc3x/dist/commons-httpclient.jar:/srv/gump/public/workspace/apache-commons/io/target/commons-io-05082009.jar:/srv/gump/public/workspace/commons-jelly/target/commons-jelly-05082009.jar:/srv/gump/public/workspace/commons-jelly/jelly-tags/ant/target/commons-jelly-tags-ant-05082009.jar:/srv/gump/public/workspace/commons-jelly/jelly-tags/define/target/commons-jelly-tags-define-05082009.jar:/srv/gump/public/workspace/commons-jelly/jelly-tags/util/target/commons-jelly-tags-util-05082009.jar:/srv/gump/public/workspace/commons-jelly/jelly-tags/xml/target/commons-jelly-tags-xml-05082009.jar:/srv/gump/public/workspace/apache-commons/jexl/dist/commons-jexl-05082009.jar:/srv/gump/public/workspace/apache-commons/lang/target/commons-lang-3.0-SNAPSHOT.jar:/srv/gump/public/workspace/apache-commons/logging/target/commons-logging-05082009.jar:/srv/gump/public/workspace/a
 pache-commons/logging/target/commons-logging-api-05082009.jar:/srv/gump/public/workspace/dom4j/build/dom4j.jar:/srv/gump/public/workspace/logging-log4j-12/dist/lib/log4j-05082009.jar:/srv/gump/public/workspace/xml-commons/java/external/build/xml-apis-ext.jar:/srv/gump/public/workspace/xml-commons/java/build/which.jar:/srv/gump/public/workspace/xml-commons/java/build/resolver.jar:/srv/gump/public/workspace/xpp/build/xpp3-05082009.jar
---------------------------------------------
 __  __
|  \/  |__ _Apache__ ___
| |\/| / _` \ V / -_) ' \  ~ intelligent projects ~
|_|  |_\__,_|\_/\___|_||_|  v. 1.0.2

The build cannot continue because of the following unsatisfied dependencies:

jaxen-1.1-beta-9.jar
commons-codec-1.2.jar (try downloading from http://commons.apache.org/codec/)
xercesImpl-2.8.0.jar (try downloading from http://xerces.apache.org/xerces2-j/)
plexus-utils-1.0.5.jar
maven-model-3.0.2.jar
stax-1.2.0.jar
stax-api-1.0.1.jar
stax-utils-20060502.jar
wagon-provider-api-1.0-beta-2.jar
wagon-http-1.0-beta-2.jar
wagon-file-1.0-beta-2.jar
wagon-ssh-common-1.0-beta-2.jar
wagon-ssh-1.0-beta-2.jar
jsch-0.1.27.jar

Total time: 2 seconds
Finished at: Wed Aug 05 06:04:39 PDT 2009

---------------------------------------------

To subscribe to this information via syndicated feeds:
- RSS: http://vmgump.apache.org/gump/public/maven/maven/rss.xml
- Atom: http://vmgump.apache.org/gump/public/maven/maven/atom.xml

============================== Gump Tracking Only ===
Produced by Gump version 2.3.
Gump Run 05000005082009, vmgump:vmgump-public:05000005082009
Gump E-mail Identifier (unique within run) #55.

*********************************************************** G U M P
[GUMP@vmgump]: Project rat-test (in module rat) failed
To whom it may engage...
        
This is an automated request, but not an unsolicited one. For 
more information please visit http://gump.apache.org/nagged.html, 
and/or contact the folk at general@gump.apache.org.

Project rat-test has an issue affecting its community integration.
This issue affects 1 projects.
The current state of this project is 'Failed', with reason 'Build Failed'.
For reference only, the following projects are affected by this:
    - rat-test :  Release Audit Tool


Full details are available at:
    http://vmgump.apache.org/gump/public/rat/rat-test/index.html

That said, some information snippets are provided here.

The following annotations (debug/informational/warning/error messages) were provided:
 -WARNING- Overriding Maven2 settings: [/srv/gump/public/workspace/rat/gump_mvn_settings.xml]
 -DEBUG- (Gump generated) Maven2 Settings in: /srv/gump/public/workspace/rat/gump_mvn_settings.xml
 -INFO- Failed with reason build failed
 -DEBUG- Maven POM in: /srv/gump/public/workspace/rat/pom.xml



The following work was performed:
http://vmgump.apache.org/gump/public/rat/rat-test/gump_work/build_rat_rat-test.html
Work Name: build_rat_rat-test (Type: Build)
Work ended in a state of : Failed
Elapsed: 1 min 49 secs
Command Line: mvn --batch-mode --settings /srv/gump/public/workspace/rat/gump_mvn_settings.xml package 
[Working Directory: /srv/gump/public/workspace/rat]
CLASSPATH: /usr/lib/jvm/java-6-sun/lib/tools.jar:/srv/gump/public/workspace/rat/apache-rat-tasks/target/apache-rat-tasks-0.7-SNAPSHOT.jar:/srv/gump/public/workspace/rat/apache-rat-core/target/apache-rat-core-0.7-SNAPSHOT.jar:/srv/gump/public/workspace/rat/apache-rat-plugin/target/apache-rat-plugin-0.7-SNAPSHOT.jar
---------------------------------------------
[INFO] Using 2 extractors.
[INFO] Applying extractor for language: java
[INFO] Extractor for language: java found 2 mojo descriptors.
[INFO] Applying extractor for language: bsh
[INFO] Extractor for language: bsh found 0 mojo descriptors.
[INFO] [resources:resources]
[INFO] Using 'UTF-8' encoding to copy filtered resources.
[INFO] Copying 1 resource
[INFO] Copying 1 resource
[INFO] Copying 2 resources to META-INF
[INFO] [compiler:compile]
[INFO] Nothing to compile - all classes are up to date
[INFO] [resources:testResources]
[INFO] Using 'UTF-8' encoding to copy filtered resources.
[INFO] skip non existing resourceDirectory /srv/gump/public/workspace/rat/apache-rat-plugin/src/test/resources
[INFO] Copying 0 resource
Downloading: http://localhost:8192/maven2/junit/junit/3.8.2/junit-3.8.2.jar
229K downloaded
[INFO] [compiler:testCompile]
[INFO] Nothing to compile - all classes are up to date
[INFO] [surefire:test]
[INFO] Surefire report directory: /srv/gump/public/workspace/rat/apache-rat-plugin/target/surefire-reports

-------------------------------------------------------
 T E S T S
-------------------------------------------------------
Running org.apache.rat.mp.RatCheckMojoTest
Tests run: 2, Failures: 0, Errors: 2, Skipped: 0, Time elapsed: 0.107 sec <<< FAILURE!

Results :

Tests in error: 
  testIt1(org.apache.rat.mp.RatCheckMojoTest)
  testIt2(org.apache.rat.mp.RatCheckMojoTest)

Tests run: 2, Failures: 0, Errors: 2, Skipped: 0

[INFO] ------------------------------------------------------------------------
[ERROR] BUILD FAILURE
[INFO] ------------------------------------------------------------------------
[INFO] There are test failures.

Please refer to /srv/gump/public/workspace/rat/apache-rat-plugin/target/surefire-reports for the individual test results.
[INFO] ------------------------------------------------------------------------
[INFO] For more information, run Maven with the -e switch
[INFO] ------------------------------------------------------------------------
[INFO] Total time: 1 minute 47 seconds
[INFO] Finished at: Wed Aug 05 06:08:27 PDT 2009
[INFO] Final Memory: 18M/34M
[INFO] ------------------------------------------------------------------------
---------------------------------------------

To subscribe to this information via syndicated feeds:
- RSS: http://vmgump.apache.org/gump/public/rat/rat-test/rss.xml
- Atom: http://vmgump.apache.org/gump/public/rat/rat-test/atom.xml

============================== Gump Tracking Only ===
Produced by Gump version 2.3.
Gump Run 05000005082009, vmgump:vmgump-public:05000005082009
Gump E-mail Identifier (unique within run) #56.

*********************************************************** G U M P
[GUMP@vmgump]: Project maven-bootstrap (in module maven) failed
To whom it may engage...
        
This is an automated request, but not an unsolicited one. For 
more information please visit http://gump.apache.org/nagged.html, 
and/or contact the folk at general@gump.apache.org.

Project maven-bootstrap has an issue affecting its community integration.
This issue affects 1 projects.
The current state of this project is 'Failed', with reason 'Build Failed'.
For reference only, the following projects are affected by this:
    - maven-bootstrap :  Project Management Tools


Full details are available at:
    http://vmgump.apache.org/gump/public/maven/maven-bootstrap/index.html

That said, some information snippets are provided here.

The following annotations (debug/informational/warning/error messages) were provided:
 -DEBUG- Dependency on ant exists, no need to add for property maven.jar.ant.
 -DEBUG- Dependency on xml-commons-which exists, no need to add for property maven.jar.which.
 -INFO- Failed with reason build failed



The following work was performed:
http://vmgump.apache.org/gump/public/maven/maven-bootstrap/gump_work/build_maven_maven-bootstrap.html
Work Name: build_maven_maven-bootstrap (Type: Build)
Work ended in a state of : Failed
Elapsed: 8 secs
Command Line: /usr/lib/jvm/java-6-sun/bin/java -Djava.awt.headless=true -Xbootclasspath/p:/srv/gump/public/workspace/xml-commons/java/external/build/xml-apis.jar:/srv/gump/public/workspace/xml-xerces2/build/xercesImpl.jar org.apache.tools.ant.Main -Dgump.merge=/srv/gump/public/gump/work/merge.xml -Dbuild.sysclasspath=only -Dmaven.jar.ant=/srv/gump/public/workspace/ant/dist/lib/ant.jar -Dmaven.bootstrap.dir=/srv/gump/public/workspace/maven/bootstrap -Dmaven.repo.local=/srv/gump/public/workspace/maven/bootstrap/maven.local.repo -Dmaven.bootstrap.classes=/srv/gump/public/workspace/maven/bootstrap/bootstrap-classes -Dmaven.jar.commons-logging=/srv/gump/public/workspace/apache-commons/logging/target/commons-logging-05082009.jar -Dmaven.home=/srv/gump/public/workspace/maven/bootstrap/maven.home -Dmaven.home.local=/srv/gump/public/workspace/maven/bootstrap/maven.home -Dmaven.jar.commons-cli=/srv/gump/public/workspace/apache-commons/cli/target/commons-cli-05082009.jar -Dmaven.jar.ove
 rride=true -Dmaven.jar.commons-lang=/srv/gump/public/workspace/apache-commons/lang/target/commons-lang-3.0-SNAPSHOT.jar -Dmaven.jar.commons-httpclient=/srv/gump/public/workspace/httpcomponents/oac.hc3x/dist/commons-httpclient.jar -Dmaven.bootstrap.online=-o -Dmaven.bootstrap.phase1.classes=/srv/gump/public/workspace/maven/bootstrap/phase1-classes -Dmaven.jar.velocity=/srv/gump/public/workspace/velocity-engine/bin/velocity-05082009.jar -Dmaven.jar.which=/srv/gump/public/workspace/xml-commons/java/build/which.jar -Dmaven.jar.dom4j=/srv/gump/public/workspace/dom4j/build/dom4j.jar -f build-bootstrap.xml 
[Working Directory: /srv/gump/public/workspace/maven]
CLASSPATH: /usr/lib/jvm/java-6-sun/lib/tools.jar:/srv/gump/public/workspace/maven/bootstrap/bootstrap-classes:/srv/gump/public/workspace/ant/dist/lib/ant-jmf.jar:/srv/gump/public/workspace/ant/dist/lib/ant-swing.jar:/srv/gump/public/workspace/ant/dist/lib/ant-apache-resolver.jar:/srv/gump/public/workspace/ant/dist/lib/ant-apache-xalan2.jar:/srv/gump/public/workspace/ant/dist/lib/ant-trax.jar:/srv/gump/public/workspace/ant/dist/lib/ant-junit.jar:/srv/gump/public/workspace/ant/dist/lib/ant-launcher.jar:/srv/gump/public/workspace/ant/dist/lib/ant-nodeps.jar:/srv/gump/public/workspace/ant/dist/lib/ant.jar:/srv/gump/packages/junit3.8.1/junit.jar:/srv/gump/public/workspace/xml-commons/java/build/resolver.jar:/srv/gump/public/workspace/xml-commons/java/external/build/xml-apis-ext.jar:/srv/gump/public/workspace/apache-commons/betwixt/target/commons-betwixt-05082009.jar:/srv/gump/public/workspace/apache-commons/beanutils/dist/commons-beanutils-05082009.jar:/srv/gump/public/workspace/a
 pache-commons/collections/build/commons-collections-05082009.jar:/srv/gump/public/workspace/apache-commons/digester/dist/commons-digester.jar:/srv/gump/public/workspace/apache-commons/jexl/dist/commons-jexl-05082009.jar:/srv/gump/public/workspace/commons-jelly/target/commons-jelly-05082009.jar:/srv/gump/public/workspace/commons-jelly/jelly-tags/ant/target/commons-jelly-tags-ant-05082009.jar:/srv/gump/public/workspace/commons-jelly/jelly-tags/define/target/commons-jelly-tags-define-05082009.jar:/srv/gump/public/workspace/commons-jelly/jelly-tags/util/target/commons-jelly-tags-util-05082009.jar:/srv/gump/public/workspace/commons-jelly/jelly-tags/xml/target/commons-jelly-tags-xml-05082009.jar:/srv/gump/public/workspace/commons-dormant/graph2/target/commons-graph-05082009.jar:/srv/gump/public/workspace/apache-commons/io/target/commons-io-05082009.jar:/srv/gump/packages/jdepend-2.6/lib/jdepend.jar:/srv/gump/public/workspace/logging-log4j-12/dist/lib/log4j-05082009.jar:/srv/gump/p
 ublic/workspace/xml-commons/java/build/which.jar:/srv/gump/public/workspace/xpp/build/xpp3_xpath-05082009.jar:/srv/gump/public/workspace/xpp/build/xpp3-05082009.jar:/srv/gump/public/workspace/xpp/build/xpp3_min-05082009.jar:/srv/gump/public/workspace/apache-commons/cli/target/commons-cli-05082009.jar:/srv/gump/public/workspace/apache-commons/lang/target/commons-lang-3.0-SNAPSHOT.jar:/srv/gump/public/workspace/apache-commons/logging/target/commons-logging-05082009.jar:/srv/gump/public/workspace/httpcomponents/oac.hc3x/dist/commons-httpclient.jar:/srv/gump/public/workspace/dom4j/build/dom4j.jar:/srv/gump/public/workspace/velocity-engine/bin/velocity-05082009.jar
---------------------------------------------
    [javac] symbol  : class TransferEvent
    [javac] location: class org.apache.maven.util.ConsoleDownloadMeter
    [javac]     public void transferStarted( TransferEvent transferEvent )
    [javac]                                  ^
    [javac] /srv/gump/public/workspace/maven/src/java/org/apache/maven/util/ConsoleDownloadMeter.java:50: cannot find symbol
    [javac] symbol  : class TransferEvent
    [javac] location: class org.apache.maven.util.ConsoleDownloadMeter
    [javac]     public void transferProgress( TransferEvent transferEvent, byte[] buffer, int length )
    [javac]                                   ^
    [javac] /srv/gump/public/workspace/maven/src/java/org/apache/maven/util/ConsoleDownloadMeter.java:57: cannot find symbol
    [javac] symbol  : class TransferEvent
    [javac] location: class org.apache.maven.util.ConsoleDownloadMeter
    [javac]     public void transferCompleted( TransferEvent transferEvent )
    [javac]                                    ^
    [javac] /srv/gump/public/workspace/maven/src/java/org/apache/maven/util/ConsoleDownloadMeter.java:63: cannot find symbol
    [javac] symbol  : class TransferEvent
    [javac] location: class org.apache.maven.util.ConsoleDownloadMeter
    [javac]     public void transferError( TransferEvent transferEvent )
    [javac]                                ^
    [javac] /srv/gump/public/workspace/maven/src/java/org/apache/maven/util/DVSLPathTool.java:21: package org.codehaus.plexus.util does not exist
    [javac] import org.codehaus.plexus.util.StringUtils;
    [javac]                                ^
    [javac] /srv/gump/public/workspace/maven/src/java/org/apache/maven/util/HttpUtils.java:28: package org.apache.maven.wagon does not exist
    [javac] import org.apache.maven.wagon.ConnectionException;
    [javac]                              ^
    [javac] /srv/gump/public/workspace/maven/src/java/org/apache/maven/util/HttpUtils.java:29: package org.apache.maven.wagon does not exist
    [javac] import org.apache.maven.wagon.Wagon;
    [javac]                              ^
    [javac] /srv/gump/public/workspace/maven/src/java/org/apache/maven/util/HttpUtils.java:30: package org.apache.maven.wagon.providers.file does not exist
    [javac] import org.apache.maven.wagon.providers.file.FileWagon;
    [javac]                                             ^
    [javac] /srv/gump/public/workspace/maven/src/java/org/apache/maven/util/HttpUtils.java:31: package org.apache.maven.wagon.providers.http does not exist
    [javac] import org.apache.maven.wagon.providers.http.HttpWagon;
    [javac]                                             ^
    [javac] /srv/gump/public/workspace/maven/src/java/org/apache/maven/util/HttpUtils.java:32: package org.apache.maven.wagon.proxy does not exist
    [javac] import org.apache.maven.wagon.proxy.ProxyInfo;
    [javac]                                    ^
    [javac] /srv/gump/public/workspace/maven/src/java/org/apache/maven/util/HttpUtils.java:33: package org.apache.maven.wagon.repository does not exist
    [javac] import org.apache.maven.wagon.repository.Repository;
    [javac]                                         ^
    [javac] Note: Some input files use or override a deprecated API.
    [javac] Note: Recompile with -Xlint:deprecation for details.
    [javac] Note: Some input files use unchecked or unsafe operations.
    [javac] Note: Recompile with -Xlint:unchecked for details.
    [javac] 100 errors

BUILD FAILED
/srv/gump/public/workspace/maven/build-bootstrap.xml:234: Compile failed; see the compiler error output for details.

Total time: 7 seconds
---------------------------------------------

To subscribe to this information via syndicated feeds:
- RSS: http://vmgump.apache.org/gump/public/maven/maven-bootstrap/rss.xml
- Atom: http://vmgump.apache.org/gump/public/maven/maven-bootstrap/atom.xml

============================== Gump Tracking Only ===
Produced by Gump version 2.3.
Gump Run 05000005082009, vmgump:vmgump-public:05000005082009
Gump E-mail Identifier (unique within run) #58.

*********************************************************** G U M P
[GUMP@vmgump]: Module cocoon success, but with warnings.
To whom it may engage...
        
This is an automated request, but not an unsolicited one. For 
more information please visit http://gump.apache.org/nagged.html, 
and/or contact the folk at general@gump.apache.org.

Module cocoon contains errors.
The current state of this module is 'Success'.

Full details are available at:
    http://vmgump.apache.org/gump/public/cocoon/index.html

That said, some information snippets are provided here.

The following annotations (debug/informational/warning/error messages) were provided:
 -ERROR- *** Failed to update from source control.Stale contents ***



The following work was performed:
http://vmgump.apache.org/gump/public/cocoon/gump_work/update_cocoon.html
Work Name: update_cocoon (Type: Update)
Work ended in a state of : Failed
Elapsed: 
Command Line: svn --quiet update --non-interactive cocoon 
[Working Directory: /srv/gump/public/workspace/cvs]
---------------------------------------------
svn: Working copy 'cocoon' locked
svn: run 'svn cleanup' to remove locks (type 'svn help cleanup' for details)
---------------------------------------------

To subscribe to this information via syndicated feeds:
- RSS: http://vmgump.apache.org/gump/public/cocoon/rss.xml
- Atom: http://vmgump.apache.org/gump/public/cocoon/atom.xml

============================== Gump Tracking Only ===
Produced by Gump version 2.3.
Gump Run 05000005082009, vmgump:vmgump-public:05000005082009
Gump E-mail Identifier (unique within run) #60.

*********************************************************** G U M P
[GUMP@vmgump]: Project cocoon (in module cocoon) failed
To whom it may engage...
        
This is an automated request, but not an unsolicited one. For 
more information please visit http://gump.apache.org/nagged.html, 
and/or contact the folk at general@gump.apache.org.

Project cocoon has an issue affecting its community integration.
This issue affects 2 projects,
 and has been outstanding for 1127 runs.
The current state of this project is 'Failed', with reason 'Build Failed'.
For reference only, the following projects are affected by this:
    - cocoon :  Java XML Framework
    - lenya :  Content Management System


Full details are available at:
    http://vmgump.apache.org/gump/public/cocoon/cocoon/index.html

That said, some information snippets are provided here.

The following annotations (debug/informational/warning/error messages) were provided:
 -INFO- Optional dependency htmlunit prerequisite failed with reason build failed
 -DEBUG- (Gump generated) Maven2 Settings in: /srv/gump/public/workspace/cocoon/gump_mvn_settings.xml
 -INFO- Failed with reason build failed
 -DEBUG- Maven POM in: /srv/gump/public/workspace/cocoon/pom.xml



The following work was performed:
http://vmgump.apache.org/gump/public/cocoon/cocoon/gump_work/build_cocoon_cocoon.html
Work Name: build_cocoon_cocoon (Type: Build)
Work ended in a state of : Failed
Elapsed: 2 mins 39 secs
Command Line: mvn --batch-mode --settings /srv/gump/public/workspace/cocoon/gump_mvn_settings.xml package 
[Working Directory: /srv/gump/public/workspace/cocoon]
CLASSPATH: /usr/lib/jvm/java-6-sun/lib/tools.jar:/srv/gump/public/workspace/junit/dist/junit-05082009.jar:/srv/gump/public/workspace/apache-commons/lang/target/commons-lang-3.0-SNAPSHOT.jar:/srv/gump/public/workspace/ant/dist/lib/ant-jmf.jar:/srv/gump/public/workspace/ant/dist/lib/ant-swing.jar:/srv/gump/public/workspace/ant/dist/lib/ant-apache-resolver.jar:/srv/gump/public/workspace/ant/dist/lib/ant-apache-xalan2.jar:/srv/gump/public/workspace/ant/dist/lib/ant-trax.jar:/srv/gump/public/workspace/ant/dist/lib/ant-junit.jar:/srv/gump/public/workspace/ant/dist/lib/ant-launcher.jar:/srv/gump/public/workspace/ant/dist/lib/ant-nodeps.jar:/srv/gump/public/workspace/ant/dist/lib/ant.jar:/srv/gump/public/workspace/aopalliance/build/aopalliance.jar:/srv/gump/packages/bsh-2.0b4/bsh-commands-2.0b4.jar:/srv/gump/packages/bsh-2.0b4/bsh-classpath-2.0b4.jar:/srv/gump/packages/bsh-2.0b4/bsh-core-2.0b4.jar:/srv/gump/packages/bsh-2.0b4/bsh-bsf-2.0b4.jar:/srv/gump/packages/bsh-2.0b4/bsh-2.0b4.j
 ar:/srv/gump/packages/bsh-2.0b4/bsh-reflect-2.0b4.jar:/srv/gump/packages/bsh-2.0b4/bsh-util-2.0b4.jar:/srv/gump/public/workspace/apache-commons/beanutils/dist/commons-beanutils-05082009.jar:/srv/gump/public/workspace/apache-commons/codec/dist/commons-codec-05082009.jar:/srv/gump/public/workspace/apache-commons/collections/build/commons-collections-05082009.jar:/srv/gump/public/workspace/apache-commons/configuration/target/commons-configuration-1.7-SNAPSHOT.jar:/srv/gump/public/workspace/apache-commons/digester/dist/commons-digester.jar:/srv/gump/public/workspace/httpcomponents/oac.hc3x/dist/commons-httpclient.jar:/srv/gump/public/workspace/apache-commons/io/target/commons-io-05082009.jar:/srv/gump/public/workspace/apache-commons/jexl/dist/commons-jexl-05082009.jar:/srv/gump/public/workspace/apache-commons/jxpath/dist/commons-jxpath.jar:/srv/gump/public/workspace/apache-commons/logging/target/commons-logging-05082009.jar:/srv/gump/public/workspace/apache-commons/logging/targe
 t/commons-logging-api-05082009.jar:/srv/gump/public/workspace/apache-commons/validator/dist/commons-validator-05082009.jar:/srv/gump/packages/dougLea/concurrent.jar:/srv/gump/public/workspace/dom4j/build/dom4j.jar:/srv/gump/public/workspace/excalibur/components/datasource/target/excalibur-datasource-2.2.3-SNAPSHOT.jar:/srv/gump/public/workspace/excalibur/components/pool/instrumented/target/excalibur-pool-instrumented-2.2.3-SNAPSHOT.jar:/srv/gump/public/workspace/hsqldb/lib/hsqldb.jar:/srv/gump/public/workspace/htmlunit/target/htmlunit-05082009.jar:/srv/gump/public/workspace/jakarta-oro/jakarta-oro-05082009.jar:/srv/gump/public/workspace/jakarta-regexp/build/jakarta-regexp-05082009.jar:/srv/gump/public/workspace/jaxen/target/jaxen-05082009.jar:/srv/gump/public/workspace/jdom/build/jdom.jar:/srv/gump/public/workspace/jmock/build/dist/jmock-core-05082009.jar:/srv/gump/public/workspace/jmock/build/dist/jmock-cglib-05082009.jar:/srv/gump/packages/jtidy-04aug2000r7-dev/build/Tidy.
 jar:/srv/gump/public/workspace/logging-log4j-12/dist/lib/log4j-05082009.jar:/srv/gump/packages/nekohtml-0.9.5/nekohtml.jar:/srv/gump/public/workspace/rhino/build/rhino_05082009/js.jar:/srv/gump/public/workspace/velocity-engine/bin/velocity-05082009.jar:/srv/gump/public/workspace/velocity-engine/bin/velocity-05082009-dep.jar:/srv/gump/public/workspace/xml-commons/java/external/build/xml-apis-ext.jar:/srv/gump/public/workspace/xml-commons/java/external/build/xml-apis.jar:/srv/gump/public/workspace/xml-batik/batik-05082009/lib/batik-util.jar:/srv/gump/public/workspace/xml-batik/batik-05082009/lib/batik-swing.jar:/srv/gump/public/workspace/xml-batik/batik-05082009/lib/batik-css.jar:/srv/gump/public/workspace/xml-batik/batik-05082009/lib/batik-bridge.jar:/srv/gump/public/workspace/xml-batik/batik-05082009/lib/batik-xml.jar:/srv/gump/public/workspace/xml-batik/batik-05082009/lib/batik-svg-dom.jar:/srv/gump/public/workspace/xml-batik/batik-05082009/lib/batik-awt-util.jar:/srv/gump/
 public/workspace/xml-batik/batik-05082009/lib/batik-transcoder.jar:/srv/gump/public/workspace/xml-batik/batik-05082009/lib/batik-gui-util.jar:/srv/gump/public/workspace/xml-batik/batik-05082009/lib/batik-dom.jar:/srv/gump/public/workspace/xml-batik/batik-05082009/lib/batik-ext.jar:/srv/gump/public/workspace/xml-batik/batik-05082009/lib/batik-script.jar:/srv/gump/public/workspace/xml-batik/batik-05082009/lib/batik-svggen.jar:/srv/gump/public/workspace/xml-batik/batik-05082009/lib/batik-parser.jar:/srv/gump/public/workspace/xml-batik/batik-05082009/lib/batik-extension.jar:/srv/gump/public/workspace/xml-batik/batik-05082009/lib/batik-gvt.jar:/srv/gump/public/workspace/xml-fop/build/fop.jar:/srv/gump/public/workspace/xml-commons/java/build/resolver.jar:/srv/gump/public/workspace/xml-xerces2/build/xercesImpl.jar:/srv/gump/public/workspace/xmlunit/build/java/lib/xmlunit-sumo-05082009.jar:/srv/gump/public/workspace/xmlunit/build/java/lib/xmlunit-legacy-05082009.jar:/srv/gump/public
 /workspace/xmlunit/build/java/lib/xmlunit-core-05082009.jar:/srv/gump/public/workspace/xom/build/xom-05082009.jar
---------------------------------------------
Downloading: http://localhost:8192/maven2/org/apache/maven/maven-repository-metadata/2.0.1/maven-repository-metadata-2.0.1.jar
19K downloaded
Downloading: http://people.apache.org/~gkossakowski/maven2/repository/org/apache/maven/wagon/wagon-provider-api/1.0-alpha-5/wagon-provider-api-1.0-alpha-5.jar
Downloading: http://localhost:8192/maven2/org/apache/maven/wagon/wagon-provider-api/1.0-alpha-5/wagon-provider-api-1.0-alpha-5.jar
50K downloaded
Downloading: http://localhost:8192/maven2/org/apache/maven/plugins/maven-war-plugin/2.0.2/maven-war-plugin-2.0.2.jar
27K downloaded
Downloading: http://people.apache.org/~gkossakowski/maven2/repository/org/apache/maven/maven-archiver/2.2/maven-archiver-2.2.jar
Downloading: http://localhost:8192/maven2/org/apache/maven/maven-archiver/2.2/maven-archiver-2.2.jar
9K downloaded
Downloading: http://localhost:8192/maven2/javax/servlet/servlet-api/2.4/servlet-api-2.4.jar
91K downloaded
[INFO] [plugin:descriptor]
[WARNING] 

Goal prefix is specified as: 'cocoon'. Maven currently expects it to be 'cocoon'.

[INFO] Using 2 extractors.
[INFO] Applying extractor for language: java
[INFO] Extractor for language: java found 4 mojo descriptors.
[INFO] Applying extractor for language: bsh
[INFO] Extractor for language: bsh found 0 mojo descriptors.
[INFO] [resources:resources]
[WARNING] Using platform encoding (UTF-8 actually) to copy filtered resources, i.e. build is platform dependent!
[INFO] Copying 7 resources
[INFO] Copying 2 resources to META-INF
[INFO] [compiler:compile]
[INFO] Compiling 24 source files to /srv/gump/public/workspace/cocoon/tools/cocoon-maven-plugin/target/classes
[INFO] ------------------------------------------------------------------------
[ERROR] BUILD FAILURE
[INFO] ------------------------------------------------------------------------
[INFO] Compilation failure
/srv/gump/public/workspace/cocoon/tools/cocoon-maven-plugin/src/main/java/org/apache/cocoon/maven/rcl/PrepareWebappMojo.java:[285,8] cannot access org.apache.commons.lang.exception.NestableException
class file for org.apache.commons.lang.exception.NestableException not found
        try {



/srv/gump/public/workspace/cocoon/tools/cocoon-maven-plugin/src/main/java/org/apache/cocoon/maven/rcl/PrepareWebappMojo.java:[285,8] cannot access org.apache.commons.lang.exception.NestableException
class file for org.apache.commons.lang.exception.NestableException not found
        try {


[INFO] ------------------------------------------------------------------------
[INFO] For more information, run Maven with the -e switch
[INFO] ------------------------------------------------------------------------
[INFO] Total time: 2 minutes 37 seconds
[INFO] Finished at: Wed Aug 05 06:24:22 PDT 2009
[INFO] Final Memory: 58M/104M
[INFO] ------------------------------------------------------------------------
---------------------------------------------

To subscribe to this information via syndicated feeds:
- RSS: http://vmgump.apache.org/gump/public/cocoon/cocoon/rss.xml
- Atom: http://vmgump.apache.org/gump/public/cocoon/cocoon/atom.xml

============================== Gump Tracking Only ===
Produced by Gump version 2.3.
Gump Run 05000005082009, vmgump:vmgump-public:05000005082009
Gump E-mail Identifier (unique within run) #61.

*********************************************************** G U M P
[GUMP@vmgump]: Project kerberos-common (in module kerberos-shared) failed
To whom it may engage...
        
This is an automated request, but not an unsolicited one. For 
more information please visit http://gump.apache.org/nagged.html, 
and/or contact the folk at general@gump.apache.org.

Project kerberos-common has an issue affecting its community integration.
This issue affects 2 projects,
 and has been outstanding for 184 runs.
The current state of this project is 'Failed', with reason 'Build Failed'.
For reference only, the following projects are affected by this:
    - kerberos-common :  Apache Directory Project
    - kerberos-protocol :  Apache Kerberos Server


Full details are available at:
    http://vmgump.apache.org/gump/public/kerberos-shared/kerberos-common/index.html

That said, some information snippets are provided here.

The following annotations (debug/informational/warning/error messages) were provided:
 -DEBUG- Sole output [kerberos-common-05082009.jar] identifier set to project name
 -DEBUG- (Gump generated) Maven2 Settings in: /srv/gump/public/workspace/kerberos-shared/gump_mvn_settings.xml
 -INFO- Failed with reason build failed
 -DEBUG- Maven POM in: /srv/gump/public/workspace/kerberos-shared/pom.xml
 -INFO- Project Reports in: /srv/gump/public/workspace/kerberos-shared/common/target/test-reports
 -WARNING- No directory [/srv/gump/public/workspace/kerberos-shared/common/target/test-reports]
 -INFO- Failed to extract fallback artifacts from Gump Repository



The following work was performed:
http://vmgump.apache.org/gump/public/kerberos-shared/kerberos-common/gump_work/build_kerberos-shared_kerberos-common.html
Work Name: build_kerberos-shared_kerberos-common (Type: Build)
Work ended in a state of : Failed
Elapsed: 1 sec
Command Line: mvn --batch-mode --settings /srv/gump/public/workspace/kerberos-shared/gump_mvn_settings.xml package 
[Working Directory: /srv/gump/public/workspace/kerberos-shared]
CLASSPATH: /usr/lib/jvm/java-6-sun/lib/tools.jar:/srv/gump/public/workspace/directory-shared/asn1/target/shared-asn1-0.9.15-SNAPSHOT.jar:/srv/gump/packages/bouncycastle-jdk14/bcprov-130.jar:/srv/gump/public/workspace/directory-shared/ldap/target/shared-ldap-0.9.15-SNAPSHOT.jar
---------------------------------------------
	at org.apache.maven.cli.MavenCli.main(MavenCli.java:301)
	at sun.reflect.NativeMethodAccessorImpl.invoke0(Native Method)
	at sun.reflect.NativeMethodAccessorImpl.invoke(NativeMethodAccessorImpl.java:39)
	at sun.reflect.DelegatingMethodAccessorImpl.invoke(DelegatingMethodAccessorImpl.java:25)
	at java.lang.reflect.Method.invoke(Method.java:597)
	at org.codehaus.classworlds.Launcher.launchEnhanced(Launcher.java:315)
	at org.codehaus.classworlds.Launcher.launch(Launcher.java:255)
	at org.codehaus.classworlds.Launcher.mainWithExitCode(Launcher.java:430)
	at org.codehaus.classworlds.Launcher.main(Launcher.java:375)
Caused by: org.apache.maven.project.ProjectBuildingException: Cannot find parent: org.apache.directory.server:apacheds-parent for project: null:apacheds-kerberos-shared:jar:null for project null:apacheds-kerberos-shared:jar:null
	at org.apache.maven.project.DefaultMavenProjectBuilder.assembleLineage(DefaultMavenProjectBuilder.java:1369)
	at org.apache.maven.project.DefaultMavenProjectBuilder.buildInternal(DefaultMavenProjectBuilder.java:820)
	at org.apache.maven.project.DefaultMavenProjectBuilder.buildFromSourceFileInternal(DefaultMavenProjectBuilder.java:505)
	at org.apache.maven.project.DefaultMavenProjectBuilder.build(DefaultMavenProjectBuilder.java:197)
	at org.apache.maven.DefaultMaven.getProject(DefaultMaven.java:583)
	at org.apache.maven.DefaultMaven.collectProjects(DefaultMaven.java:461)
	at org.apache.maven.DefaultMaven.getProjects(DefaultMaven.java:365)
	... 11 more
Caused by: org.apache.maven.project.ProjectBuildingException: POM 'org.apache.directory.server:apacheds-parent' not found in repository: Unable to download the artifact from any repository

  org.apache.directory.server:apacheds-parent:pom:1.5.5-SNAPSHOT

from the specified remote repositories:
  gump-central (http://localhost:8192/maven2)

 for project org.apache.directory.server:apacheds-parent
	at org.apache.maven.project.DefaultMavenProjectBuilder.findModelFromRepository(DefaultMavenProjectBuilder.java:602)
	at org.apache.maven.project.DefaultMavenProjectBuilder.assembleLineage(DefaultMavenProjectBuilder.java:1365)
	... 17 more
Caused by: org.apache.maven.artifact.resolver.ArtifactNotFoundException: Unable to download the artifact from any repository

  org.apache.directory.server:apacheds-parent:pom:1.5.5-SNAPSHOT

from the specified remote repositories:
  gump-central (http://localhost:8192/maven2)


	at org.apache.maven.artifact.resolver.DefaultArtifactResolver.resolve(DefaultArtifactResolver.java:212)
	at org.apache.maven.artifact.resolver.DefaultArtifactResolver.resolve(DefaultArtifactResolver.java:74)
	at org.apache.maven.project.DefaultMavenProjectBuilder.findModelFromRepository(DefaultMavenProjectBuilder.java:555)
	... 18 more
Caused by: org.apache.maven.wagon.ResourceDoesNotExistException: Unable to download the artifact from any repository
	at org.apache.maven.artifact.manager.DefaultWagonManager.getArtifact(DefaultWagonManager.java:332)
	at org.apache.maven.artifact.resolver.DefaultArtifactResolver.resolve(DefaultArtifactResolver.java:200)
	... 20 more
[INFO] ------------------------------------------------------------------------
[INFO] Total time: < 1 second
[INFO] Finished at: Wed Aug 05 06:33:42 PDT 2009
[INFO] Final Memory: 1M/4M
[INFO] ------------------------------------------------------------------------
---------------------------------------------

To subscribe to this information via syndicated feeds:
- RSS: http://vmgump.apache.org/gump/public/kerberos-shared/kerberos-common/rss.xml
- Atom: http://vmgump.apache.org/gump/public/kerberos-shared/kerberos-common/atom.xml

============================== Gump Tracking Only ===
Produced by Gump version 2.3.
Gump Run 05000005082009, vmgump:vmgump-public:05000005082009
Gump E-mail Identifier (unique within run) #66.

*********************************************************** G U M P
[GUMP@vmgump]: Project tapestry (in module tapestry) failed
To whom it may engage...
        
This is an automated request, but not an unsolicited one. For 
more information please visit http://gump.apache.org/nagged.html, 
and/or contact the folk at general@gump.apache.org.

Project tapestry has an issue affecting its community integration.
This issue affects 1 projects,
 and has been outstanding for 1103 runs.
The current state of this project is 'Failed', with reason 'Build Failed'.
For reference only, the following projects are affected by this:
    - tapestry :  Component-based web application framework organized around i...


Full details are available at:
    http://vmgump.apache.org/gump/public/tapestry/tapestry/index.html

That said, some information snippets are provided here.

The following annotations (debug/informational/warning/error messages) were provided:
 -DEBUG- Sole output [tapestry-05082009.jar] identifier set to project name
 -DEBUG- (Gump generated) Maven2 Settings in: /srv/gump/public/workspace/tapestry/gump_mvn_settings.xml
 -INFO- Failed with reason build failed
 -DEBUG- Maven POM in: /srv/gump/public/workspace/tapestry/pom.xml
 -INFO- Failed to extract fallback artifacts from Gump Repository



The following work was performed:
http://vmgump.apache.org/gump/public/tapestry/tapestry/gump_work/build_tapestry_tapestry.html
Work Name: build_tapestry_tapestry (Type: Build)
Work ended in a state of : Failed
Elapsed: 2 mins 41 secs
Command Line: mvn --batch-mode --settings /srv/gump/public/workspace/tapestry/gump_mvn_settings.xml package 
[Working Directory: /srv/gump/public/workspace/tapestry]
CLASSPATH: /usr/lib/jvm/java-6-sun/lib/tools.jar:/srv/gump/public/workspace/apache-commons/beanutils/dist/commons-beanutils-05082009.jar:/srv/gump/public/workspace/apache-commons/codec/dist/commons-codec-05082009.jar:/srv/gump/public/workspace/apache-commons/digester/dist/commons-digester.jar:/srv/gump/public/workspace/apache-commons/fileupload/target/commons-fileupload-05082009.jar:/srv/gump/public/workspace/apache-commons/io/target/commons-io-05082009.jar:/srv/gump/public/workspace/apache-commons/lang/target/commons-lang-3.0-SNAPSHOT.jar:/srv/gump/public/workspace/apache-commons/logging/target/commons-logging-05082009.jar:/srv/gump/public/workspace/apache-commons/logging/target/commons-logging-api-05082009.jar:/srv/gump/packages/easymock1.2_Java1.3/easymock.jar:/srv/gump/packages/easymockclassextension1.2/easymockclassextension.jar:/srv/gump/public/workspace/jakarta-oro/jakarta-oro-05082009.jar:/srv/gump/public/workspace/jakarta-servletapi-4/lib/servlet.jar:/srv/gump/public
 /workspace/javassist/javassist.jar:/srv/gump/public/workspace/jdom/build/jdom.jar:/srv/gump/public/workspace/logging-log4j-12/dist/lib/log4j-05082009.jar:/srv/gump/packages/ognl-2.6.7/ognl-2.6.7.jar:/srv/gump/public/workspace/xml-commons/java/external/build/xml-apis-ext.jar:/srv/gump/packages/jCharts-0.7.5/jCharts-0.7.5.jar
---------------------------------------------
location: class org.apache.tapestry.services.impl.HiveMindExpressionCompiler

/srv/gump/public/workspace/tapestry/tapestry-framework/src/java/org/apache/tapestry/services/impl/HiveMindExpressionCompiler.java:[425,21] cannot find symbol
symbol  : method getRootExpression(ognl.Node,java.lang.Object,ognl.OgnlContext)
location: class org.apache.tapestry.services.impl.HiveMindExpressionCompiler

/srv/gump/public/workspace/tapestry/tapestry-framework/src/java/org/apache/tapestry/listener/ListenerMapPropertyAccessor.java:[81,20] cannot find symbol
symbol  : method getPropertyClass(ognl.OgnlContext,java.lang.Object,java.lang.Object)
location: class ognl.ObjectPropertyAccessor

/srv/gump/public/workspace/tapestry/tapestry-framework/src/java/org/apache/tapestry/listener/ListenerMapPropertyAccessor.java:[91,36] cannot find symbol
symbol  : method getCompiler()
location: class ognl.OgnlRuntime

/srv/gump/public/workspace/tapestry/tapestry-framework/src/java/org/apache/tapestry/listener/ListenerMapPropertyAccessor.java:[93,12] cannot find symbol
symbol  : variable ExpressionCompiler
location: class org.apache.tapestry.listener.ListenerMapPropertyAccessor

/srv/gump/public/workspace/tapestry/tapestry-framework/src/java/org/apache/tapestry/listener/ListenerMapPropertyAccessor.java:[95,19] cannot find symbol
symbol  : method setCurrentAccessor(java.lang.Class)
location: class ognl.OgnlContext

/srv/gump/public/workspace/tapestry/tapestry-framework/src/java/org/apache/tapestry/listener/ListenerMapPropertyAccessor.java:[96,19] cannot find symbol
symbol  : method setCurrentType(java.lang.Class)
location: class ognl.OgnlContext

/srv/gump/public/workspace/tapestry/tapestry-framework/src/java/org/apache/tapestry/listener/ListenerMapPropertyAccessor.java:[101,20] cannot find symbol
symbol  : method getSourceAccessor(ognl.OgnlContext,java.lang.Object,java.lang.Object)
location: class ognl.ObjectPropertyAccessor

/srv/gump/public/workspace/tapestry/tapestry-framework/src/java/org/apache/tapestry/listener/ListenerMapPropertyAccessor.java:[106,18] cannot find symbol
symbol  : class UnsupportedCompilationException
location: class org.apache.tapestry.listener.ListenerMapPropertyAccessor

/srv/gump/public/workspace/tapestry/tapestry-framework/src/java/org/apache/tapestry/binding/ExpressionBinding.java:[135,45] cannot find symbol
symbol  : method getAccessor()
location: interface ognl.Node

/srv/gump/public/workspace/tapestry/tapestry-framework/src/java/org/apache/tapestry/binding/ExpressionBinding.java:[210,53] cannot find symbol
symbol  : method getAccessor()
location: interface ognl.Node


[INFO] ------------------------------------------------------------------------
[INFO] For more information, run Maven with the -e switch
[INFO] ------------------------------------------------------------------------
[INFO] Total time: 2 minutes 40 seconds
[INFO] Finished at: Wed Aug 05 06:38:32 PDT 2009
[INFO] Final Memory: 16M/48M
[INFO] ------------------------------------------------------------------------
---------------------------------------------

To subscribe to this information via syndicated feeds:
- RSS: http://vmgump.apache.org/gump/public/tapestry/tapestry/rss.xml
- Atom: http://vmgump.apache.org/gump/public/tapestry/tapestry/atom.xml

============================== Gump Tracking Only ===
Produced by Gump version 2.3.
Gump Run 05000005082009, vmgump:vmgump-public:05000005082009
Gump E-mail Identifier (unique within run) #67.

*********************************************************** G U M P
[GUMP@vmgump]: Project apacheds-shared (in module apacheds) failed
To whom it may engage...
        
This is an automated request, but not an unsolicited one. For 
more information please visit http://gump.apache.org/nagged.html, 
and/or contact the folk at general@gump.apache.org.

Project apacheds-shared has an issue affecting its community integration.
This issue affects 5 projects,
 and has been outstanding for 23 runs.
The current state of this project is 'Failed', with reason 'Build Failed'.
For reference only, the following projects are affected by this:
    - apacheds-core :  Apache Directory Server
    - apacheds-main :  Apache Directory Server
    - apacheds-shared :  Apache Directory Server
    - apacheds-shared-test :  Apache Directory Server
    - maven-directory-plugin :  Apache Directory Server


Full details are available at:
    http://vmgump.apache.org/gump/public/apacheds/apacheds-shared/index.html

That said, some information snippets are provided here.

The following annotations (debug/informational/warning/error messages) were provided:
 -DEBUG- Sole output [apacheds-shared-05082009.jar] identifier set to project name
 -DEBUG- (Gump generated) Maven2 Settings in: /srv/gump/public/workspace/apacheds/gump_mvn_settings.xml
 -INFO- Failed with reason build failed
 -DEBUG- Maven POM in: /srv/gump/public/workspace/apacheds/pom.xml
 -INFO- Failed to extract fallback artifacts from Gump Repository



The following work was performed:
http://vmgump.apache.org/gump/public/apacheds/apacheds-shared/gump_work/build_apacheds_apacheds-shared.html
Work Name: build_apacheds_apacheds-shared (Type: Build)
Work ended in a state of : Failed
Elapsed: 4 mins 28 secs
Command Line: mvn --batch-mode -Dmaven.test.skip.exec=true --settings /srv/gump/public/workspace/apacheds/gump_mvn_settings.xml install 
[Working Directory: /srv/gump/public/workspace/apacheds]
CLASSPATH: /usr/lib/jvm/java-6-sun/lib/tools.jar:/srv/gump/public/workspace/junit/dist/junit-05082009.jar:/srv/gump/public/workspace/directory-shared/ldap/target/shared-ldap-0.9.15-SNAPSHOT.jar
---------------------------------------------



Failure executing javac, but could not parse the error:


The system is out of resources.
Consult the following stack trace for details.
java.lang.OutOfMemoryError: PermGen space
	at java.lang.ClassLoader.defineClass1(Native Method)
	at java.lang.ClassLoader.defineClass(ClassLoader.java:620)
	at java.security.SecureClassLoader.defineClass(SecureClassLoader.java:124)
	at java.net.URLClassLoader.defineClass(URLClassLoader.java:260)
	at java.net.URLClassLoader.access$000(URLClassLoader.java:56)
	at java.net.URLClassLoader$1.run(URLClassLoader.java:195)
	at java.security.AccessController.doPrivileged(Native Method)
	at java.net.URLClassLoader.findClass(URLClassLoader.java:188)
	at org.codehaus.plexus.compiler.javac.IsolatedClassLoader.loadClass(IsolatedClassLoader.java:56)
	at java.lang.ClassLoader.loadClassInternal(ClassLoader.java:319)
	at java.lang.ClassLoader.defineClass1(Native Method)
	at java.lang.ClassLoader.defineClass(ClassLoader.java:620)
	at java.security.SecureClassLoader.defineClass(SecureClassLoader.java:124)
	at java.net.URLClassLoader.defineClass(URLClassLoader.java:260)
	at java.net.URLClassLoader.access$000(URLClassLoader.java:56)
	at java.net.URLClassLoader$1.run(URLClassLoader.java:195)
	at java.security.AccessController.doPrivileged(Native Method)
	at java.net.URLClassLoader.findClass(URLClassLoader.java:188)
	at org.codehaus.plexus.compiler.javac.IsolatedClassLoader.loadClass(IsolatedClassLoader.java:56)
	at java.lang.ClassLoader.loadClassInternal(ClassLoader.java:319)
	at com.sun.tools.javac.comp.Enter.<init>(Enter.java:106)
	at com.sun.tools.javac.comp.Enter.instance(Enter.java:97)
	at com.sun.tools.javac.comp.MemberEnter.<init>(MemberEnter.java:75)
	at com.sun.tools.javac.comp.MemberEnter.instance(MemberEnter.java:68)
	at com.sun.tools.javac.comp.Attr.<init>(Attr.java:86)
	at com.sun.tools.javac.comp.Attr.instance(Attr.java:74)
	at com.sun.tools.javac.comp.Annotate.<init>(Annotate.java:52)
	at com.sun.tools.javac.comp.Annotate.instance(Annotate.java:36)
	at com.sun.tools.javac.jvm.ClassReader.<init>(ClassReader.java:215)
	at com.sun.tools.javac.jvm.ClassReader.instance(ClassReader.java:168)
	at com.sun.tools.javac.main.JavaCompiler.<init>(JavaCompiler.java:293)
	at com.sun.tools.javac.main.JavaCompiler.instance(JavaCompiler.java:72)


[INFO] ------------------------------------------------------------------------
[INFO] For more information, run Maven with the -e switch
[INFO] ------------------------------------------------------------------------
[INFO] Total time: 4 minutes 27 seconds
[INFO] Finished at: Wed Aug 05 06:46:37 PDT 2009
[INFO] Final Memory: 38M/237M
[INFO] ------------------------------------------------------------------------
---------------------------------------------

To subscribe to this information via syndicated feeds:
- RSS: http://vmgump.apache.org/gump/public/apacheds/apacheds-shared/rss.xml
- Atom: http://vmgump.apache.org/gump/public/apacheds/apacheds-shared/atom.xml

============================== Gump Tracking Only ===
Produced by Gump version 2.3.
Gump Run 05000005082009, vmgump:vmgump-public:05000005082009
Gump E-mail Identifier (unique within run) #68.

*********************************************************** G U M P
[GUMP@vmgump]: Module lucene-java success, but with warnings.
To whom it may engage...
        
This is an automated request, but not an unsolicited one. For 
more information please visit http://gump.apache.org/nagged.html, 
and/or contact the folk at general@gump.apache.org.

Module lucene-java contains errors.
The current state of this module is 'Success'.

Full details are available at:
    http://vmgump.apache.org/gump/public/lucene-java/index.html

That said, some information snippets are provided here.

The following annotations (debug/informational/warning/error messages) were provided:
 -ERROR- *** Failed to update from source control.Stale contents ***



The following work was performed:
http://vmgump.apache.org/gump/public/lucene-java/gump_work/update_lucene-java.html
Work Name: update_lucene-java (Type: Update)
Work ended in a state of : Failed
Elapsed: 
Command Line: svn --quiet update --non-interactive lucene-java 
[Working Directory: /srv/gump/public/workspace/cvs]
---------------------------------------------
svn: Working copy 'lucene-java' locked
svn: run 'svn cleanup' to remove locks (type 'svn help cleanup' for details)
---------------------------------------------

To subscribe to this information via syndicated feeds:
- RSS: http://vmgump.apache.org/gump/public/lucene-java/rss.xml
- Atom: http://vmgump.apache.org/gump/public/lucene-java/atom.xml

============================== Gump Tracking Only ===
Produced by Gump version 2.3.
Gump Run 05000005082009, vmgump:vmgump-public:05000005082009
Gump E-mail Identifier (unique within run) #70.

*********************************************************** G U M P
[GUMP@vmgump]: Project naming-config-test (in module directory-naming) failed
To whom it may engage...
        
This is an automated request, but not an unsolicited one. For 
more information please visit http://gump.apache.org/nagged.html, 
and/or contact the folk at general@gump.apache.org.

Project naming-config-test has an issue affecting its community integration.
This issue affects 1 projects.
The current state of this project is 'Failed', with reason 'Build Failed'.
For reference only, the following projects are affected by this:
    - naming-config-test :  Apache Directory Naming Component


Full details are available at:
    http://vmgump.apache.org/gump/public/directory-naming/naming-config-test/index.html

That said, some information snippets are provided here.

The following annotations (debug/informational/warning/error messages) were provided:
 -WARNING- Overriding Maven properties: [/srv/gump/public/workspace/directory-naming/naming-config/build.properties]
 -DEBUG- (Gump generated) Maven Properties in: /srv/gump/public/workspace/directory-naming/naming-config/build.properties
 -INFO- Failed with reason build failed
 -DEBUG- Maven POM in: /srv/gump/public/workspace/directory-naming/naming-config/project.xml
 -DEBUG- Maven project properties in: /srv/gump/public/workspace/directory-naming/naming-config/project.properties
 -INFO- Project Reports in: /srv/gump/public/workspace/directory-naming/naming-config/target/test-reports



The following work was performed:
http://vmgump.apache.org/gump/public/directory-naming/naming-config-test/gump_work/build_directory-naming_naming-config-test.html
Work Name: build_directory-naming_naming-config-test (Type: Build)
Work ended in a state of : Failed
Elapsed: 7 secs
Command Line: maven --offline test 
[Working Directory: /srv/gump/public/workspace/directory-naming/naming-config]
CLASSPATH: /usr/lib/jvm/java-6-sun/lib/tools.jar:/srv/gump/public/workspace/apache-commons/beanutils/dist/commons-beanutils-05082009.jar:/srv/gump/public/workspace/apache-commons/collections/build/commons-collections-05082009.jar:/srv/gump/public/workspace/apache-commons/dbcp/dist/commons-dbcp.jar:/srv/gump/public/workspace/apache-commons/digester/dist/commons-digester.jar:/srv/gump/public/workspace/apache-commons/lang/target/commons-lang-3.0-SNAPSHOT.jar:/srv/gump/public/workspace/apache-commons/logging/target/commons-logging-05082009.jar:/srv/gump/public/workspace/apache-commons/logging/target/commons-logging-api-05082009.jar:/srv/gump/public/workspace/apache-commons/pool/dist/commons-pool.jar:/srv/gump/public/workspace/hsqldb/lib/hsqldb.jar:/srv/gump/public/workspace/junit/dist/junit-05082009.jar:/srv/gump/public/workspace/directory-naming/naming-config/target/naming-config-05082009.jar:/srv/gump/public/workspace/directory-naming/naming-core/target/naming-core-05082009.jar
 :/srv/gump/public/workspace/directory-naming/naming-factory/target/naming-factory-05082009.jar:/srv/gump/public/workspace/directory-naming/naming-java/target/naming-java-05082009.jar:/srv/gump/packages/maven-site-plugin/maven-site-plugin-1.6.1.jar
---------------------------------------------
 __  __
|  \/  |__ _Apache__ ___
| |\/| / _` \ V / -_) ' \  ~ intelligent projects ~
|_|  |_\__,_|\_/\___|_||_|  v. 1.0.2

You are working offline so the build will continue, but naming-core-0.9-SNAPSHOT.jar may be out of date!
You are working offline so the build will continue, but naming-factory-0.9-SNAPSHOT.jar may be out of date!
You are working offline so the build will continue, but naming-java-0.9-SNAPSHOT.jar may be out of date!
build:start:

java:prepare-filesystem:

java:compile:
    [echo] Compiling to /srv/gump/public/workspace/directory-naming/naming-config/target/classes

java:jar-resources:

test:prepare-filesystem:

test:test-resources:
Copying 5 files to /srv/gump/public/workspace/directory-naming/naming-config/target/test-classes

test:compile:
    [javac] Compiling 1 source file to /srv/gump/public/workspace/directory-naming/naming-config/target/test-classes

test:test:
    [junit] Running org.apache.naming.config.XmlConfiguratorTest
    [junit] Tests run: 5, Failures: 0, Errors: 5, Time elapsed: 1.162 sec
    [junit] [ERROR] TEST org.apache.naming.config.XmlConfiguratorTest FAILED

BUILD FAILED
File...... /home/gump/.maven/cache/maven-test-plugin-1.6.2/plugin.jelly
Element... fail
Line...... 181
Column.... 54
There were test failures.
Total time: 6 seconds
Finished at: Wed Aug 05 06:52:55 PDT 2009

---------------------------------------------

To subscribe to this information via syndicated feeds:
- RSS: http://vmgump.apache.org/gump/public/directory-naming/naming-config-test/rss.xml
- Atom: http://vmgump.apache.org/gump/public/directory-naming/naming-config-test/atom.xml

============================== Gump Tracking Only ===
Produced by Gump version 2.3.
Gump Run 05000005082009, vmgump:vmgump-public:05000005082009
Gump E-mail Identifier (unique within run) #71.

*********************************************************** G U M P
[GUMP@vmgump]: Project ldap-protocol (in module ldap-protocol) failed
To whom it may engage...
        
This is an automated request, but not an unsolicited one. For 
more information please visit http://gump.apache.org/nagged.html, 
and/or contact the folk at general@gump.apache.org.

Project ldap-protocol has an issue affecting its community integration.
This issue affects 1 projects,
 and has been outstanding for 20 runs.
The current state of this project is 'Failed', with reason 'Build Failed'.
For reference only, the following projects are affected by this:
    - ldap-protocol :  Apache Directory Server


Full details are available at:
    http://vmgump.apache.org/gump/public/ldap-protocol/ldap-protocol/index.html

That said, some information snippets are provided here.

The following annotations (debug/informational/warning/error messages) were provided:
 -DEBUG- Sole output [ldap-protocol-05082009.jar] identifier set to project name
 -DEBUG- (Gump generated) Maven Properties in: /srv/gump/public/workspace/ldap-protocol/build.properties
 -INFO- Failed with reason build failed
 -INFO- Project Reports in: /srv/gump/public/workspace/ldap-protocol/target/test-reports
 -INFO- Failed to extract fallback artifacts from Gump Repository



The following work was performed:
http://vmgump.apache.org/gump/public/ldap-protocol/ldap-protocol/gump_work/build_ldap-protocol_ldap-protocol.html
Work Name: build_ldap-protocol_ldap-protocol (Type: Build)
Work ended in a state of : Failed
Elapsed: 3 secs
Command Line: maven --offline jar 
[Working Directory: /srv/gump/public/workspace/ldap-protocol]
CLASSPATH: /usr/lib/jvm/java-6-sun/lib/tools.jar:/srv/gump/public/workspace/directory-shared/asn1-codec/target/shared-asn1-codec-0.9.15-SNAPSHOT.jar:/srv/gump/public/workspace/directory-shared/ldap/target/shared-ldap-0.9.15-SNAPSHOT.jar:/srv/gump/public/workspace/mina/core/target/mina-core-2.0.0-M7-SNAPSHOT.jar:/srv/gump/public/workspace/mina/integration-beans/target/mina-integration-beans-2.0.0-M7-SNAPSHOT.jar:/srv/gump/public/workspace/mina/statemachine/target/mina-statemachine-2.0.0-M7-SNAPSHOT.jar:/srv/gump/public/workspace/mina/integration-ognl/target/mina-integration-ognl-2.0.0-M7-SNAPSHOT.jar:/srv/gump/public/workspace/mina/transport-apr/target/mina-transport-apr-2.0.0-M7-SNAPSHOT.jar:/srv/gump/public/workspace/mina/integration-jmx/target/mina-integration-jmx-2.0.0-M7-SNAPSHOT.jar:/srv/gump/public/workspace/mina/filter-compression/target/mina-filter-compression-2.0.0-M7-SNAPSHOT.jar:/srv/gump/public/workspace/mina/filter-codec-netty/target/mina-filter-codec-netty-2.0.0
 -M7-SNAPSHOT.jar
---------------------------------------------
 __  __
|  \/  |__ _Apache__ ___
| |\/| / _` \ V / -_) ' \  ~ intelligent projects ~
|_|  |_\__,_|\_/\___|_||_|  v. 1.0.2

build:start:

java:prepare-filesystem:
    [mkdir] Created dir: /srv/gump/public/workspace/ldap-protocol/target/classes

java:compile:
    [echo] Compiling to /srv/gump/public/workspace/ldap-protocol/target/classes
    [echo] No java source files to compile.
resources or todir was null

java:jar-resources:

test:prepare-filesystem:
    [mkdir] Created dir: /srv/gump/public/workspace/ldap-protocol/target/test-classes
    [mkdir] Created dir: /srv/gump/public/workspace/ldap-protocol/target/test-reports

test:test-resources:

test:compile:
    [echo] No test source files to compile.

test:test:
    [echo] No tests to run.

BUILD FAILED
File...... /home/gump/.maven/cache/maven-jar-plugin-1.6.1/plugin.jelly
Element... ant:fail
Line...... 53
Column.... 19
You must define currentVersion in your POM.
Total time: 2 seconds
Finished at: Wed Aug 05 06:53:43 PDT 2009

---------------------------------------------

To subscribe to this information via syndicated feeds:
- RSS: http://vmgump.apache.org/gump/public/ldap-protocol/ldap-protocol/rss.xml
- Atom: http://vmgump.apache.org/gump/public/ldap-protocol/ldap-protocol/atom.xml

============================== Gump Tracking Only ===
Produced by Gump version 2.3.
Gump Run 05000005082009, vmgump:vmgump-public:05000005082009
Gump E-mail Identifier (unique within run) #72.

*********************************************************** G U M P
[GUMP@vmgump]: Project portals-pluto-portal-1.0 (in module portals-pluto-1.0) failed
To whom it may engage...
        
This is an automated request, but not an unsolicited one. For 
more information please visit http://gump.apache.org/nagged.html, 
and/or contact the folk at general@gump.apache.org.

Project portals-pluto-portal-1.0 has an issue affecting its community integration.
This issue affects 1 projects.
The current state of this project is 'Failed', with reason 'Build Failed'.
For reference only, the following projects are affected by this:
    - portals-pluto-portal-1.0 :  JSR168 Container


Full details are available at:
    http://vmgump.apache.org/gump/public/portals-pluto-1.0/portals-pluto-portal-1.0/index.html

That said, some information snippets are provided here.

The following annotations (debug/informational/warning/error messages) were provided:
 -DEBUG- Dependency on ant exists, no need to add for property env.ANT_HOME.
 -INFO- Failed with reason build failed
 -INFO- Failed to extract fallback artifacts from Gump Repository



The following work was performed:
http://vmgump.apache.org/gump/public/portals-pluto-1.0/portals-pluto-portal-1.0/gump_work/build_portals-pluto-1.0_portals-pluto-portal-1.0.html
Work Name: build_portals-pluto-1.0_portals-pluto-portal-1.0 (Type: Build)
Work ended in a state of : Failed
Elapsed: 20 secs
Command Line: /usr/lib/jvm/java-6-sun/bin/java -Djava.awt.headless=true -Xbootclasspath/p:/srv/gump/public/workspace/xml-commons/java/external/build/xml-apis.jar:/srv/gump/public/workspace/xml-xerces2/build/xercesImpl.jar org.apache.tools.ant.Main -Dgump.merge=/srv/gump/public/gump/work/merge.xml -Dbuild.sysclasspath=only -Denv.ANT_HOME=/srv/gump/public/workspace/ant/dist -Dversion=05082009 -Dfinal.portal.name=pluto-portal-impl-05082009 all 
[Working Directory: /srv/gump/public/workspace/portals-pluto-1.0]
CLASSPATH: /usr/lib/jvm/java-6-sun/lib/tools.jar:/srv/gump/public/workspace/portals-pluto-1.0/build/ant/lib/ForeachTask.jar:/srv/gump/public/workspace/ant/dist/lib/ant-jmf.jar:/srv/gump/public/workspace/ant/dist/lib/ant-swing.jar:/srv/gump/public/workspace/ant/dist/lib/ant-apache-resolver.jar:/srv/gump/public/workspace/ant/dist/lib/ant-apache-xalan2.jar:/srv/gump/public/workspace/ant/dist/lib/ant-trax.jar:/srv/gump/public/workspace/ant/dist/lib/ant-junit.jar:/srv/gump/public/workspace/ant/dist/lib/ant-launcher.jar:/srv/gump/public/workspace/ant/dist/lib/ant-nodeps.jar:/srv/gump/public/workspace/ant/dist/lib/ant.jar:/srv/gump/packages/junit3.8.1/junit.jar:/srv/gump/public/workspace/xml-commons/java/build/resolver.jar:/srv/gump/public/workspace/castor/core/target/castor-core-1.3.1-SNAPSHOT.jar:/srv/gump/public/workspace/castor/xml/target/castor-xml-1.3.1-SNAPSHOT.jar:/srv/gump/public/workspace/apache-commons/fileupload/target/commons-fileupload-05082009.jar:/srv/gump/public/wor
 kspace/apache-commons/logging/target/commons-logging-05082009.jar:/srv/gump/public/workspace/apache-commons/logging/target/commons-logging-api-05082009.jar:/srv/gump/public/workspace/junit/dist/junit-05082009.jar:/srv/gump/public/workspace/jakarta-regexp/build/jakarta-regexp-05082009.jar:/srv/gump/public/workspace/jakarta-servletapi-5/jsr154/dist/lib/servlet-api.jar:/srv/gump/public/workspace/jakarta-servletapi-5/jsr152/dist/lib/jsp-api.jar:/srv/gump/public/workspace/portals-pluto-1.0/api/target/portlet-api-1.0.jar:/srv/gump/public/workspace/portals-pluto-1.0/container/target/pluto-1.0.jar:/srv/gump/public/workspace/portals-pluto-1.0/descriptors/target/pluto-descriptors-1.0.jar:/srv/gump/public/workspace/xml-commons/java/external/build/xml-apis-ext.jar
---------------------------------------------

compile-tests:

internal-test:

test:

jar:

portal:

init:
    [mkdir] Created dir: /srv/gump/public/workspace/portals-pluto-1.0/portal/target/lib

get-deps:

compile:
    [mkdir] Created dir: /srv/gump/public/workspace/portals-pluto-1.0/portal/target/classes
    [javac] Compiling 149 source files to /srv/gump/public/workspace/portals-pluto-1.0/portal/target/classes
    [javac] /srv/gump/public/workspace/portals-pluto-1.0/portal/src/java/org/apache/pluto/portalImpl/Deploy.java:62: warning: [deprecation] org.apache.xml.serialize.OutputFormat in org.apache.xml.serialize has been deprecated
    [javac] import org.apache.xml.serialize.OutputFormat;
    [javac]                                ^
    [javac] /srv/gump/public/workspace/portals-pluto-1.0/portal/src/java/org/apache/pluto/portalImpl/Deploy.java:63: warning: [deprecation] org.apache.xml.serialize.XMLSerializer in org.apache.xml.serialize has been deprecated
    [javac] import org.apache.xml.serialize.XMLSerializer;
    [javac]                                ^
    [javac] /srv/gump/public/workspace/portals-pluto-1.0/portal/src/java/org/apache/pluto/portalImpl/core/PortalURL.java:179: warning: [deprecation] encode(java.lang.String) in java.net.URLEncoder has been deprecated
    [javac]         value = URLEncoder.encode(value);
    [javac]                           ^
    [javac] /srv/gump/public/workspace/portals-pluto-1.0/portal/src/java/org/apache/pluto/portalImpl/services/portletdefinitionregistry/PortletDefinitionRegistryServiceContextImpl.java:113: exception java.io.IOException is never thrown in body of corresponding try statement
    [javac]         } catch (IOException e) {
    [javac]           ^
    [javac] /srv/gump/public/workspace/portals-pluto-1.0/portal/src/java/org/apache/pluto/portalImpl/services/portletdefinitionregistry/PortletDefinitionRegistryServiceContextImpl.java:115: exception org.exolab.castor.mapping.MappingException is never thrown in body of corresponding try statement
    [javac]         } catch (MappingException e) {
    [javac]           ^
    [javac] /srv/gump/public/workspace/portals-pluto-1.0/portal/src/java/org/apache/pluto/portalImpl/services/portletdefinitionregistry/PortletDefinitionRegistryServiceFileImpl.java:233: warning: [deprecation] toURL() in java.io.File has been deprecated
    [javac]             source.setSystemId(portletXml.toURL().toExternalForm());
    [javac]                                          ^
    [javac] /srv/gump/public/workspace/portals-pluto-1.0/portal/src/java/org/apache/pluto/portlet/admin/services/DeployWarService.java:165: warning: [deprecation] org.apache.pluto.portalImpl.Deploy in org.apache.pluto.portalImpl has been deprecated
    [javac] 		            org.apache.pluto.portalImpl.Deploy.main(args);
    [javac] 		                                       ^
    [javac] Note: Some input files use unchecked or unsafe operations.
    [javac] Note: Recompile with -Xlint:unchecked for details.
    [javac] 2 errors
    [javac] 5 warnings

BUILD FAILED
/srv/gump/public/workspace/portals-pluto-1.0/build.xml:51: The following error occurred while executing this line:
/srv/gump/public/workspace/portals-pluto-1.0/portal/build.xml:50: Compile failed; see the compiler error output for details.

Total time: 20 seconds
---------------------------------------------

To subscribe to this information via syndicated feeds:
- RSS: http://vmgump.apache.org/gump/public/portals-pluto-1.0/portals-pluto-portal-1.0/rss.xml
- Atom: http://vmgump.apache.org/gump/public/portals-pluto-1.0/portals-pluto-portal-1.0/atom.xml

============================== Gump Tracking Only ===
Produced by Gump version 2.3.
Gump Run 05000005082009, vmgump:vmgump-public:05000005082009
Gump E-mail Identifier (unique within run) #75.


--
Apache Gump
http://gump.apache.org/ [Instance: vmgump]

---------------------------------------------------------------------
To unsubscribe, e-mail: general-unsubscribe@gump.apache.org
For additional commands, e-mail: general-help@gump.apache.org


Mime
View raw message