gump-general mailing list archives

Site index · List index
Message view « Date » · « Thread »
Top « Date » · « Thread »
From g...@vmgump.apache.org
Subject BATCH: All dressed up, with nowhere to go...
Date Thu, 11 Jun 2009 07:11:43 GMT
Dear Gumpmeisters,
            
The following 31 notifys should have been sent

*********************************************************** G U M P
[GUMP@vmgump]: Project apr-configure (in module apr) failed
[GUMP@vmgump]: Project gsbase (in module gsbase) failed
[GUMP@vmgump]: Project gsbase-test (in module gsbase) failed
[GUMP@vmgump]: Project jmock2 (in module jmock2) failed
[GUMP@vmgump]: Project derby (in module db-derby) failed
[GUMP@vmgump]: Project dotnet-antlib-test (in module ant-antlibs) failed
[GUMP@vmgump]: Project emma (in module emma) failed
[GUMP@vmgump]: Project slf4j (in module slf4j) failed
[GUMP@vmgump]: Project jtidy-cvs (in module jtidy) failed
[GUMP@vmgump]: Project castor-test (in module castor) failed
[GUMP@vmgump]: Project ws-commons-xmlschema (in module ws-axis2-commons) failed
[GUMP@vmgump]: Project xml-security-tests (in module xml-security) failed
[GUMP@vmgump]: Project authx-script-test (in module authx) failed
[GUMP@vmgump]: Project ws-commons-axiom (in module ws-axis2-commons) failed
[GUMP@vmgump]: Project JacORB-idllib (in module JacORB) failed
[GUMP@vmgump]: Project jetty (in module jetty) failed
[GUMP@vmgump]: Project ws-commons-policy (in module ws-axis2-commons) failed
[GUMP@vmgump]: Project commons-jci (in module apache-commons) failed
[GUMP@vmgump]: Module poi success, but with warnings.
[GUMP@vmgump]: Project maven (in module maven) failed
[GUMP@vmgump]: Project rat-test (in module rat) failed
[GUMP@vmgump]: Project maven-bootstrap (in module maven) failed
[GUMP@vmgump]: Project cocoon (in module cocoon) failed
[GUMP@vmgump]: Project kerberos-common (in module kerberos-shared) failed
[GUMP@vmgump]: Project naming-config-test (in module directory-naming) failed
[GUMP@vmgump]: Project tapestry (in module tapestry) failed
[GUMP@vmgump]: Project apacheds-shared (in module apacheds) failed
[GUMP@vmgump]: Project ldap-protocol (in module ldap-protocol) failed
[GUMP@vmgump]: Project portals-bridges-velocity (in module portals-bridges) failed
[GUMP@vmgump]: Project authx-example (in module authx) failed
[GUMP@vmgump]: Project portals-pluto-portal-1.0 (in module portals-pluto-1.0) failed
*********************************************************** G U M P
[GUMP@vmgump]: Project apr-configure (in module apr) failed
To whom it may engage...
        
This is an automated request, but not an unsolicited one. For 
more information please visit http://gump.apache.org/nagged.html, 
and/or contact the folk at general@gump.apache.org.

Project apr-configure has an issue affecting its community integration.
This issue affects 23 projects,
 and has been outstanding for 163 runs.
The current state of this project is 'Failed', with reason 'Build Failed'.
For reference only, the following projects are affected by this:
    - apache-httpd-buildconf :  Apache HTTP Server
    - apache-httpd-configure :  Apache HTTP Server
    - apache-httpd-make :  Apache HTTP Server
    - apache-httpd-make-install :  Apache HTTP Server
    - apr-configure :  Apache Portable Runtime
    - apr-iconv-buildconf :  Apache Portable Runtime
    - apr-iconv-configure :  Apache Portable Runtime
    - apr-iconv-make :  Apache Portable Runtime
    - apr-make :  Apache Portable Runtime
    - apr-make-install :  Apache Portable Runtime
    - apr-util-buildconf :  Apache Portable Runtime
    - apr-util-configure :  Apache Portable Runtime
    - apr-util-make :  Apache Portable Runtime
    - apr-util-make-install :  Apache Portable Runtime
    - jakarta-tomcat-jk-native :  Connectors to various web servers
    - jakarta-tomcat-jk-native-buildconf :  Connectors to various web servers
    - jakarta-tomcat-jk-native-configure :  Connectors to various web servers
    - logging-log4cxx-ant :  Apache log4cxx
    - logging-log4cxx-ant-no_wchar_t :  Apache log4cxx
    - logging-log4cxx-ant-static :  Apache log4cxx
    - logging-log4cxx-configure :  Apache log4cxx
    - logging-log4cxx-make :  Apache log4cxx
    - logging-log4cxx-make-install :  Apache log4cxx


Full details are available at:
    http://vmgump.apache.org/gump/public/apr/apr-configure/index.html

That said, some information snippets are provided here.

The following annotations (debug/informational/warning/error messages) were provided:
 -INFO- Failed with reason build failed



The following work was performed:
http://vmgump.apache.org/gump/public/apr/apr-configure/gump_work/buildscript_apr_apr-configure.html
Work Name: buildscript_apr_apr-configure (Type: Build)
Work ended in a state of : Failed
Elapsed: 3 mins 45 secs
Command Line: /srv/gump/public/workspace/apr/configure --prefix=/srv/gump/public/workspace/apr/dest-11062009 
[Working Directory: /srv/gump/public/workspace/apr]
---------------------------------------------
checking for sockaddr_storage... yes
checking for sockaddr_un... yes
checking for working AI_ADDRCONFIG... yes
checking if APR supports IPv6... yes
checking langinfo.h usability... yes
checking langinfo.h presence... yes
checking for langinfo.h... yes
checking for nl_langinfo... yes
Applying apr-util hints file rules for i686-pc-linux-gnu

checking for ldap support...
checking for default DBM... sdbm (default)
checking for pg_config... no
checking libpq-fe.h usability... no
checking libpq-fe.h presence... no
checking for libpq-fe.h... no
checking postgresql/libpq-fe.h usability... no
checking postgresql/libpq-fe.h presence... no
checking for postgresql/libpq-fe.h... no
checking sqlite3.h usability... no
checking sqlite3.h presence... no
checking for sqlite3.h... no
checking sqlite.h usability... no
checking sqlite.h presence... no
checking for sqlite.h... no
checking sybdb.h usability... no
checking sybdb.h presence... no
checking for sybdb.h... no
checking freetds/sybdb.h usability... no
checking freetds/sybdb.h presence... no
checking for freetds/sybdb.h... no
checking for odbc_config... no
checking sql.h usability... no
checking sql.h presence... no
checking for sql.h... no
checking odbc/sql.h usability... no
checking odbc/sql.h presence... no
checking for odbc/sql.h... no
checking Expat 1.95.x... no
checking old Debian-packaged expat... no
checking old FreeBSD-packaged expat... no
checking Expat 1.0/1.1... no
  setting LDFLAGS to "-L/usr/local/lib"
  setting INCLUDES to "-I/usr/local/include"
checking Expat 1.95.x in /usr/local... no
  nulling LDFLAGS
  nulling INCLUDES
configuring package in xml/expat now
/bin/bash: /srv/gump/public/workspace/apr/xml/expat/configure: No such file or directory
configure failed for xml/expat
---------------------------------------------

To subscribe to this information via syndicated feeds:
- RSS: http://vmgump.apache.org/gump/public/apr/apr-configure/rss.xml
- Atom: http://vmgump.apache.org/gump/public/apr/apr-configure/atom.xml

============================== Gump Tracking Only ===
Produced by Gump version 2.3.
Gump Run 06000011062009, vmgump:vmgump-public:06000011062009
Gump E-mail Identifier (unique within run) #3.

*********************************************************** G U M P
[GUMP@vmgump]: Project gsbase (in module gsbase) failed
To whom it may engage...
        
This is an automated request, but not an unsolicited one. For 
more information please visit http://gump.apache.org/nagged.html, 
and/or contact the folk at general@gump.apache.org.

Project gsbase has an issue affecting its community integration.
This issue affects 2 projects,
 and has been outstanding for 21 runs.
The current state of this project is 'Failed', with reason 'Build Failed'.
For reference only, the following projects are affected by this:
    - gsbase :  A collection of java utility classes
    - htmlunit :  A tool for testing web based applications


Full details are available at:
    http://vmgump.apache.org/gump/public/gsbase/gsbase/index.html

That said, some information snippets are provided here.

The following annotations (debug/informational/warning/error messages) were provided:
 -DEBUG- Sole output [gsbase-11062009.jar] identifier set to project name
 -DEBUG- (Gump generated) Maven Properties in: /srv/gump/public/workspace/gsbase/build.properties
 -INFO- Failed with reason build failed
 -DEBUG- Maven POM in: /srv/gump/public/workspace/gsbase/project.xml
 -DEBUG- Maven project properties in: /srv/gump/public/workspace/gsbase/project.properties
 -INFO- Failed to extract fallback artifacts from Gump Repository



The following work was performed:
http://vmgump.apache.org/gump/public/gsbase/gsbase/gump_work/build_gsbase_gsbase.html
Work Name: build_gsbase_gsbase (Type: Build)
Work ended in a state of : Failed
Elapsed: 6 secs
Command Line: maven --offline jar 
[Working Directory: /srv/gump/public/workspace/gsbase]
CLASSPATH: /usr/lib/jvm/java-6-sun/lib/tools.jar:/srv/gump/public/workspace/gsbase/target/classes:/srv/gump/public/workspace/junit/dist/junit-11062009.jar:/srv/gump/packages/junitperf-1.8/lib/junitperf.jar
---------------------------------------------
| |\/| / _` \ V / -_) ' \  ~ intelligent projects ~
|_|  |_\__,_|\_/\___|_||_|  v. 1.0.2

build:start:

java:prepare-filesystem:
    [mkdir] Created dir: /srv/gump/public/workspace/gsbase/target/classes

java:compile:
    [echo] Compiling to /srv/gump/public/workspace/gsbase/target/classes
    [echo] 
==========================================================

  NOTE: Targetting JVM 1.6, classes
  will not run on earlier JVMs

==========================================================
          
    [javac] Compiling 66 source files to /srv/gump/public/workspace/gsbase/target/classes
/srv/gump/public/workspace/gsbase/src/java/com/gargoylesoftware/base/resource/jdbc/StatementWrapper.java:65: com.gargoylesoftware.base.resource.jdbc.StatementWrapper is not abstract and does not override abstract method isPoolable() in java.sql.Statement
public class StatementWrapper implements Statement {
       ^
/srv/gump/public/workspace/gsbase/src/java/com/gargoylesoftware/base/resource/jdbc/PreparedStatementWrapper.java:64: com.gargoylesoftware.base.resource.jdbc.PreparedStatementWrapper is not abstract and does not override abstract method setNClob(int,java.io.Reader) in java.sql.PreparedStatement
public class PreparedStatementWrapper
       ^
/srv/gump/public/workspace/gsbase/src/java/com/gargoylesoftware/base/resource/jdbc/ConnectionWrapper.java:77: com.gargoylesoftware.base.resource.jdbc.ConnectionWrapper is not abstract and does not override abstract method createStruct(java.lang.String,java.lang.Object[]) in java.sql.Connection
public final class ConnectionWrapper implements Connection, ManagedResource {
             ^
/srv/gump/public/workspace/gsbase/src/java/com/gargoylesoftware/base/resource/jdbc/CallableStatementWrapper.java:81: com.gargoylesoftware.base.resource.jdbc.CallableStatementWrapper is not abstract and does not override abstract method setNClob(java.lang.String,java.io.Reader) in java.sql.CallableStatement
public final class CallableStatementWrapper
             ^
/srv/gump/public/workspace/gsbase/src/java/com/gargoylesoftware/base/resource/jdbc/DatabaseMetaDataWrapper.java:54: com.gargoylesoftware.base.resource.jdbc.DatabaseMetaDataWrapper is not abstract and does not override abstract method getFunctionColumns(java.lang.String,java.lang.String,java.lang.String,java.lang.String) in java.sql.DatabaseMetaData
public final class DatabaseMetaDataWrapper implements DatabaseMetaData {
             ^
/srv/gump/public/workspace/gsbase/src/java/com/gargoylesoftware/base/resource/jdbc/ResultSetWrapper.java:150: com.gargoylesoftware.base.resource.jdbc.ResultSetWrapper is not abstract and does not override abstract method updateNClob(java.lang.String,java.io.Reader) in java.sql.ResultSet
public final class ResultSetWrapper implements ResultSet {
             ^
Note: Some input files use unchecked or unsafe operations.
Note: Recompile with -Xlint:unchecked for details.
6 errors

BUILD FAILED
File...... /home/gump/.maven/cache/maven-java-plugin-1.5/plugin.jelly
Element... ant:javac
Line...... 63
Column.... 48
Compile failed; see the compiler error output for details.
Total time: 5 seconds
Finished at: Wed Jun 10 23:56:14 GMT-08:00 2009

---------------------------------------------

To subscribe to this information via syndicated feeds:
- RSS: http://vmgump.apache.org/gump/public/gsbase/gsbase/rss.xml
- Atom: http://vmgump.apache.org/gump/public/gsbase/gsbase/atom.xml

============================== Gump Tracking Only ===
Produced by Gump version 2.3.
Gump Run 06000011062009, vmgump:vmgump-public:06000011062009
Gump E-mail Identifier (unique within run) #4.

*********************************************************** G U M P
[GUMP@vmgump]: Project gsbase-test (in module gsbase) failed
To whom it may engage...
        
This is an automated request, but not an unsolicited one. For 
more information please visit http://gump.apache.org/nagged.html, 
and/or contact the folk at general@gump.apache.org.

Project gsbase-test has an issue affecting its community integration.
This issue affects 1 projects,
 and has been outstanding for 21 runs.
The current state of this project is 'Failed', with reason 'Build Failed'.
For reference only, the following projects are affected by this:
    - gsbase-test :  A collection of java utility classes


Full details are available at:
    http://vmgump.apache.org/gump/public/gsbase/gsbase-test/index.html

That said, some information snippets are provided here.

The following annotations (debug/informational/warning/error messages) were provided:
 -WARNING- Overriding Maven properties: [/srv/gump/public/workspace/gsbase/build.properties]
 -DEBUG- (Gump generated) Maven Properties in: /srv/gump/public/workspace/gsbase/build.properties
 -INFO- Failed with reason build failed
 -DEBUG- Maven POM in: /srv/gump/public/workspace/gsbase/project.xml
 -DEBUG- Maven project properties in: /srv/gump/public/workspace/gsbase/project.properties



The following work was performed:
http://vmgump.apache.org/gump/public/gsbase/gsbase-test/gump_work/build_gsbase_gsbase-test.html
Work Name: build_gsbase_gsbase-test (Type: Build)
Work ended in a state of : Failed
Elapsed: 5 secs
Command Line: maven --offline jar 
[Working Directory: /srv/gump/public/workspace/gsbase]
CLASSPATH: /usr/lib/jvm/java-6-sun/lib/tools.jar:/srv/gump/public/workspace/gsbase/target/classes:/srv/gump/public/workspace/junit/dist/junit-11062009.jar:/srv/gump/packages/junitperf-1.8/lib/junitperf.jar
---------------------------------------------
|  \/  |__ _Apache__ ___
| |\/| / _` \ V / -_) ' \  ~ intelligent projects ~
|_|  |_\__,_|\_/\___|_||_|  v. 1.0.2

build:start:

java:prepare-filesystem:

java:compile:
    [echo] Compiling to /srv/gump/public/workspace/gsbase/target/classes
    [echo] 
==========================================================

  NOTE: Targetting JVM 1.6, classes
  will not run on earlier JVMs

==========================================================
          
    [javac] Compiling 60 source files to /srv/gump/public/workspace/gsbase/target/classes
/srv/gump/public/workspace/gsbase/src/java/com/gargoylesoftware/base/resource/jdbc/StatementWrapper.java:65: com.gargoylesoftware.base.resource.jdbc.StatementWrapper is not abstract and does not override abstract method isPoolable() in java.sql.Statement
public class StatementWrapper implements Statement {
       ^
/srv/gump/public/workspace/gsbase/src/java/com/gargoylesoftware/base/resource/jdbc/PreparedStatementWrapper.java:64: com.gargoylesoftware.base.resource.jdbc.PreparedStatementWrapper is not abstract and does not override abstract method setNClob(int,java.io.Reader) in java.sql.PreparedStatement
public class PreparedStatementWrapper
       ^
/srv/gump/public/workspace/gsbase/src/java/com/gargoylesoftware/base/resource/jdbc/ConnectionWrapper.java:77: com.gargoylesoftware.base.resource.jdbc.ConnectionWrapper is not abstract and does not override abstract method createStruct(java.lang.String,java.lang.Object[]) in java.sql.Connection
public final class ConnectionWrapper implements Connection, ManagedResource {
             ^
/srv/gump/public/workspace/gsbase/src/java/com/gargoylesoftware/base/resource/jdbc/CallableStatementWrapper.java:81: com.gargoylesoftware.base.resource.jdbc.CallableStatementWrapper is not abstract and does not override abstract method setNClob(java.lang.String,java.io.Reader) in java.sql.CallableStatement
public final class CallableStatementWrapper
             ^
/srv/gump/public/workspace/gsbase/src/java/com/gargoylesoftware/base/resource/jdbc/DatabaseMetaDataWrapper.java:54: com.gargoylesoftware.base.resource.jdbc.DatabaseMetaDataWrapper is not abstract and does not override abstract method getFunctionColumns(java.lang.String,java.lang.String,java.lang.String,java.lang.String) in java.sql.DatabaseMetaData
public final class DatabaseMetaDataWrapper implements DatabaseMetaData {
             ^
/srv/gump/public/workspace/gsbase/src/java/com/gargoylesoftware/base/resource/jdbc/ResultSetWrapper.java:150: com.gargoylesoftware.base.resource.jdbc.ResultSetWrapper is not abstract and does not override abstract method updateNClob(java.lang.String,java.io.Reader) in java.sql.ResultSet
public final class ResultSetWrapper implements ResultSet {
             ^
Note: Some input files use unchecked or unsafe operations.
Note: Recompile with -Xlint:unchecked for details.
6 errors

BUILD FAILED
File...... /home/gump/.maven/cache/maven-java-plugin-1.5/plugin.jelly
Element... ant:javac
Line...... 63
Column.... 48
Compile failed; see the compiler error output for details.
Total time: 4 seconds
Finished at: Wed Jun 10 23:58:27 GMT-08:00 2009

---------------------------------------------

To subscribe to this information via syndicated feeds:
- RSS: http://vmgump.apache.org/gump/public/gsbase/gsbase-test/rss.xml
- Atom: http://vmgump.apache.org/gump/public/gsbase/gsbase-test/atom.xml

============================== Gump Tracking Only ===
Produced by Gump version 2.3.
Gump Run 06000011062009, vmgump:vmgump-public:06000011062009
Gump E-mail Identifier (unique within run) #5.

*********************************************************** G U M P
[GUMP@vmgump]: Project jmock2 (in module jmock2) failed
To whom it may engage...
        
This is an automated request, but not an unsolicited one. For 
more information please visit http://gump.apache.org/nagged.html, 
and/or contact the folk at general@gump.apache.org.

Project jmock2 has an issue affecting its community integration.
This issue affects 1 projects,
 and has been outstanding for 21 runs.
The current state of this project is 'Failed', with reason 'Build Failed'.
For reference only, the following projects are affected by this:
    - jmock2 :  jMock is a library for testing Java code using mock objects.


Full details are available at:
    http://vmgump.apache.org/gump/public/jmock2/jmock2/index.html

That said, some information snippets are provided here.

The following annotations (debug/informational/warning/error messages) were provided:
 -INFO- Failed with reason build failed
 -INFO- Failed to extract fallback artifacts from Gump Repository



The following work was performed:
http://vmgump.apache.org/gump/public/jmock2/jmock2/gump_work/build_jmock2_jmock2.html
Work Name: build_jmock2_jmock2 (Type: Build)
Work ended in a state of : Failed
Elapsed: 6 secs
Command Line: /usr/lib/jvm/java-6-sun/bin/java -Djava.awt.headless=true -Xbootclasspath/p:/srv/gump/public/workspace/xml-xerces2/build/xercesImpl.jar:/srv/gump/public/workspace/xml-commons/java/external/build/xml-apis.jar org.apache.tools.ant.Main -Dgump.merge=/srv/gump/public/gump/work/merge.xml -Dbuild.sysclasspath=only -Dversion=11062009 
[Working Directory: /srv/gump/public/workspace/jmock2]
CLASSPATH: /usr/lib/jvm/java-6-sun/lib/tools.jar:/srv/gump/public/workspace/jmock2/build/classes:/srv/gump/public/workspace/jmock2/lib/objenesis-1.0.jar:/srv/gump/public/workspace/ant/dist/lib/ant-jmf.jar:/srv/gump/public/workspace/ant/dist/lib/ant-swing.jar:/srv/gump/public/workspace/ant/dist/lib/ant-apache-resolver.jar:/srv/gump/public/workspace/ant/dist/lib/ant-apache-xalan2.jar:/srv/gump/public/workspace/ant/dist/lib/ant-trax.jar:/srv/gump/public/workspace/ant/dist/lib/ant-junit.jar:/srv/gump/public/workspace/ant/dist/lib/ant-launcher.jar:/srv/gump/public/workspace/ant/dist/lib/ant-nodeps.jar:/srv/gump/public/workspace/ant/dist/lib/ant.jar:/srv/gump/packages/bsh-2.0b4/bsh-commands-2.0b4.jar:/srv/gump/packages/bsh-2.0b4/bsh-classpath-2.0b4.jar:/srv/gump/packages/bsh-2.0b4/bsh-core-2.0b4.jar:/srv/gump/packages/bsh-2.0b4/bsh-bsf-2.0b4.jar:/srv/gump/packages/bsh-2.0b4/bsh-2.0b4.jar:/srv/gump/packages/bsh-2.0b4/bsh-reflect-2.0b4.jar:/srv/gump/packages/bsh-2.0b4/bsh-util-2.0b4.
 jar:/srv/gump/packages/cglib/cglib-nodep-2.1_3.jar:/srv/gump/public/workspace/hamcrest/hamcrest-java/build/hamcrest-core-11062009.jar:/srv/gump/public/workspace/hamcrest/hamcrest-java/build/hamcrest-library-11062009.jar:/srv/gump/public/workspace/junit/dist/junit-11062009.jar:/srv/gump/packages/junit3.8.1/junit.jar:/srv/gump/public/workspace/xml-commons/java/external/build/xml-apis-ext.jar
---------------------------------------------
    [javac] /srv/gump/public/workspace/jmock2/test/org/jmock/test/unit/lib/CurrentStateMatcherTest.java:34: cannot find symbol
    [javac] symbol  : method assertTrue(java.lang.String,boolean)
    [javac] location: class org.jmock.test.unit.lib.CurrentStateMatcherTest
    [javac]         assertTrue("should match", isNotCurrently("S").matches(stateMachine));
    [javac]         ^
    [javac] /srv/gump/public/workspace/jmock2/test/org/jmock/test/unit/lib/CurrentStateMatcherTest.java:38: cannot find symbol
    [javac] symbol  : method assertTrue(java.lang.String,boolean)
    [javac] location: class org.jmock.test.unit.lib.CurrentStateMatcherTest
    [javac]         assertTrue("should not match", !isCurrentlyS.matches(null));
    [javac]         ^
    [javac] /srv/gump/public/workspace/jmock2/test/org/jmock/test/unit/lib/CurrentStateMatcherTest.java:42: cannot find symbol
    [javac] symbol  : method assertTrue(java.lang.String,boolean)
    [javac] location: class org.jmock.test.unit.lib.CurrentStateMatcherTest
    [javac]         assertTrue("should not match", !isCurrentlyS.matches("something else"));
    [javac]         ^
    [javac] /srv/gump/public/workspace/jmock2/test/org/jmock/test/unit/lib/CurrentStateMatcherTest.java:46: cannot find symbol
    [javac] symbol  : method assertEquals(java.lang.String,java.lang.String)
    [javac] location: class org.jmock.test.unit.lib.CurrentStateMatcherTest
    [javac]         assertEquals("a state machine that is S", asString(isCurrently("S")));
    [javac]         ^
    [javac] /srv/gump/public/workspace/jmock2/test/org/jmock/test/unit/lib/CurrentStateMatcherTest.java:47: cannot find symbol
    [javac] symbol  : method assertEquals(java.lang.String,java.lang.String)
    [javac] location: class org.jmock.test.unit.lib.CurrentStateMatcherTest
    [javac]         assertEquals("a state machine that is not S", asString(isNotCurrently("S")));
    [javac]         ^
    [javac] /srv/gump/public/workspace/jmock2/test/org/jmock/test/unit/lib/CurrentStateMatcherTest.java:53: cannot find symbol
    [javac] symbol  : method assertMismatchDescription(java.lang.String,org.hamcrest.Matcher<org.jmock.States>,org.jmock.States)
    [javac] location: class org.jmock.test.unit.lib.CurrentStateMatcherTest
    [javac]         assertMismatchDescription("was not S", isCurrently("S"), stateMachine);
    [javac]         ^
    [javac] /srv/gump/public/workspace/jmock2/test/org/jmock/test/unit/lib/CurrentStateMatcherTest.java:56: method does not override or implement a method from a supertype
    [javac]     @Override
    [javac]     ^
    [javac] /srv/gump/public/workspace/jmock2/test/org/jmock/test/unit/support/SyntheticEmptyInterfaceClassLoader.java:35: cannot find symbol
    [javac] symbol  : variable COMPUTE_MAXS
    [javac] location: class net.sf.cglib.asm.ClassWriter
    [javac]         ClassWriter writer = new ClassWriter(ClassWriter.COMPUTE_MAXS);
    [javac]                                                         ^
    [javac] /srv/gump/public/workspace/jmock2/test/org/jmock/test/unit/support/SyntheticEmptyInterfaceClassLoader.java:35: internal error; cannot instantiate ClassWriter(boolean) at net.sf.cglib.asm.ClassWriter to ()
    [javac]         ClassWriter writer = new ClassWriter(ClassWriter.COMPUTE_MAXS);
    [javac]                              ^
    [javac] /srv/gump/public/workspace/jmock2/test/org/jmock/test/unit/support/SyntheticEmptyInterfaceClassLoader.java:36: visit(int,int,java.lang.String,java.lang.String,java.lang.String[],java.lang.String) in net.sf.cglib.asm.ClassWriter cannot be applied to (int,int,java.lang.String,<nulltype>,java.lang.String,<nulltype>)
    [javac]                 writer.visit(CLASS_FORMAT_VERSION,
    [javac]                       ^
    [javac] 34 errors

BUILD FAILED
/srv/gump/public/workspace/jmock2/build.xml:61: Compile failed; see the compiler error output for details.

Total time: 5 seconds
---------------------------------------------

To subscribe to this information via syndicated feeds:
- RSS: http://vmgump.apache.org/gump/public/jmock2/jmock2/rss.xml
- Atom: http://vmgump.apache.org/gump/public/jmock2/jmock2/atom.xml

============================== Gump Tracking Only ===
Produced by Gump version 2.3.
Gump Run 06000011062009, vmgump:vmgump-public:06000011062009
Gump E-mail Identifier (unique within run) #7.

*********************************************************** G U M P
[GUMP@vmgump]: Project derby (in module db-derby) failed
To whom it may engage...
        
This is an automated request, but not an unsolicited one. For 
more information please visit http://gump.apache.org/nagged.html, 
and/or contact the folk at general@gump.apache.org.

Project derby has an issue affecting its community integration.
This issue affects 1 projects,
 and has been outstanding for 21 runs.
The current state of this project is 'Failed', with reason 'Build Failed'.
For reference only, the following projects are affected by this:
    - derby :  Apache Derby, 100% Java relational database.


Full details are available at:
    http://vmgump.apache.org/gump/public/db-derby/derby/index.html

That said, some information snippets are provided here.

The following annotations (debug/informational/warning/error messages) were provided:
 -INFO- Failed with reason build failed
 -INFO- Failed to extract fallback artifacts from Gump Repository



The following work was performed:
http://vmgump.apache.org/gump/public/db-derby/derby/gump_work/build_db-derby_derby.html
Work Name: build_db-derby_derby (Type: Build)
Work ended in a state of : Failed
Elapsed: 1 min 5 secs
Command Line: /usr/lib/jvm/java-6-sun/bin/java -Djava.awt.headless=true -Xbootclasspath/p:/srv/gump/public/workspace/xml-commons/java/external/build/xml-apis.jar:/srv/gump/public/workspace/xml-xerces2/build/xercesImpl.jar:/srv/gump/public/workspace/xml-xalan/build/serializer.jar:/srv/gump/public/workspace/xml-xalan/build/xalan-unbundled.jar org.apache.tools.ant.Main -Dgump.merge=/srv/gump/public/gump/work/merge.xml -Dbuild.sysclasspath=only -Dsane=false gump_all 
[Working Directory: /srv/gump/public/workspace/db-derby]
CLASSPATH: /usr/lib/jvm/java-6-sun/lib/tools.jar:/srv/gump/public/workspace/db-derby/classes:/srv/gump/public/workspace/ant/dist/lib/ant-jmf.jar:/srv/gump/public/workspace/ant/dist/lib/ant-swing.jar:/srv/gump/public/workspace/ant/dist/lib/ant-apache-resolver.jar:/srv/gump/public/workspace/ant/dist/lib/ant-apache-xalan2.jar:/srv/gump/public/workspace/ant/dist/lib/ant-trax.jar:/srv/gump/public/workspace/ant/dist/lib/ant-junit.jar:/srv/gump/public/workspace/ant/dist/lib/ant-launcher.jar:/srv/gump/public/workspace/ant/dist/lib/ant-nodeps.jar:/srv/gump/public/workspace/ant/dist/lib/ant.jar:/srv/gump/public/workspace/xml-commons/java/external/build/xml-apis-ext.jar:/srv/gump/public/workspace/jakarta-servletapi-5/jsr154/dist/lib/servlet-api.jar:/srv/gump/public/workspace/jakarta-oro/jakarta-oro-11062009.jar:/srv/gump/packages/javacc-3.1/bin/lib/javacc.jar:/srv/gump/public/workspace/junit/dist/junit-11062009.jar
---------------------------------------------
engine_169:

compile_reference:
    [javac] Compiling 11 source files to /srv/gump/public/workspace/db-derby/classes
    [javac] Compiling 2 source files to /srv/gump/public/workspace/db-derby/classes

compile_authentication:
    [javac] Compiling 2 source files to /srv/gump/public/workspace/db-derby/classes

authentication:

compile_security:
    [javac] Compiling 2 source files to /srv/gump/public/workspace/db-derby/classes

security:

compile_mbeans:
    [javac] Compiling 4 source files to /srv/gump/public/workspace/db-derby/classes

compile_io:

storage:

compile_iapi_error_jsr169:

compile_reference:
    [javac] Compiling 2 source files to /srv/gump/public/workspace/db-derby/classes

compile_util:

compile_types:
    [javac] Compiling 1 source file to /srv/gump/public/workspace/db-derby/classes
    [javac] /srv/gump/public/workspace/db-derby/java/engine/org/apache/derby/impl/jdbc/EmbedStatement.java:60: org.apache.derby.impl.jdbc.EmbedStatement is not abstract and does not override abstract method isWrapperFor(java.lang.Class) in java.sql.Wrapper
    [javac] public class EmbedStatement extends ConnectionChild
    [javac]        ^
    [javac] /srv/gump/public/workspace/db-derby/java/engine/org/apache/derby/impl/jdbc/EmbedResultSetMetaData.java:59: org.apache.derby.impl.jdbc.EmbedResultSetMetaData is not abstract and does not override abstract method isWrapperFor(java.lang.Class) in java.sql.Wrapper
    [javac] public class EmbedResultSetMetaData
    [javac]        ^
    [javac] /srv/gump/public/workspace/db-derby/java/engine/org/apache/derby/impl/jdbc/EmbedDatabaseMetaData.java:88: org.apache.derby.impl.jdbc.EmbedDatabaseMetaData is not abstract and does not override abstract method autoCommitFailureClosesAllResultSets() in java.sql.DatabaseMetaData
    [javac] public class EmbedDatabaseMetaData extends ConnectionChild 
    [javac]        ^
    [javac] 3 errors

BUILD FAILED
/srv/gump/public/workspace/db-derby/build.xml:452: The following error occurred while executing this line:
/srv/gump/public/workspace/db-derby/java/engine/build.xml:79: The following error occurred while executing this line:
/srv/gump/public/workspace/db-derby/java/engine/org/apache/derby/iapi/build.xml:65: The following error occurred while executing this line:
/srv/gump/public/workspace/db-derby/java/engine/org/apache/derby/iapi/types/build.xml:53: Compile failed; see the compiler error output for details.

Total time: 1 minute 3 seconds
---------------------------------------------

To subscribe to this information via syndicated feeds:
- RSS: http://vmgump.apache.org/gump/public/db-derby/derby/rss.xml
- Atom: http://vmgump.apache.org/gump/public/db-derby/derby/atom.xml

============================== Gump Tracking Only ===
Produced by Gump version 2.3.
Gump Run 06000011062009, vmgump:vmgump-public:06000011062009
Gump E-mail Identifier (unique within run) #8.

*********************************************************** G U M P
[GUMP@vmgump]: Project dotnet-antlib-test (in module ant-antlibs) failed
To whom it may engage...
        
This is an automated request, but not an unsolicited one. For 
more information please visit http://gump.apache.org/nagged.html, 
and/or contact the folk at general@gump.apache.org.

Project dotnet-antlib-test has an issue affecting its community integration.
This issue affects 1 projects,
 and has been outstanding for 21 runs.
The current state of this project is 'Failed', with reason 'Build Failed'.
For reference only, the following projects are affected by this:
    - dotnet-antlib-test :  Task and Type Libraries for Apache Ant


Full details are available at:
    http://vmgump.apache.org/gump/public/ant-antlibs/dotnet-antlib-test/index.html

That said, some information snippets are provided here.

The following annotations (debug/informational/warning/error messages) were provided:
 -INFO- Failed with reason build failed



The following work was performed:
http://vmgump.apache.org/gump/public/ant-antlibs/dotnet-antlib-test/gump_work/build_ant-antlibs_dotnet-antlib-test.html
Work Name: build_ant-antlibs_dotnet-antlib-test (Type: Build)
Work ended in a state of : Failed
Elapsed: 17 secs
Command Line: /usr/lib/jvm/java-6-sun/bin/java -Djava.awt.headless=true -Xbootclasspath/p:/srv/gump/public/workspace/xml-xerces2/build/xercesImpl.jar:/srv/gump/public/workspace/xml-commons/java/external/build/xml-apis.jar org.apache.tools.ant.Main -Dgump.merge=/srv/gump/public/gump/work/merge.xml -Dbuild.sysclasspath=only -Dant-testutil.jar=/srv/gump/public/workspace/ant/build/lib/ant-testutil.jar test 
[Working Directory: /srv/gump/public/workspace/ant-antlibs/dotnet]
CLASSPATH: /usr/lib/jvm/java-6-sun/lib/tools.jar:/srv/gump/public/workspace/ant-antlibs/dotnet/build/test-classes:/srv/gump/public/workspace/ant/dist/lib/ant-jmf.jar:/srv/gump/public/workspace/ant/dist/lib/ant-swing.jar:/srv/gump/public/workspace/ant/dist/lib/ant-apache-resolver.jar:/srv/gump/public/workspace/ant/dist/lib/ant-apache-xalan2.jar:/srv/gump/public/workspace/ant/dist/lib/ant-trax.jar:/srv/gump/public/workspace/ant/dist/lib/ant-junit.jar:/srv/gump/public/workspace/ant/dist/lib/ant-launcher.jar:/srv/gump/public/workspace/ant/dist/lib/ant-nodeps.jar:/srv/gump/public/workspace/ant/dist/lib/ant.jar:/srv/gump/public/workspace/ant-antlibs/antunit/build/ant-antunit-11062009.jar:/srv/gump/public/workspace/ant-antlibs/dotnet/build/ant-dotnet-11062009.jar:/srv/gump/public/workspace/xml-commons/java/external/build/xml-apis-ext.jar
---------------------------------------------
[au:antunit] Target: test-passing took 0.008 sec
[au:antunit] Build File: /srv/gump/public/workspace/ant-antlibs/dotnet/src/tests/antunit/dir with spaces/wsdl-test.xml
[au:antunit] Tests run: 1, Failures: 0, Errors: 0, Time elapsed: 1.167 sec
[au:antunit] Target: testWSDL took 1.163 sec
[au:antunit] Build File: /srv/gump/public/workspace/ant-antlibs/dotnet/src/tests/antunit/dotnetexec-test.xml
[au:antunit] Tests run: 2, Failures: 0, Errors: 0, Time elapsed: 1.468 sec
[au:antunit] Target: testCSC took 0.777 sec
[au:antunit] Target: testCSCNoConfig took 0.644 sec
[au:antunit] Build File: /srv/gump/public/workspace/ant-antlibs/dotnet/src/tests/antunit/nunit/nunit-test.xml
[au:antunit] Tests run: 5, Failures: 0, Errors: 0, Time elapsed: 0.1 sec
[au:antunit] Target: test-passing took 0.006 sec
[au:antunit] Target: test-failing took 0.003 sec
[au:antunit] Target: test-failing-errorproperty took 0.002 sec
[au:antunit] Target: test-failing-with-fail took 0 sec
[au:antunit] Target: test-no-assembly took 0.015 sec
[au:antunit] Build File: /srv/gump/public/workspace/ant-antlibs/dotnet/src/tests/antunit/old-core-test.xml
[au:antunit] Tests run: 9, Failures: 0, Errors: 0, Time elapsed: 5.339 sec
[au:antunit] Target: testCSCintrinsicFileset took 0.793 sec
[au:antunit] Target: testCSCresponseFile took 0.617 sec
[au:antunit] Target: testILASM took 0.776 sec
[au:antunit] Target: testCSCdll took 0.632 sec
[au:antunit] Target: testILDASM took 0.686 sec
[au:antunit] Target: testILDASM_empty took 0.176 sec
[au:antunit] Target: testJsharp took 0.022 sec
[au:antunit] Target: testCSCResources took 0.723 sec
[au:antunit] Target: testCSC took 0.754 sec
[au:antunit] Build File: /srv/gump/public/workspace/ant-antlibs/dotnet/src/tests/antunit/wsdl2dotnet-test.xml
[au:antunit] Tests run: 15, Failures: 0, Errors: 0, Time elapsed: 3.426 sec
[au:antunit] Target: testSchemaMustBeSet took 0.024 sec
[au:antunit] Target: testLocalWsdlVB took 0.007 sec
[au:antunit] Target: testInvalidExtraOps took 0.005 sec
[au:antunit] Target: testSrcIsMissing took 0.014 sec
[au:antunit] Target: testNoParams took 0.009 sec
[au:antunit] Target: testBothSrc took 0.011 sec
[au:antunit] Target: testSchemaFileMustHaveOneOptionOnly took 0.009 sec
[au:antunit] Target: testLocalWsdl took 1.5 sec
[au:antunit] Target: testSrcIsDir took 0.031 sec
[au:antunit] Target: testLocalWsdlServerVB took 0.096 sec
[au:antunit] Target: testLocalWsdlServer took 1.45 sec
[au:antunit] Target: testNoSrc took 0.04 sec
[au:antunit] Target: testSchemaFileMustExist took 0.015 sec
[au:antunit] Target: testInvalidExtraOpsVB took 0.008 sec
[au:antunit] Target: testDestIsDir took 0.012 sec

test:

BUILD FAILED
/srv/gump/public/workspace/ant-antlibs/dotnet/common/build.xml:222: At least one AntUnit test has failed.

Total time: 16 seconds
---------------------------------------------

To subscribe to this information via syndicated feeds:
- RSS: http://vmgump.apache.org/gump/public/ant-antlibs/dotnet-antlib-test/rss.xml
- Atom: http://vmgump.apache.org/gump/public/ant-antlibs/dotnet-antlib-test/atom.xml

============================== Gump Tracking Only ===
Produced by Gump version 2.3.
Gump Run 06000011062009, vmgump:vmgump-public:06000011062009
Gump E-mail Identifier (unique within run) #9.

*********************************************************** G U M P
[GUMP@vmgump]: Project emma (in module emma) failed
To whom it may engage...
        
This is an automated request, but not an unsolicited one. For 
more information please visit http://gump.apache.org/nagged.html, 
and/or contact the folk at general@gump.apache.org.

Project emma has an issue affecting its community integration.
This issue affects 1 projects,
 and has been outstanding for 289 runs.
The current state of this project is 'Failed', with reason 'Build Failed'.
For reference only, the following projects are affected by this:
    - emma :  code coverage tool


Full details are available at:
    http://vmgump.apache.org/gump/public/emma/emma/index.html

That said, some information snippets are provided here.

The following annotations (debug/informational/warning/error messages) were provided:
 -INFO- Failed with reason build failed
 -INFO- Failed to extract fallback artifacts from Gump Repository



The following work was performed:
http://vmgump.apache.org/gump/public/emma/emma/gump_work/build_emma_emma.html
Work Name: build_emma_emma (Type: Build)
Work ended in a state of : Failed
Elapsed: 7 secs
Command Line: /usr/lib/jvm/java-6-sun/bin/java -Djava.awt.headless=true -Xbootclasspath/p:/srv/gump/public/workspace/xml-commons/java/external/build/xml-apis.jar:/srv/gump/public/workspace/xml-xerces2/build/xercesImpl.jar org.apache.tools.ant.Main -Dgump.merge=/srv/gump/public/gump/work/merge.xml -Dbuild.sysclasspath=only -Dapp.short.name=emma-11062009 
[Working Directory: /srv/gump/public/workspace/emma]
CLASSPATH: /usr/lib/jvm/java-6-sun/lib/tools.jar:/srv/gump/public/workspace/emma/out/core/classes:/srv/gump/public/workspace/emma/out/ant/classes:/srv/gump/public/workspace/emma/lib/internal/stamptool.jar:/srv/gump/public/workspace/ant/dist/lib/ant-jmf.jar:/srv/gump/public/workspace/ant/dist/lib/ant-swing.jar:/srv/gump/public/workspace/ant/dist/lib/ant-apache-resolver.jar:/srv/gump/public/workspace/ant/dist/lib/ant-apache-xalan2.jar:/srv/gump/public/workspace/ant/dist/lib/ant-trax.jar:/srv/gump/public/workspace/ant/dist/lib/ant-junit.jar:/srv/gump/public/workspace/ant/dist/lib/ant-launcher.jar:/srv/gump/public/workspace/ant/dist/lib/ant-nodeps.jar:/srv/gump/public/workspace/ant/dist/lib/ant.jar:/srv/gump/public/workspace/xml-commons/java/external/build/xml-apis-ext.jar
---------------------------------------------
timestamp:

-pre-compile:

core.bootstrap.compile:
    [javac] Compiling 2 source files to /srv/gump/public/workspace/emma/out/core/classes
    [javac] 
    [javac]           WARNING
    [javac] 
    [javac] The -source switch defaults to 1.5 in JDK 1.5 and 1.6.
    [javac] If you specify -target 1.2 you now must also specify -source 1.2.
    [javac] Ant will implicitly add -source 1.2 for you.  Please change your build file.

core.java14.compile:
    [javac] Compiling 1 source file to /srv/gump/public/workspace/emma/out/core/classes
    [javac] 
    [javac]           WARNING
    [javac] 
    [javac] The -source switch defaults to 1.5 in JDK 1.5 and 1.6.
    [javac] If you specify -target 1.2 you now must also specify -source 1.2.
    [javac] Ant will implicitly add -source 1.2 for you.  Please change your build file.

core.java13.compile:
    [javac] Compiling 1 source file to /srv/gump/public/workspace/emma/out/core/classes
    [javac] 
    [javac]           WARNING
    [javac] 
    [javac] The -source switch defaults to 1.5 in JDK 1.5 and 1.6.
    [javac] If you specify -target 1.2 you now must also specify -source 1.2.
    [javac] Ant will implicitly add -source 1.2 for you.  Please change your build file.

core.compile:
    [javac] Compiling 175 source files to /srv/gump/public/workspace/emma/out/core/classes
    [javac] 
    [javac]           WARNING
    [javac] 
    [javac] The -source switch defaults to 1.5 in JDK 1.5 and 1.6.
    [javac] If you specify -target 1.2 you now must also specify -source 1.2.
    [javac] Ant will implicitly add -source 1.2 for you.  Please change your build file.
    [javac] /srv/gump/public/workspace/emma/core/java12/com/vladium/emma/run/InstrClassLoader.java:346: reference to CodeSource is ambiguous, both method CodeSource(java.net.URL,java.security.cert.Certificate[]) in java.security.CodeSource and method CodeSource(java.net.URL,java.security.CodeSigner[]) in java.security.CodeSource match
    [javac]         final CodeSource csrc = new CodeSource (srcURL, null);
    [javac]                                 ^
    [javac] Note: Some input files use or override a deprecated API.
    [javac] Note: Recompile with -Xlint:deprecation for details.
    [javac] 1 error

BUILD FAILED
/srv/gump/public/workspace/emma/build.xml:297: Compile failed; see the compiler error output for details.

Total time: 6 seconds
---------------------------------------------

To subscribe to this information via syndicated feeds:
- RSS: http://vmgump.apache.org/gump/public/emma/emma/rss.xml
- Atom: http://vmgump.apache.org/gump/public/emma/emma/atom.xml

============================== Gump Tracking Only ===
Produced by Gump version 2.3.
Gump Run 06000011062009, vmgump:vmgump-public:06000011062009
Gump E-mail Identifier (unique within run) #12.

*********************************************************** G U M P
[GUMP@vmgump]: Project slf4j (in module slf4j) failed
To whom it may engage...
        
This is an automated request, but not an unsolicited one. For 
more information please visit http://gump.apache.org/nagged.html, 
and/or contact the folk at general@gump.apache.org.

Project slf4j has an issue affecting its community integration.
This issue affects 2 projects,
 and has been outstanding for 2 runs.
The current state of this project is 'Failed', with reason 'Build Failed'.
For reference only, the following projects are affected by this:
    - slf4j :  Simple Logging Facade for Java
    - slf4j-test :  Simple Logging Facade for Java


Full details are available at:
    http://vmgump.apache.org/gump/public/slf4j/slf4j/index.html

That said, some information snippets are provided here.

The following annotations (debug/informational/warning/error messages) were provided:
 -DEBUG- (Gump generated) Maven2 Settings in: /srv/gump/public/workspace/slf4j/gump_mvn_settings.xml
 -INFO- Failed with reason build failed
 -DEBUG- Maven POM in: /srv/gump/public/workspace/slf4j/pom.xml
 -DEBUG- Extracted fallback artifacts from Gump Repository



The following work was performed:
http://vmgump.apache.org/gump/public/slf4j/slf4j/gump_work/build_slf4j_slf4j.html
Work Name: build_slf4j_slf4j (Type: Build)
Work ended in a state of : Failed
Elapsed: 1 min 15 secs
Command Line: mvn --batch-mode -Dmaven.test.skip.exec=true --settings /srv/gump/public/workspace/slf4j/gump_mvn_settings.xml install 
[Working Directory: /srv/gump/public/workspace/slf4j]
CLASSPATH: /usr/lib/jvm/java-6-sun/lib/tools.jar:/srv/gump/public/workspace/apache-commons/collections/build/commons-collections-11062009.jar:/srv/gump/public/workspace/apache-commons/logging/target/commons-logging-api-11062009.jar:/srv/gump/public/workspace/logging-log4j-12/dist/lib/log4j-11062009.jar:/srv/gump/public/workspace/xml-commons/java/external/build/xml-apis-ext.jar
---------------------------------------------
Downloading: http://localhost:8192/maven2/ant/ant-junit/1.6.5/ant-junit-1.6.5.pom
146b downloaded
Downloading: http://localhost:8192/maven2/ant/ant-junit/1.6.5/ant-junit-1.6.5.jar
98K downloaded
[INFO] [compiler:compile]
[INFO] Nothing to compile - all classes are up to date
[INFO] [resources:testResources]
[WARNING] Using platform encoding (UTF-8 actually) to copy filtered resources, i.e. build is platform dependent!
[INFO] skip non existing resourceDirectory /srv/gump/public/workspace/slf4j/integration/src/test/resources
[INFO] [compiler:testCompile]
[INFO] Compiling 5 source files to /srv/gump/public/workspace/slf4j/integration/target/test-classes
[INFO] [surefire:test]
[INFO] Tests are skipped.
[INFO] [jar:jar]
[WARNING] JAR will be empty - no content was marked for inclusion!
[INFO] Building jar: /srv/gump/public/workspace/slf4j/integration/target/integration-2.0.0-SNAPSHOT.jar
[INFO] [antrun:run {execution: ant-test}]
[INFO] Executing tasks
     [echo] compile classpath: /srv/gump/public/workspace/slf4j/integration/target/classes:/srv/gump/public/workspace/slf4j/slf4j-api/target/classes:/srv/gump/public/workspace/mvnlocalrepo/junit/junit/3.8.1/junit-3.8.1.jar:/srv/gump/public/workspace/mvnlocalrepo/ant/ant-junit/1.6.5/ant-junit-1.6.5.jar
     [echo] runtime classpath: /srv/gump/public/workspace/slf4j/integration/target/classes:/srv/gump/public/workspace/slf4j/slf4j-api/target/slf4j-api-2.0.0-SNAPSHOT.jar:/srv/gump/public/workspace/mvnlocalrepo/junit/junit/3.8.1/junit-3.8.1.jar:/srv/gump/public/workspace/mvnlocalrepo/ant/ant-junit/1.6.5/ant-junit-1.6.5.jar
     [echo] test classpath:    /srv/gump/public/workspace/slf4j/integration/target/test-classes:/srv/gump/public/workspace/slf4j/integration/target/classes:/srv/gump/public/workspace/slf4j/slf4j-api/target/slf4j-api-2.0.0-SNAPSHOT.jar:/srv/gump/public/workspace/mvnlocalrepo/junit/junit/3.8.1/junit-3.8.1.jar:/srv/gump/public/workspace/mvnlocalrepo/ant/ant-junit/1.6.5/ant-junit-1.6.5.jar
     [echo] plugin classpath:  /srv/gump/public/workspace/mvnlocalrepo/junit/junit/3.8.1/junit-3.8.1.jar:/srv/gump/public/workspace/mvnlocalrepo/ant/ant-junit/1.6.5/ant-junit-1.6.5.jar:/srv/gump/public/workspace/mvnlocalrepo/org/codehaus/plexus/plexus-utils/1.1/plexus-utils-1.1.jar:/srv/gump/public/workspace/mvnlocalrepo/ant/ant-launcher/1.6.5/ant-launcher-1.6.5.jar:/srv/gump/public/workspace/mvnlocalrepo/ant/ant/1.6.5/ant-1.6.5.jar:/opt/maven2/lib/maven-2.0.10-uber.jar

init:
    [mkdir] Created dir: /srv/gump/public/workspace/slf4j/integration/target/unit-reports

testMismatch:
    [junit] Running org.slf4j.VersionMismatchTest
    [junit] Tests run: 1, Failures: 0, Errors: 0, Time elapsed: 0.046 sec

testPre155:
    [junit] Running org.slf4j.Pre155VersionTest
    [junit] Tests run: 1, Failures: 0, Errors: 0, Time elapsed: 0.031 sec

testMatch:
    [junit] Running org.slf4j.VersionMatchTest
    [junit] Tests run: 1, Failures: 1, Errors: 0, Time elapsed: 0.03 sec
[INFO] ------------------------------------------------------------------------
[ERROR] BUILD ERROR
[INFO] ------------------------------------------------------------------------
[INFO] An Ant BuildException has occured: The following error occurred while executing this line:
/srv/gump/public/workspace/slf4j/integration/build.xml:80: Test org.slf4j.VersionMatchTest failed

[INFO] ------------------------------------------------------------------------
[INFO] For more information, run Maven with the -e switch
[INFO] ------------------------------------------------------------------------
[INFO] Total time: 1 minute 13 seconds
[INFO] Finished at: Thu Jun 11 00:56:50 GMT-08:00 2009
[INFO] Final Memory: 39M/71M
[INFO] ------------------------------------------------------------------------
---------------------------------------------

To subscribe to this information via syndicated feeds:
- RSS: http://vmgump.apache.org/gump/public/slf4j/slf4j/rss.xml
- Atom: http://vmgump.apache.org/gump/public/slf4j/slf4j/atom.xml

============================== Gump Tracking Only ===
Produced by Gump version 2.3.
Gump Run 06000011062009, vmgump:vmgump-public:06000011062009
Gump E-mail Identifier (unique within run) #13.

*********************************************************** G U M P
[GUMP@vmgump]: Project jtidy-cvs (in module jtidy) failed
To whom it may engage...
        
This is an automated request, but not an unsolicited one. For 
more information please visit http://gump.apache.org/nagged.html, 
and/or contact the folk at general@gump.apache.org.

Project jtidy-cvs has an issue affecting its community integration.
This issue affects 1 projects,
 and has been outstanding for 148 runs.
The current state of this project is 'Failed', with reason 'Build Failed'.
For reference only, the following projects are affected by this:
    - jtidy-cvs :  HTML Templates


Full details are available at:
    http://vmgump.apache.org/gump/public/jtidy/jtidy-cvs/index.html

That said, some information snippets are provided here.

The following annotations (debug/informational/warning/error messages) were provided:
 -DEBUG- Sole output [jtidy-11062009.jar] identifier set to project name
 -DEBUG- Dependency on xml-apis exists, no need to add for property maven.jar.dom3-xml-apis.
 -DEBUG- (Gump generated) Maven Properties in: /srv/gump/public/workspace/jtidy/build.properties
 -INFO- Failed with reason build failed
 -DEBUG- Maven POM in: /srv/gump/public/workspace/jtidy/project.xml
 -DEBUG- Maven project properties in: /srv/gump/public/workspace/jtidy/project.properties
 -INFO- Failed to extract fallback artifacts from Gump Repository



The following work was performed:
http://vmgump.apache.org/gump/public/jtidy/jtidy-cvs/gump_work/build_jtidy_jtidy-cvs.html
Work Name: build_jtidy_jtidy-cvs (Type: Build)
Work ended in a state of : Failed
Elapsed: 2 secs
Command Line: maven --offline jar 
[Working Directory: /srv/gump/public/workspace/jtidy]
CLASSPATH: /usr/lib/jvm/java-6-sun/lib/tools.jar:/srv/gump/public/workspace/ant/dist/lib/ant-jmf.jar:/srv/gump/public/workspace/ant/dist/lib/ant-swing.jar:/srv/gump/public/workspace/ant/dist/lib/ant-apache-resolver.jar:/srv/gump/public/workspace/ant/dist/lib/ant-apache-xalan2.jar:/srv/gump/public/workspace/ant/dist/lib/ant-trax.jar:/srv/gump/public/workspace/ant/dist/lib/ant-junit.jar:/srv/gump/public/workspace/ant/dist/lib/ant-launcher.jar:/srv/gump/public/workspace/ant/dist/lib/ant-nodeps.jar:/srv/gump/public/workspace/ant/dist/lib/ant.jar:/srv/gump/packages/junit3.8.1/junit.jar:/srv/gump/public/workspace/xml-commons/java/build/resolver.jar:/srv/gump/public/workspace/xml-commons/java/external/build/xml-apis-ext.jar:/srv/gump/public/workspace/apache-commons/logging/target/commons-logging-11062009.jar:/srv/gump/public/workspace/apache-commons/logging/target/commons-logging-api-11062009.jar
---------------------------------------------
	... 33 more
[MethodExpression] Cannot evaluate expression
java.lang.reflect.InvocationTargetException
	at sun.reflect.NativeMethodAccessorImpl.invoke0(Native Method)
	at sun.reflect.NativeMethodAccessorImpl.invoke(NativeMethodAccessorImpl.java:39)
	at sun.reflect.DelegatingMethodAccessorImpl.invoke(DelegatingMethodAccessorImpl.java:25)
	at java.lang.reflect.Method.invoke(Method.java:597)
	at org.apache.commons.betwixt.expression.MethodExpression.evaluate(MethodExpression.java:96)
	at org.apache.commons.betwixt.io.AbstractBeanWriter.writeContent(AbstractBeanWriter.java:658)
	at org.apache.commons.betwixt.io.AbstractBeanWriter.writeRestOfElement(AbstractBeanWriter.java:539)
	at org.apache.commons.betwixt.io.AbstractBeanWriter.write(AbstractBeanWriter.java:481)
	at org.apache.commons.betwixt.io.AbstractBeanWriter.writeContent(AbstractBeanWriter.java:643)
	at org.apache.commons.betwixt.io.AbstractBeanWriter.writeRestOfElement(AbstractBeanWriter.java:539)
	at org.apache.commons.betwixt.io.AbstractBeanWriter.write(AbstractBeanWriter.java:513)
	at org.apache.commons.betwixt.io.AbstractBeanWriter.write(AbstractBeanWriter.java:233)
	at org.apache.commons.betwixt.io.AbstractBeanWriter.writeContent(AbstractBeanWriter.java:630)
	at org.apache.commons.betwixt.io.AbstractBeanWriter.writeRestOfElement(AbstractBeanWriter.java:539)
	at org.apache.commons.betwixt.io.AbstractBeanWriter.write(AbstractBeanWriter.java:513)
	at org.apache.commons.betwixt.io.AbstractBeanWriter.write(AbstractBeanWriter.java:233)
	at org.apache.commons.betwixt.io.AbstractBeanWriter.write(AbstractBeanWriter.java:162)
	at org.apache.commons.betwixt.io.BeanWriter.write(BeanWriter.java:217)
	at org.apache.maven.MavenUtils.getProjectString(MavenUtils.java:432)
	at org.apache.maven.MavenUtils.getInterpolatedPOM(MavenUtils.java:383)
	at org.apache.maven.MavenUtils.getJellyProject(MavenUtils.java:360)
	at org.apache.maven.MavenUtils.getProject(MavenUtils.java:144)
	at org.apache.maven.MavenUtils.getProject(MavenUtils.java:122)
	at org.apache.maven.MavenSession.initializeRootProject(MavenSession.java:232)
	at org.apache.maven.MavenSession.initialize(MavenSession.java:172)
	at org.apache.maven.cli.App.doMain(App.java:475)
	at org.apache.maven.cli.App.main(App.java:1239)
	at sun.reflect.NativeMethodAccessorImpl.invoke0(Native Method)
	at sun.reflect.NativeMethodAccessorImpl.invoke(NativeMethodAccessorImpl.java:39)
	at sun.reflect.DelegatingMethodAccessorImpl.invoke(DelegatingMethodAccessorImpl.java:25)
	at java.lang.reflect.Method.invoke(Method.java:597)
	at com.werken.forehead.Forehead.run(Forehead.java:551)
	at com.werken.forehead.Forehead.main(Forehead.java:581)
Caused by: java.lang.IllegalArgumentException: cvs repository connection string doesn't contain six tokens
	at org.apache.maven.project.Repository.splitSCMConnection(Repository.java:258)
	at org.apache.maven.project.Repository.getScmType(Repository.java:115)
	... 33 more
The build cannot continue because of the following unsatisfied dependencies:

maven-sourceforge-plugin-1.0.jar (try downloading from http://maven-plugins.sourceforge.net)
maven-statcvs-plugin-2.7.jar
maven-xhtml-plugin-1.2.jar (try downloading from http://maven-validator.sourceforge.net)
maven-checkstyle-plugin-2.4.1.jar (try downloading from http://maven.apache.org/reference/plugins/checkstyle)

Total time: 2 seconds
Finished at: Thu Jun 11 01:12:58 GMT-08:00 2009

---------------------------------------------

To subscribe to this information via syndicated feeds:
- RSS: http://vmgump.apache.org/gump/public/jtidy/jtidy-cvs/rss.xml
- Atom: http://vmgump.apache.org/gump/public/jtidy/jtidy-cvs/atom.xml

============================== Gump Tracking Only ===
Produced by Gump version 2.3.
Gump Run 06000011062009, vmgump:vmgump-public:06000011062009
Gump E-mail Identifier (unique within run) #14.

*********************************************************** G U M P
[GUMP@vmgump]: Project castor-test (in module castor) failed
To whom it may engage...
        
This is an automated request, but not an unsolicited one. For 
more information please visit http://gump.apache.org/nagged.html, 
and/or contact the folk at general@gump.apache.org.

Project castor-test has an issue affecting its community integration.
This issue affects 1 projects,
 and has been outstanding for 21 runs.
The current state of this project is 'Failed', with reason 'Build Failed'.
For reference only, the following projects are affected by this:
    - castor-test :  Java to XML, SQL, LDAP bindings


Full details are available at:
    http://vmgump.apache.org/gump/public/castor/castor-test/index.html

That said, some information snippets are provided here.

The following annotations (debug/informational/warning/error messages) were provided:
 -WARNING- Overriding Maven2 settings: [/srv/gump/public/workspace/castor/gump_mvn_settings.xml]
 -DEBUG- (Gump generated) Maven2 Settings in: /srv/gump/public/workspace/castor/gump_mvn_settings.xml
 -INFO- Failed with reason build failed
 -DEBUG- Maven POM in: /srv/gump/public/workspace/castor/pom.xml



The following work was performed:
http://vmgump.apache.org/gump/public/castor/castor-test/gump_work/build_castor_castor-test.html
Work Name: build_castor_castor-test (Type: Build)
Work ended in a state of : Failed
Elapsed: 6 mins 16 secs
Command Line: mvn --batch-mode --settings /srv/gump/public/workspace/castor/gump_mvn_settings.xml package 
[Working Directory: /srv/gump/public/workspace/castor]
CLASSPATH: /usr/lib/jvm/java-6-sun/lib/tools.jar
---------------------------------------------
Downloading: http://snapshots.repository.codehaus.org/xerces/xmlParserAPIs/2.6.2/xmlParserAPIs-2.6.2.pom
Downloading: http://localhost:8192/maven2/xerces/xmlParserAPIs/2.6.2/xmlParserAPIs-2.6.2.pom
153b downloaded
Downloading: https://maven-repository.dev.java.net/nonav/repository/poi/poms/poi-2.5.1-final-20040804.pom
Downloading: http://localhost:8192/maven/2/poi/poi/2.5.1-final-20040804/poi-2.5.1-final-20040804.pom
Downloading: http://snapshots.repository.codehaus.org/poi/poi/2.5.1-final-20040804/poi-2.5.1-final-20040804.pom
Downloading: http://localhost:8192/maven2/poi/poi/2.5.1-final-20040804/poi-2.5.1-final-20040804.pom
191b downloaded
Downloading: https://maven-repository.dev.java.net/nonav/repository/org.slf4j/poms/slf4j-api-1.4.3.pom
Downloading: http://localhost:8192/maven/2/org/slf4j/slf4j-api/1.4.3/slf4j-api-1.4.3.pom
Downloading: http://snapshots.repository.codehaus.org/org/slf4j/slf4j-api/1.4.3/slf4j-api-1.4.3.pom
Downloading: http://localhost:8192/maven2/org/slf4j/slf4j-api/1.4.3/slf4j-api-1.4.3.pom
2K downloaded
Downloading: https://maven-repository.dev.java.net/nonav/repository/org.slf4j/poms/slf4j-parent-1.4.3.pom
Downloading: http://localhost:8192/maven/2/org/slf4j/slf4j-parent/1.4.3/slf4j-parent-1.4.3.pom
Downloading: http://snapshots.repository.codehaus.org/org/slf4j/slf4j-parent/1.4.3/slf4j-parent-1.4.3.pom
Downloading: http://localhost:8192/maven2/org/slf4j/slf4j-parent/1.4.3/slf4j-parent-1.4.3.pom
7K downloaded
Downloading: https://maven-repository.dev.java.net/nonav/repository/org.slf4j/poms/slf4j-nop-1.4.3.pom
Downloading: http://localhost:8192/maven/2/org/slf4j/slf4j-nop/1.4.3/slf4j-nop-1.4.3.pom
Downloading: http://snapshots.repository.codehaus.org/org/slf4j/slf4j-nop/1.4.3/slf4j-nop-1.4.3.pom
Downloading: http://localhost:8192/maven2/org/slf4j/slf4j-nop/1.4.3/slf4j-nop-1.4.3.pom
1K downloaded
[INFO] [compiler:compile]
[INFO] Nothing to compile - all classes are up to date
[INFO] [resources:testResources]
[WARNING] Using platform encoding (UTF-8 actually) to copy filtered resources, i.e. build is platform dependent!
[INFO] Copying 43 resources
Downloading: http://localhost:8192/maven2/org/apache/maven/maven-settings/2.0/maven-settings-2.0.pom
1K downloaded
Downloading: https://maven-repository.dev.java.net/nonav/repository/junit/poms/junit-3.8.2.pom
Downloading: http://localhost:8192/maven/2/junit/junit/3.8.2/junit-3.8.2.pom
Downloading: http://snapshots.repository.codehaus.org/junit/junit/3.8.2/junit-3.8.2.pom
Downloading: http://localhost:8192/maven2/junit/junit/3.8.2/junit-3.8.2.pom
747b downloaded
[INFO] [sql:execute {execution: create schema}]
[INFO] Executing file: /srv/gump/public/workspace/castor/jdo-extensions-it/src/test/resources/org/castor/cpa/functional/create-derby.sql
[ERROR] Failed to execute:  CREATE TABLE book( isbn INTEGER NOT NULL, title VARCHAR(200) NOT NULL, PRIMARY KEY (isbn) )
[INFO] ------------------------------------------------------------------------
[ERROR] BUILD ERROR
[INFO] ------------------------------------------------------------------------
[INFO] Table/View 'BOOK' already exists in Schema 'TEST'.

[INFO] ------------------------------------------------------------------------
[INFO] For more information, run Maven with the -e switch
[INFO] ------------------------------------------------------------------------
[INFO] Total time: 6 minutes 14 seconds
[INFO] Finished at: Thu Jun 11 01:28:33 GMT-08:00 2009
[INFO] Final Memory: 25M/46M
[INFO] ------------------------------------------------------------------------
---------------------------------------------

To subscribe to this information via syndicated feeds:
- RSS: http://vmgump.apache.org/gump/public/castor/castor-test/rss.xml
- Atom: http://vmgump.apache.org/gump/public/castor/castor-test/atom.xml

============================== Gump Tracking Only ===
Produced by Gump version 2.3.
Gump Run 06000011062009, vmgump:vmgump-public:06000011062009
Gump E-mail Identifier (unique within run) #15.

*********************************************************** G U M P
[GUMP@vmgump]: Project ws-commons-xmlschema (in module ws-axis2-commons) failed
To whom it may engage...
        
This is an automated request, but not an unsolicited one. For 
more information please visit http://gump.apache.org/nagged.html, 
and/or contact the folk at general@gump.apache.org.

Project ws-commons-xmlschema has an issue affecting its community integration.
This issue affects 4 projects,
 and has been outstanding for 99 runs.
The current state of this project is 'Failed', with reason 'Missing Build Outputs'.
For reference only, the following projects are affected by this:
    - ws-axis2 :  Apache Axis2 SOAP Stack
    - ws-commons-xmlschema :  Common stuff for the WS projects.
    - ws-juddi :  ws-juddi -- UDDI Toolkit/Repository
    - ws-juddi-test :  ws-juddi -- UDDI Toolkit/Repository


Full details are available at:
    http://vmgump.apache.org/gump/public/ws-axis2-commons/ws-commons-xmlschema/index.html

That said, some information snippets are provided here.

The following annotations (debug/informational/warning/error messages) were provided:
 -DEBUG- Sole output [ws-commons-xmlschema-11062009.jar] identifier set to project name
 -DEBUG- (Gump generated) Maven2 Settings in: /srv/gump/public/workspace/ws-axis2-commons/XmlSchema/gump_mvn_settings.xml
 -DEBUG- Maven POM in: /srv/gump/public/workspace/ws-axis2-commons/XmlSchema/pom.xml
 -INFO- Failed with reason missing build outputs
 -ERROR- Missing Output: /srv/gump/public/workspace/ws-axis2-commons/XmlSchema/build/lib/ws-commons-xmlschema-11062009.jar
 -ERROR- No such directory (where output is expected) : /srv/gump/public/workspace/ws-axis2-commons/XmlSchema/build/lib
 -INFO- Failed to extract fallback artifacts from Gump Repository



The following work was performed:
http://vmgump.apache.org/gump/public/ws-axis2-commons/ws-commons-xmlschema/gump_work/build_ws-axis2-commons_ws-commons-xmlschema.html
Work Name: build_ws-axis2-commons_ws-commons-xmlschema (Type: Build)
Work ended in a state of : Success
Elapsed: 1 min 38 secs
Command Line: mvn --batch-mode --settings /srv/gump/public/workspace/ws-axis2-commons/XmlSchema/gump_mvn_settings.xml install 
[Working Directory: /srv/gump/public/workspace/ws-axis2-commons/XmlSchema]
CLASSPATH: /usr/lib/jvm/java-6-sun/lib/tools.jar:/srv/gump/public/workspace/xml-commons/java/external/build/xml-apis-ext.jar:/srv/gump/public/workspace/xmlunit/build/java/lib/xmlunit-sumo-11062009.jar:/srv/gump/public/workspace/xmlunit/build/java/lib/xmlunit-legacy-11062009.jar:/srv/gump/public/workspace/xmlunit/build/java/lib/xmlunit-core-11062009.jar:/srv/gump/public/workspace/ant/dist/lib/ant-jmf.jar:/srv/gump/public/workspace/ant/dist/lib/ant-swing.jar:/srv/gump/public/workspace/ant/dist/lib/ant-apache-resolver.jar:/srv/gump/public/workspace/ant/dist/lib/ant-apache-xalan2.jar:/srv/gump/public/workspace/ant/dist/lib/ant-trax.jar:/srv/gump/public/workspace/ant/dist/lib/ant-junit.jar:/srv/gump/public/workspace/ant/dist/lib/ant-launcher.jar:/srv/gump/public/workspace/ant/dist/lib/ant-nodeps.jar:/srv/gump/public/workspace/ant/dist/lib/ant.jar:/srv/gump/packages/junit3.8.1/junit.jar:/srv/gump/public/workspace/xml-commons/java/build/resolver.jar:/srv/gump/packages/stax/jsr173_1.
 0_api.jar:/srv/gump/packages/stax/jsr173_1.0_ri.jar:/srv/gump/public/workspace/junit/dist/junit-11062009.jar:/srv/gump/public/workspace/apache-commons/beanutils/dist/commons-beanutils-11062009.jar:/srv/gump/public/workspace/apache-commons/collections/build/commons-collections-11062009.jar:/srv/gump/public/workspace/apache-commons/logging/target/commons-logging-11062009.jar:/srv/gump/public/workspace/apache-commons/logging/target/commons-logging-api-11062009.jar:/srv/gump/public/workspace/apache-commons/validator/dist/commons-validator-11062009.jar:/srv/gump/public/workspace/velocity-engine/bin/velocity-11062009.jar:/srv/gump/public/workspace/velocity-engine/bin/velocity-11062009-dep.jar
---------------------------------------------
Tests run: 1, Failures: 0, Errors: 0, Skipped: 0, Time elapsed: 0.003 sec
Running tests.customext.attrib.CustomExtensionSerializerTest
Tests run: 1, Failures: 0, Errors: 0, Skipped: 0, Time elapsed: 0.011 sec
Running tests.WSCOMMONS377Test
Tests run: 1, Failures: 0, Errors: 0, Skipped: 0, Time elapsed: 0.007 sec
Running tests.FacetsTest
Tests run: 9, Failures: 0, Errors: 0, Skipped: 0, Time elapsed: 0.022 sec
Running tests.TestUnqualifiedSchema
Tests run: 1, Failures: 0, Errors: 0, Skipped: 0, Time elapsed: 0.008 sec
Running tests.AnnotationDeepTest
Tests run: 2, Failures: 0, Errors: 0, Skipped: 0, Time elapsed: 0.021 sec
Running tests.UnionTest
Tests run: 1, Failures: 0, Errors: 0, Skipped: 0, Time elapsed: 0.019 sec
Running tests.CircularSchemaTest
Tests run: 1, Failures: 0, Errors: 0, Skipped: 0, Time elapsed: 0.008 sec
Running tests.GroupTest
Tests run: 1, Failures: 0, Errors: 0, Skipped: 0, Time elapsed: 0.007 sec
Running tests.AnnotationTest
Tests run: 5, Failures: 0, Errors: 0, Skipped: 0, Time elapsed: 0.026 sec
Running tests.TestElementForm
Tests run: 1, Failures: 0, Errors: 0, Skipped: 0, Time elapsed: 0.013 sec
Running tests.TestLocalUnnamedSimpleType
Tests run: 1, Failures: 0, Errors: 0, Skipped: 0, Time elapsed: 0.007 sec
Running tests.RecursiveImportTest
Tests run: 1, Failures: 0, Errors: 0, Skipped: 0, Time elapsed: 0.014 sec
Running tests.NotationTest
Tests run: 1, Failures: 0, Errors: 0, Skipped: 0, Time elapsed: 0.014 sec

Results :

Tests run: 4036, Failures: 0, Errors: 0, Skipped: 3

Downloading: http://localhost:8192/maven2/biz/aQute/bndlib/0.0.311/bndlib-0.0.311.pom
864b downloaded
Downloading: http://localhost:8192/maven2/biz/aQute/bndlib/0.0.311/bndlib-0.0.311.jar
527K downloaded
[INFO] [bundle:bundle]
[INFO] [install:install]
[INFO] Installing /srv/gump/public/workspace/ws-axis2-commons/XmlSchema/target/XmlSchema-2.0-SNAPSHOT.jar to /srv/gump/public/workspace/mvnlocalrepo/org/apache/ws/commons/schema/XmlSchema/2.0-SNAPSHOT/XmlSchema-2.0-SNAPSHOT.jar
[INFO] [bundle:install]
[INFO] Parsing file:/srv/gump/public/workspace/mvnlocalrepo/repository.xml
[INFO] Installing org/apache/ws/commons/schema/XmlSchema/2.0-SNAPSHOT/XmlSchema-2.0-SNAPSHOT.jar
[INFO] Writing OBR metadata
[INFO] ------------------------------------------------------------------------
[INFO] BUILD SUCCESSFUL
[INFO] ------------------------------------------------------------------------
[INFO] Total time: 1 minute 36 seconds
[INFO] Finished at: Thu Jun 11 01:37:58 GMT-08:00 2009
[INFO] Final Memory: 22M/39M
[INFO] ------------------------------------------------------------------------
---------------------------------------------

To subscribe to this information via syndicated feeds:
- RSS: http://vmgump.apache.org/gump/public/ws-axis2-commons/ws-commons-xmlschema/rss.xml
- Atom: http://vmgump.apache.org/gump/public/ws-axis2-commons/ws-commons-xmlschema/atom.xml

============================== Gump Tracking Only ===
Produced by Gump version 2.3.
Gump Run 06000011062009, vmgump:vmgump-public:06000011062009
Gump E-mail Identifier (unique within run) #18.

*********************************************************** G U M P
[GUMP@vmgump]: Project xml-security-tests (in module xml-security) failed
To whom it may engage...
        
This is an automated request, but not an unsolicited one. For 
more information please visit http://gump.apache.org/nagged.html, 
and/or contact the folk at general@gump.apache.org.

Project xml-security-tests has an issue affecting its community integration.
This issue affects 1 projects,
 and has been outstanding for 21 runs.
The current state of this project is 'Failed', with reason 'Build Failed'.
For reference only, the following projects are affected by this:
    - xml-security-tests :  XML-Signature Syntax and Processing


Full details are available at:
    http://vmgump.apache.org/gump/public/xml-security/xml-security-tests/index.html

That said, some information snippets are provided here.

The following annotations (debug/informational/warning/error messages) were provided:
 -DEBUG- Dependency on jce exists, no need to add for property lib.jce.
 -INFO- Failed with reason build failed



The following work was performed:
http://vmgump.apache.org/gump/public/xml-security/xml-security-tests/gump_work/build_xml-security_xml-security-tests.html
Work Name: build_xml-security_xml-security-tests (Type: Build)
Work ended in a state of : Failed
Elapsed: 10 mins 51 secs
Command Line: /usr/lib/jvm/java-6-sun/bin/java -Djava.awt.headless=true -Dant.build.clonevm=true -Xbootclasspath/p:/srv/gump/public/workspace/xml-commons/java/external/build/xml-apis.jar:/srv/gump/public/workspace/xml-xerces2/build/xercesImpl.jar:/srv/gump/public/workspace/xml-xalan/build/serializer.jar:/srv/gump/public/workspace/xml-xalan/build/xalan-unbundled.jar org.apache.tools.ant.Main -Dgump.merge=/srv/gump/public/gump/work/merge.xml -Dbuild.sysclasspath=only -Djce.download.sha1=c1f0e975e8c8e0a0105787b249a50615b485d109 -Dlib.jce=/srv/gump/packages/jce/jce-jdk13-116.jar -Djce.download.md5=85c64cd754719a4bc8da7e9aa0e113fd test 
[Working Directory: /srv/gump/public/workspace/xml-security]
CLASSPATH: /usr/lib/jvm/java-6-sun/lib/tools.jar:/srv/gump/public/workspace/xml-security/build/test:/srv/gump/public/workspace/xml-security:/srv/gump/public/workspace/xml-security/build/xmlsec-11062009.jar:/srv/gump/public/workspace/ant/dist/lib/ant-jmf.jar:/srv/gump/public/workspace/ant/dist/lib/ant-swing.jar:/srv/gump/public/workspace/ant/dist/lib/ant-apache-resolver.jar:/srv/gump/public/workspace/ant/dist/lib/ant-apache-xalan2.jar:/srv/gump/public/workspace/ant/dist/lib/ant-trax.jar:/srv/gump/public/workspace/ant/dist/lib/ant-junit.jar:/srv/gump/public/workspace/ant/dist/lib/ant-launcher.jar:/srv/gump/public/workspace/ant/dist/lib/ant-nodeps.jar:/srv/gump/public/workspace/ant/dist/lib/ant.jar:/srv/gump/packages/junit3.8.1/junit.jar:/srv/gump/public/workspace/xml-commons/java/build/resolver.jar:/srv/gump/public/workspace/xml-commons/java/external/build/xml-apis-ext.jar:/srv/gump/packages/jce/jce-jdk13-116.jar:/srv/gump/public/workspace/apache-commons/logging/target/commons-
 logging-11062009.jar:/srv/gump/public/workspace/apache-commons/logging/target/commons-logging-api-11062009.jar:/srv/gump/public/workspace/junit/dist/junit-11062009.jar
---------------------------------------------
    [junit] Testcase: testBug40783 took 0.008 sec
    [junit] Running org.apache.xml.security.test.utils.Base64Test
    [junit] Testsuite: org.apache.xml.security.test.utils.Base64Test
    [junit] Tests run: 3, Failures: 0, Errors: 0, Time elapsed: 0.058 sec
    [junit] Tests run: 3, Failures: 0, Errors: 0, Time elapsed: 0.058 sec
    [junit] 
    [junit] Testcase: testA1 took 0.007 sec
    [junit] Testcase: testWrap1 took 0.002 sec
    [junit] Testcase: testWrap2 took 0.001 sec
    [junit] Running org.apache.xml.security.test.utils.IdResolverTest
    [junit] Testsuite: org.apache.xml.security.test.utils.IdResolverTest
    [junit] Tests run: 3, Failures: 0, Errors: 0, Time elapsed: 0.2 sec
    [junit] Tests run: 3, Failures: 0, Errors: 0, Time elapsed: 0.2 sec
    [junit] 
    [junit] Testcase: testIdSoap took 0.067 sec
    [junit] Testcase: testIdWithOtherIdSoap took 0.005 sec
    [junit] Testcase: testANoId took 0.006 sec
    [junit] Running org.apache.xml.security.test.utils.OldApiTest
    [junit] Testsuite: org.apache.xml.security.test.utils.OldApiTest
    [junit] Tests run: 4, Failures: 0, Errors: 0, Time elapsed: 0.497 sec
    [junit] Tests run: 4, Failures: 0, Errors: 0, Time elapsed: 0.497 sec
    [junit] 
    [junit] Testcase: testOldTransformSpiApi took 0.346 sec
    [junit] Testcase: testOldResourceResolverSpi took 0.014 sec
    [junit] Testcase: testOldKeyResolverSpi took 0.01 sec
    [junit] Testcase: testOldKeyResolverSpiInKeyInfo took 0.005 sec
    [junit] Running org.apache.xml.security.test.utils.resolver.AllTests
    [junit] Testsuite: org.apache.xml.security.test.utils.resolver.AllTests
    [junit] Tests run: 3, Failures: 0, Errors: 0, Time elapsed: 0.081 sec
    [junit] Tests run: 3, Failures: 0, Errors: 0, Time elapsed: 0.081 sec
    [junit] 
    [junit] Testcase: testCustomResolver took 0.015 sec
    [junit] Testcase: testLocalFileWithEmptyBaseURI took 0.007 sec
    [junit] Testcase: testBug40783 took 0.009 sec
    [junit] Running org.apache.xml.security.test.utils.resolver.ResourceResolverTest
    [junit] Testsuite: org.apache.xml.security.test.utils.resolver.ResourceResolverTest
    [junit] Tests run: 2, Failures: 0, Errors: 0, Time elapsed: 0.072 sec
    [junit] Tests run: 2, Failures: 0, Errors: 0, Time elapsed: 0.072 sec
    [junit] 
    [junit] Testcase: testCustomResolver took 0.016 sec
    [junit] Testcase: testLocalFileWithEmptyBaseURI took 0.007 sec
[junitreport] Processing /srv/gump/public/workspace/xml-security/build/docs/xml/junit/TESTS-TestSuites.xml to /tmp/null1956662161
[junitreport] Loading stylesheet jar:file:/srv/gump/public/workspace/ant/dist/lib/ant-junit.jar!/org/apache/tools/ant/taskdefs/optional/junit/xsl/junit-frames.xsl
[junitreport] Transform time: 40764ms
[junitreport] Deleting: /tmp/null1956662161

BUILD FAILED
/srv/gump/public/workspace/xml-security/build.xml:383: Unit Tests Failed

Total time: 10 minutes 50 seconds
---------------------------------------------

To subscribe to this information via syndicated feeds:
- RSS: http://vmgump.apache.org/gump/public/xml-security/xml-security-tests/rss.xml
- Atom: http://vmgump.apache.org/gump/public/xml-security/xml-security-tests/atom.xml

============================== Gump Tracking Only ===
Produced by Gump version 2.3.
Gump Run 06000011062009, vmgump:vmgump-public:06000011062009
Gump E-mail Identifier (unique within run) #19.

*********************************************************** G U M P
[GUMP@vmgump]: Project authx-script-test (in module authx) failed
To whom it may engage...
        
This is an automated request, but not an unsolicited one. For 
more information please visit http://gump.apache.org/nagged.html, 
and/or contact the folk at general@gump.apache.org.

Project authx-script-test has an issue affecting its community integration.
This issue affects 1 projects,
 and has been outstanding for 21 runs.
The current state of this project is 'Failed', with reason 'Build Failed'.
For reference only, the following projects are affected by this:
    - authx-script-test :  Apache Authentication and Authorization Framework


Full details are available at:
    http://vmgump.apache.org/gump/public/authx/authx-script-test/index.html

That said, some information snippets are provided here.

The following annotations (debug/informational/warning/error messages) were provided:
 -DEBUG- Dependency on xml-xerces exists, no need to add for property maven.jar.xercesImpl.
 -DEBUG- Dependency on asm exists, no need to add for property maven.jar.asm-util.
 -DEBUG- Dependency on packaged-jmock exists, no need to add for property maven.jar.jmock.
 -WARNING- Overriding Maven properties: [/srv/gump/public/workspace/authx/script/build.properties]
 -DEBUG- (Gump generated) Maven Properties in: /srv/gump/public/workspace/authx/script/build.properties
 -INFO- Failed with reason build failed
 -DEBUG- Maven POM in: /srv/gump/public/workspace/authx/script/project.xml
 -DEBUG- Maven project properties in: /srv/gump/public/workspace/authx/script/project.properties
 -INFO- Project Reports in: /srv/gump/public/workspace/authx/script/target/test-reports



The following work was performed:
http://vmgump.apache.org/gump/public/authx/authx-script-test/gump_work/build_authx_authx-script-test.html
Work Name: build_authx_authx-script-test (Type: Build)
Work ended in a state of : Failed
Elapsed: 5 secs
Command Line: maven --offline test 
[Working Directory: /srv/gump/public/workspace/authx/script]
CLASSPATH: /usr/lib/jvm/java-6-sun/lib/tools.jar:/srv/gump/public/workspace/asm/output/dist/lib/asm-util-11062009.jar:/srv/gump/public/workspace/authx/core/target/authx-core-11062009.jar:/srv/gump/public/workspace/dom4j/build/dom4j.jar:/srv/gump/packages/groovy-1.0-jsr-03/groovy-1.0-jsr-03.jar:/srv/gump/packages/jmock/jmock-1.0.1.jar:/srv/gump/packages/picocontainer-1.1/picocontainer-1.1.jar:/srv/gump/public/workspace/xml-commons/java/external/build/xml-apis-ext.jar:/srv/gump/public/workspace/authx/script/target/authx-script-11062009.jar
---------------------------------------------
java:prepare-filesystem:

java:compile:
    [echo] Compiling to /srv/gump/public/workspace/authx/script/target/classes

java:jar-resources:

test:prepare-filesystem:

test:test-resources:
Copying 4 files to /srv/gump/public/workspace/authx/script/target/test-classes

test:compile:
    [javac] Compiling 17 source files to /srv/gump/public/workspace/authx/script/target/test-classes

test:test:
    [junit] Running org.apache.authx.script.groovy.GroovyRuleLoaderTest
    [junit] Tests run: 1, Failures: 0, Errors: 1, Time elapsed: 0.097 sec
    [junit] [ERROR] TEST org.apache.authx.script.groovy.GroovyRuleLoaderTest FAILED
    [junit] Running org.apache.authx.script.groovy.GroovyScriptClassLoaderTest
    [junit] Tests run: 2, Failures: 0, Errors: 2, Time elapsed: 0.04 sec
    [junit] [ERROR] TEST org.apache.authx.script.groovy.GroovyScriptClassLoaderTest FAILED
    [junit] Running org.apache.authx.script.xml.Dom4JGroupBuilderTest
    [junit] Tests run: 4, Failures: 0, Errors: 0, Time elapsed: 0.135 sec
    [junit] Running org.apache.authx.script.xml.Dom4JRealmBuilderTest
    [junit] Tests run: 2, Failures: 0, Errors: 0, Time elapsed: 0.188 sec
    [junit] Running org.apache.authx.script.xml.Dom4JRuleSetBuilderTest
    [junit] Tests run: 10, Failures: 0, Errors: 0, Time elapsed: 0.127 sec
    [junit] Running org.apache.authx.script.xml.Dom4JRoleBuilderTest
    [junit] Tests run: 3, Failures: 0, Errors: 0, Time elapsed: 0.114 sec
    [junit] Running org.apache.authx.script.common.PicoContainerFactoryTest
    [junit] Tests run: 2, Failures: 0, Errors: 0, Time elapsed: 0.042 sec
    [junit] Running org.apache.authx.script.common.DynamicRuleProxyTest
    [junit] Tests run: 1, Failures: 0, Errors: 1, Time elapsed: 0.021 sec
    [junit] [ERROR] TEST org.apache.authx.script.common.DynamicRuleProxyTest FAILED
    [junit] Running org.apache.authx.script.common.ScriptedRuleSetBuilderTest
    [junit] Tests run: 1, Failures: 0, Errors: 0, Time elapsed: 0.059 sec
    [junit] Running org.apache.authx.script.common.SmartCachingScriptClassLoaderTest
    [junit] Tests run: 2, Failures: 0, Errors: 2, Time elapsed: 0.04 sec
    [junit] [ERROR] TEST org.apache.authx.script.common.SmartCachingScriptClassLoaderTest FAILED

BUILD FAILED
File...... /home/gump/.maven/cache/maven-test-plugin-1.6.2/plugin.jelly
Element... fail
Line...... 181
Column.... 54
There were test failures.
Total time: 5 seconds
Finished at: Thu Jun 11 02:16:03 GMT-08:00 2009

---------------------------------------------

To subscribe to this information via syndicated feeds:
- RSS: http://vmgump.apache.org/gump/public/authx/authx-script-test/rss.xml
- Atom: http://vmgump.apache.org/gump/public/authx/authx-script-test/atom.xml

============================== Gump Tracking Only ===
Produced by Gump version 2.3.
Gump Run 06000011062009, vmgump:vmgump-public:06000011062009
Gump E-mail Identifier (unique within run) #23.

*********************************************************** G U M P
[GUMP@vmgump]: Project ws-commons-axiom (in module ws-axis2-commons) failed
To whom it may engage...
        
This is an automated request, but not an unsolicited one. For 
more information please visit http://gump.apache.org/nagged.html, 
and/or contact the folk at general@gump.apache.org.

Project ws-commons-axiom has an issue affecting its community integration.
This issue affects 2 projects,
 and has been outstanding for 426 runs.
The current state of this project is 'Failed', with reason 'Missing Build Outputs'.
For reference only, the following projects are affected by this:
    - ws-commons-axiom :  Common stuff for the WS projects.
    - ws-commons-axiom-test :  Common stuff for the WS projects.


Full details are available at:
    http://vmgump.apache.org/gump/public/ws-axis2-commons/ws-commons-axiom/index.html

That said, some information snippets are provided here.

The following annotations (debug/informational/warning/error messages) were provided:
 -DEBUG- (Gump generated) Maven2 Settings in: /srv/gump/public/workspace/ws-axis2-commons/axiom/gump_mvn_settings.xml
 -DEBUG- Maven POM in: /srv/gump/public/workspace/ws-axis2-commons/axiom/pom.xml
 -INFO- Failed with reason missing build outputs
 -ERROR- Missing Output: /srv/gump/public/workspace/ws-axis2-commons/axiom/modules/axiom-api/target/axiom-api-SNAPSHOT.jar
 -ERROR- Missing Output: /srv/gump/public/workspace/ws-axis2-commons/axiom/modules/axiom-impl/target/axiom-impl-SNAPSHOT.jar
 -ERROR- Missing Output: /srv/gump/public/workspace/ws-axis2-commons/axiom/modules/axiom-dom/target/axiom-dom-SNAPSHOT.jar
 -ERROR- See Directory Listing Work for Missing Outputs
 -INFO- Failed to extract fallback artifacts from Gump Repository



The following work was performed:
http://vmgump.apache.org/gump/public/ws-axis2-commons/ws-commons-axiom/gump_work/build_ws-axis2-commons_ws-commons-axiom.html
Work Name: build_ws-axis2-commons_ws-commons-axiom (Type: Build)
Work ended in a state of : Success
Elapsed: 2 mins 11 secs
Command Line: mvn --batch-mode -Dmaven.test.skip.exec=true --settings /srv/gump/public/workspace/ws-axis2-commons/axiom/gump_mvn_settings.xml install 
[Working Directory: /srv/gump/public/workspace/ws-axis2-commons/axiom]
CLASSPATH: /usr/lib/jvm/java-6-sun/lib/tools.jar:/srv/gump/public/workspace/logging-log4j-12/dist/lib/log4j-11062009.jar:/srv/gump/packages/jaf-1.1ea/activation.jar:/srv/gump/packages/javamail-1.4/mail.jar:/srv/gump/packages/javamail-1.4/lib/mailapi.jar:/srv/gump/public/workspace/jaxen/target/jaxen-11062009.jar:/srv/gump/packages/jsse1.0.3/lib/jcert.jar:/srv/gump/packages/jsse1.0.3/lib/jnet.jar:/srv/gump/packages/jsse1.0.3/lib/jsse.jar:/srv/gump/packages/jms1.1/lib/jms.jar:/srv/gump/public/workspace/xml-commons/java/external/build/xml-apis-ext.jar:/srv/gump/public/workspace/xml-security/build/xmlsec-11062009.jar:/srv/gump/public/workspace/xmlunit/build/java/lib/xmlunit-sumo-11062009.jar:/srv/gump/public/workspace/xmlunit/build/java/lib/xmlunit-legacy-11062009.jar:/srv/gump/public/workspace/xmlunit/build/java/lib/xmlunit-core-11062009.jar:/srv/gump/public/workspace/junit/dist/junit-11062009.jar
---------------------------------------------
Downloading: http://dist.wso2.org/maven2//org/apache/maven/maven-project/2.0.6/maven-project-2.0.6.jar
Downloading: http://localhost:8192/maven2/org/apache/maven/maven-project/2.0.6/maven-project-2.0.6.jar
113K downloaded
Downloading: http://dist.wso2.org/maven2//org/apache/maven/maven-settings/2.0.6/maven-settings-2.0.6.jar
Downloading: http://localhost:8192/maven2/org/apache/maven/maven-settings/2.0.6/maven-settings-2.0.6.jar
47K downloaded
Downloading: http://dist.wso2.org/maven2//org/apache/maven/maven-plugin-registry/2.0.6/maven-plugin-registry-2.0.6.jar
Downloading: http://localhost:8192/maven2/org/apache/maven/maven-plugin-registry/2.0.6/maven-plugin-registry-2.0.6.jar
28K downloaded
Downloading: http://dist.wso2.org/maven2//org/apache/maven/maven-plugin-api/2.0.6/maven-plugin-api-2.0.6.jar
Downloading: http://localhost:8192/maven2/org/apache/maven/maven-plugin-api/2.0.6/maven-plugin-api-2.0.6.jar
12K downloaded
[INFO] [compiler:testCompile]
[INFO] Compiling 9 source files to /srv/gump/public/workspace/ws-axis2-commons/axiom/modules/axiom-integration/target/test-classes
[INFO] [surefire:test]
[INFO] Tests are skipped.
[INFO] [jar:jar]
[WARNING] JAR will be empty - no content was marked for inclusion!
[INFO] Building jar: /srv/gump/public/workspace/ws-axis2-commons/axiom/modules/axiom-integration/target/axiom-integration-1.2.9-SNAPSHOT.jar
[INFO] Preparing source:jar
[WARNING] Removing: jar from forked lifecycle, to prevent recursive invocation.
[INFO] No goals needed for project - skipping
[INFO] [source:jar {execution: default}]
[INFO] Building jar: /srv/gump/public/workspace/ws-axis2-commons/axiom/modules/axiom-integration/target/axiom-integration-1.2.9-SNAPSHOT-sources.jar
[INFO] [install:install]
[INFO] Installing /srv/gump/public/workspace/ws-axis2-commons/axiom/modules/axiom-integration/target/axiom-integration-1.2.9-SNAPSHOT.jar to /srv/gump/public/workspace/mvnlocalrepo/org/apache/ws/commons/axiom/axiom-integration/1.2.9-SNAPSHOT/axiom-integration-1.2.9-SNAPSHOT.jar
[INFO] Installing /srv/gump/public/workspace/ws-axis2-commons/axiom/modules/axiom-integration/target/axiom-integration-1.2.9-SNAPSHOT-sources.jar to /srv/gump/public/workspace/mvnlocalrepo/org/apache/ws/commons/axiom/axiom-integration/1.2.9-SNAPSHOT/axiom-integration-1.2.9-SNAPSHOT-sources.jar
[INFO] 
[INFO] 
[INFO] ------------------------------------------------------------------------
[INFO] Reactor Summary:
[INFO] ------------------------------------------------------------------------
[INFO] Axiom ................................................. SUCCESS [6.414s]
[INFO] Axiom API ............................................. SUCCESS [38.899s]
[INFO] Axiom Impl ............................................ SUCCESS [4.964s]
[INFO] Axiom DOM ............................................. SUCCESS [7.425s]
[INFO] Axiom C14N ............................................ SUCCESS [3.550s]
[INFO] Axiom Test Suite ...................................... SUCCESS [4.178s]
[INFO] Axiom OSGI Test Suite Parent .......................... SUCCESS [0.007s]
[INFO] Axiom OSGI Test Suite - Build ......................... SUCCESS [5.288s]
[INFO] Axiom OSGI Test Suite - Run ........................... SUCCESS [29.459s]
[INFO] Axiom Integration Test Suite .......................... SUCCESS [27.105s]
[INFO] ------------------------------------------------------------------------
[INFO] ------------------------------------------------------------------------
[INFO] BUILD SUCCESSFUL
[INFO] ------------------------------------------------------------------------
[INFO] Total time: 2 minutes 10 seconds
[INFO] Finished at: Thu Jun 11 02:27:17 GMT-08:00 2009
[INFO] Final Memory: 33M/64M
[INFO] ------------------------------------------------------------------------
---------------------------------------------

To subscribe to this information via syndicated feeds:
- RSS: http://vmgump.apache.org/gump/public/ws-axis2-commons/ws-commons-axiom/rss.xml
- Atom: http://vmgump.apache.org/gump/public/ws-axis2-commons/ws-commons-axiom/atom.xml

============================== Gump Tracking Only ===
Produced by Gump version 2.3.
Gump Run 06000011062009, vmgump:vmgump-public:06000011062009
Gump E-mail Identifier (unique within run) #27.

*********************************************************** G U M P
[GUMP@vmgump]: Project JacORB-idllib (in module JacORB) failed
To whom it may engage...
        
This is an automated request, but not an unsolicited one. For 
more information please visit http://gump.apache.org/nagged.html, 
and/or contact the folk at general@gump.apache.org.

Project JacORB-idllib has an issue affecting its community integration.
This issue affects 2 projects,
 and has been outstanding for 148 runs.
The current state of this project is 'Failed', with reason 'Build Failed'.
For reference only, the following projects are affected by this:
    - JacORB :  The free Java implementation of the OMG's CORBA standard.
    - JacORB-idllib :  The free Java implementation of the OMG's CORBA standard.


Full details are available at:
    http://vmgump.apache.org/gump/public/JacORB/JacORB-idllib/index.html

That said, some information snippets are provided here.

The following annotations (debug/informational/warning/error messages) were provided:
 -DEBUG- Sole output [idl.jar] identifier set to project name
 -INFO- Failed with reason build failed
 -INFO- Failed to extract fallback artifacts from Gump Repository



The following work was performed:
http://vmgump.apache.org/gump/public/JacORB/JacORB-idllib/gump_work/build_JacORB_JacORB-idllib.html
Work Name: build_JacORB_JacORB-idllib (Type: Build)
Work ended in a state of : Failed
Elapsed: 8 secs
Command Line: /usr/lib/jvm/java-6-sun/bin/java -Djava.awt.headless=true -Xbootclasspath/p:/srv/gump/public/workspace/xml-commons/java/external/build/xml-apis.jar:/srv/gump/public/workspace/xml-xerces2/build/xercesImpl.jar org.apache.tools.ant.Main -Dgump.merge=/srv/gump/public/gump/work/merge.xml -Dbuild.sysclasspath=only init idllib 
[Working Directory: /srv/gump/public/workspace/JacORB]
CLASSPATH: /usr/lib/jvm/java-6-sun/lib/tools.jar:/srv/gump/public/workspace/ant/build/lib/ant-stylebook.jar:/srv/gump/public/workspace/ant/build/lib/ant-swing.jar:/srv/gump/public/workspace/ant/build/lib/ant-apache-resolver.jar:/srv/gump/public/workspace/ant/build/lib/ant-nodeps.jar:/srv/gump/public/workspace/ant/build/lib/ant-apache-xalan2.jar:/srv/gump/public/workspace/ant/build/lib/ant-apache-regexp.jar:/srv/gump/public/workspace/ant/build/lib/ant-commons-net.jar:/srv/gump/public/workspace/ant/build/lib/ant-apache-log4j.jar:/srv/gump/public/workspace/ant/build/lib/ant-commons-logging.jar:/srv/gump/public/workspace/ant/build/lib/ant-jai.jar:/srv/gump/public/workspace/ant/build/lib/ant-jmf.jar:/srv/gump/public/workspace/ant/build/lib/ant-launcher.jar:/srv/gump/public/workspace/ant/build/lib/ant-jdepend.jar:/srv/gump/public/workspace/ant/build/lib/ant-apache-bsf.jar:/srv/gump/public/workspace/ant/build/lib/ant-apache-oro.jar:/srv/gump/public/workspace/ant/build/lib/ant-apache
 -bcel.jar:/srv/gump/public/workspace/ant/build/lib/ant-trax.jar:/srv/gump/public/workspace/ant/build/lib/ant-antlr.jar:/srv/gump/public/workspace/ant/build/lib/ant-junit.jar:/srv/gump/public/workspace/ant/build/lib/ant-jsch.jar:/srv/gump/public/workspace/ant/build/lib/ant-javamail.jar:/srv/gump/public/workspace/ant/build/lib/ant.jar:/srv/gump/public/workspace/xml-commons/java/external/build/xml-apis-ext.jar:/srv/gump/packages/antlr-2.7.6/antlr.jar:/srv/gump/public/workspace/excalibur/framework/api/target/excalibur-framework-api-11062009.jar:/srv/gump/packages/dougLea/concurrent.jar:/srv/gump/packages/avalon/avalon-logkit-2.1.jar:/srv/gump/public/workspace/xml-xalan/tools/java_cup.jar:/srv/gump/public/workspace/xml-xalan/lib/runtime.jar
---------------------------------------------
    [javac] location: package org.jacorb.idl.runtime
    [javac]               CUP$parser$result = new org.jacorb.idl.runtime.Symbol(91/*parameter_dcls*/, ((org.jacorb.idl.runtime.Symbol)CUP$parser$stack.elementAt(CUP$parser$top-1)).left, ((org.jacorb.idl.runtime.Symbol)CUP$parser$stack.elementAt(CUP$parser$top-0)).right, RESULT);
    [javac]                                                             ^
    [javac] /srv/gump/public/workspace/JacORB/src/org/jacorb/idl/parser.java:2029: cannot find symbol
    [javac] symbol  : class Symbol
    [javac] location: package org.jacorb.idl.runtime
    [javac]               CUP$parser$result = new org.jacorb.idl.runtime.Symbol(91/*parameter_dcls*/, ((org.jacorb.idl.runtime.Symbol)CUP$parser$stack.elementAt(CUP$parser$top-1)).left, ((org.jacorb.idl.runtime.Symbol)CUP$parser$stack.elementAt(CUP$parser$top-0)).right, RESULT);
    [javac]                                                                                                                   ^
    [javac] /srv/gump/public/workspace/JacORB/src/org/jacorb/idl/parser.java:2029: cannot find symbol
    [javac] symbol  : class Symbol
    [javac] location: package org.jacorb.idl.runtime
    [javac]               CUP$parser$result = new org.jacorb.idl.runtime.Symbol(91/*parameter_dcls*/, ((org.jacorb.idl.runtime.Symbol)CUP$parser$stack.elementAt(CUP$parser$top-1)).left, ((org.jacorb.idl.runtime.Symbol)CUP$parser$stack.elementAt(CUP$parser$top-0)).right, RESULT);
    [javac]                                                                                                                                                                                                       ^
    [javac] /srv/gump/public/workspace/JacORB/src/org/jacorb/idl/parser.java:2037: cannot find symbol
    [javac] symbol  : class Symbol
    [javac] location: package org.jacorb.idl.runtime
    [javac] 		int pdsleft = ((org.jacorb.idl.runtime.Symbol)CUP$parser$stack.elementAt(CUP$parser$top-1)).left;
    [javac] 		                                      ^
    [javac] /srv/gump/public/workspace/JacORB/src/org/jacorb/idl/parser.java:2038: cannot find symbol
    [javac] symbol  : class Symbol
    [javac] location: package org.jacorb.idl.runtime
    [javac] 		int pdsright = ((org.jacorb.idl.runtime.Symbol)CUP$parser$stack.elementAt(CUP$parser$top-1)).right;
    [javac] 		                                       ^
    [javac] /srv/gump/public/workspace/JacORB/src/org/jacorb/idl/parser.java:2039: cannot find symbol
    [javac] symbol  : class Symbol
    [javac] location: package org.jacorb.idl.runtime
    [javac] 		SymbolList pds = (SymbolList)((org.jacorb.idl.runtime.Symbol) CUP$parser$stack.elementAt(CUP$parser$top-1)).value;
    [javac] 		                                                     ^
    [javac] /srv/gump/public/workspace/JacORB/src/org/jacorb/idl/parser.java:2043: cannot find symbol
    [javac] symbol  : class Symbol
    [javac] location: package org.jacorb.idl.runtime
    [javac]               CUP$parser$result = new org.jacorb.idl.runtime.Symbol(91/*parameter_dcls*/, ((org.jacorb.idl.runtime.Symbol)CUP$parser$stack.elementAt(CUP$parser$top-2)).left, ((org.jacorb.idl.runtime.Symbol)CUP$parser$stack.elementAt(CUP$parser$top-0)).right, RESULT);
    [javac]                                                             ^
    [javac] /srv/gump/public/workspace/JacORB/src/org/jacorb/idl/parser.java:2043: cannot find symbol
    [javac] symbol  : class Symbol
    [javac] location: package org.jacorb.idl.runtime
    [javac]               CUP$parser$result = new org.jacorb.idl.runtime.Symbol(91/*parameter_dcls*/, ((org.jacorb.idl.runtime.Symbol)CUP$parser$stack.elementAt(CUP$parser$top-2)).left, ((org.jacorb.idl.runtime.Symbol)CUP$parser$stack.elementAt(CUP$parser$top-0)).right, RESULT);
    [javac]                                                                                                                   ^
    [javac] Note: Some input files use or override a deprecated API.
    [javac] Note: Recompile with -Xlint:deprecation for details.
    [javac] Note: Some input files use unchecked or unsafe operations.
    [javac] Note: Recompile with -Xlint:unchecked for details.
    [javac] 100 errors

BUILD FAILED
/srv/gump/public/workspace/JacORB/build.xml:68: The following error occurred while executing this line:
/srv/gump/public/workspace/JacORB/src/org/jacorb/idl/build.xml:18: The following error occurred while executing this line:
/srv/gump/public/workspace/JacORB/etc/common.xml:90: Compile failed; see the compiler error output for details.

Total time: 7 seconds
---------------------------------------------

To subscribe to this information via syndicated feeds:
- RSS: http://vmgump.apache.org/gump/public/JacORB/JacORB-idllib/rss.xml
- Atom: http://vmgump.apache.org/gump/public/JacORB/JacORB-idllib/atom.xml

============================== Gump Tracking Only ===
Produced by Gump version 2.3.
Gump Run 06000011062009, vmgump:vmgump-public:06000011062009
Gump E-mail Identifier (unique within run) #29.

*********************************************************** G U M P
[GUMP@vmgump]: Project jetty (in module jetty) failed
To whom it may engage...
        
This is an automated request, but not an unsolicited one. For 
more information please visit http://gump.apache.org/nagged.html, 
and/or contact the folk at general@gump.apache.org.

Project jetty has an issue affecting its community integration.
This issue affects 2 projects,
 and has been outstanding for 42 runs.
The current state of this project is 'Failed', with reason 'Build Failed'.
For reference only, the following projects are affected by this:
    - jetty :  Java HTTP Servlet Server
    - jetty-test :  Java HTTP Servlet Server


Full details are available at:
    http://vmgump.apache.org/gump/public/jetty/jetty/index.html

That said, some information snippets are provided here.

The following annotations (debug/informational/warning/error messages) were provided:
 -INFO- Optional dependency slf4j failed with reason build failed
 -DEBUG- (Gump generated) Maven2 Settings in: /srv/gump/public/workspace/jetty/gump_mvn_settings.xml
 -INFO- Failed with reason build failed
 -DEBUG- Maven POM in: /srv/gump/public/workspace/jetty/pom.xml
 -INFO- Failed to extract fallback artifacts from Gump Repository



The following work was performed:
http://vmgump.apache.org/gump/public/jetty/jetty/gump_work/build_jetty_jetty.html
Work Name: build_jetty_jetty (Type: Build)
Work ended in a state of : Failed
Elapsed: 56 secs
Command Line: mvn --batch-mode -Dmaven.test.skip.exec=true --settings /srv/gump/public/workspace/jetty/gump_mvn_settings.xml package 
[Working Directory: /srv/gump/public/workspace/jetty]
CLASSPATH: /usr/lib/jvm/java-6-sun/lib/tools.jar:/srv/gump/public/workspace/ant/dist/lib/ant-jmf.jar:/srv/gump/public/workspace/ant/dist/lib/ant-swing.jar:/srv/gump/public/workspace/ant/dist/lib/ant-apache-resolver.jar:/srv/gump/public/workspace/ant/dist/lib/ant-apache-xalan2.jar:/srv/gump/public/workspace/ant/dist/lib/ant-trax.jar:/srv/gump/public/workspace/ant/dist/lib/ant-junit.jar:/srv/gump/public/workspace/ant/dist/lib/ant-launcher.jar:/srv/gump/public/workspace/ant/dist/lib/ant-nodeps.jar:/srv/gump/public/workspace/ant/dist/lib/ant.jar:/srv/gump/packages/bsh-2.0b4/bsh-commands-2.0b4.jar:/srv/gump/packages/bsh-2.0b4/bsh-classpath-2.0b4.jar:/srv/gump/packages/bsh-2.0b4/bsh-core-2.0b4.jar:/srv/gump/packages/bsh-2.0b4/bsh-bsf-2.0b4.jar:/srv/gump/packages/bsh-2.0b4/bsh-2.0b4.jar:/srv/gump/packages/bsh-2.0b4/bsh-reflect-2.0b4.jar:/srv/gump/packages/bsh-2.0b4/bsh-util-2.0b4.jar:/srv/gump/public/workspace/apache-commons/beanutils/dist/commons-beanutils-11062009.jar:/srv/gump/pu
 blic/workspace/apache-commons/digester/dist/commons-digester.jar:/srv/gump/packages/commons-el-1.0/commons-el.jar:/srv/gump/public/workspace/httpcomponents/oac.hc3x/dist/commons-httpclient.jar:/srv/gump/packages/jaf-1.1ea/activation.jar:/srv/gump/public/workspace/jakarta-servletapi-5/jsr154/dist/lib/servlet-api.jar:/srv/gump/packages/javamail-1.4/mail.jar:/srv/gump/packages/javamail-1.4/lib/mailapi.jar:/srv/gump/packages/jtidy-04aug2000r7-dev/build/Tidy.jar:/srv/gump/public/workspace/junit/dist/junit-11062009.jar:/srv/gump/public/workspace/mx4j/dist/lib/mx4j-impl.jar:/srv/gump/public/workspace/mx4j/dist/lib/mx4j-jmx.jar:/srv/gump/public/workspace/mx4j/dist/lib/mx4j.jar:/srv/gump/public/workspace/mx4j/tools-dist/lib/mx4j-tools.jar:jcl104-over-slf4j-gump-10062009.jar:slf4j-migrator-gump-10062009.jar:slf4j-api-gump-10062009.jar:slf4j-jcl-gump-10062009.jar:slf4j-jdk14-gump-10062009.jar:slf4j-ext-gump-10062009.jar:slf4j-nop-gump-10062009.jar:jul-to-slf4j-gump-10062009.jar:log4j-o
 ver-slf4j-gump-10062009.jar:slf4j-simple-gump-10062009.jar:slf4j-log4j12-gump-10062009.jar:jcl-over-slf4j-gump-10062009.jar:/srv/gump/public/workspace/jakarta-slide/webdavclient/dist/lib/jakarta-slide-webdavlib-11062009.jar:/srv/gump/public/workspace/xml-commons/java/external/build/xml-apis-ext.jar
---------------------------------------------
Downloading: http://download.java.net/maven/2/org/apache/maven/maven-plugin-descriptor/2.0.9/maven-plugin-descriptor-2.0.9.pom
Downloading: http://download.java.net/maven/1/org.apache.maven/poms/maven-plugin-descriptor-2.0.9.pom
Downloading: http://localhost:8192/maven2/org/apache/maven/maven-plugin-descriptor/2.0.9/maven-plugin-descriptor-2.0.9.pom
2K downloaded
Downloading: http://download.java.net/maven/2/org/apache/maven/maven-monitor/2.0.9/maven-monitor-2.0.9.pom
Downloading: http://download.java.net/maven/1/org.apache.maven/poms/maven-monitor-2.0.9.pom
Downloading: http://localhost:8192/maven2/org/apache/maven/maven-monitor/2.0.9/maven-monitor-2.0.9.pom
1K downloaded
Downloading: http://localhost:8192/maven2/org/apache/maven/enforcer/enforcer-api/1.0-alpha-4/enforcer-api-1.0-alpha-4.pom
3K downloaded
Downloading: http://localhost:8192/maven2/org/apache/maven/enforcer/enforcer-rules/1.0-alpha-4/enforcer-rules-1.0-alpha-4.pom
3K downloaded
Downloading: http://download.java.net/maven/2/org/beanshell/bsh/2.0b4/bsh-2.0b4.pom
Downloading: http://download.java.net/maven/1/org.beanshell/poms/bsh-2.0b4.pom
Downloading: http://localhost:8192/maven2/org/beanshell/bsh/2.0b4/bsh-2.0b4.pom
1K downloaded
Downloading: http://download.java.net/maven/2/org/beanshell/beanshell/2.0b4/beanshell-2.0b4.pom
Downloading: http://download.java.net/maven/1/org.beanshell/poms/beanshell-2.0b4.pom
Downloading: http://localhost:8192/maven2/org/beanshell/beanshell/2.0b4/beanshell-2.0b4.pom
1K downloaded
Downloading: http://localhost:8192/maven2/org/apache/maven/enforcer/enforcer-api/1.0-alpha-4/enforcer-api-1.0-alpha-4.jar
9K downloaded
Downloading: http://localhost:8192/maven2/org/apache/maven/enforcer/enforcer-rules/1.0-alpha-4/enforcer-rules-1.0-alpha-4.jar
51K downloaded
Downloading: http://download.java.net/maven/2/org/beanshell/bsh/2.0b4/bsh-2.0b4.jar
Downloading: http://download.java.net/maven/1/org.beanshell/jars/bsh-2.0b4.jar
Downloading: http://localhost:8192/maven2/org/beanshell/bsh/2.0b4/bsh-2.0b4.jar
275K downloaded
[INFO] [enforcer:enforce {execution: enforce-java}]
[INFO] Setting property: classpath.resource.loader.class => 'org.codehaus.plexus.velocity.ContextClassLoaderResourceLoader'.
[INFO] Setting property: velocimacro.messages.on => 'false'.
[INFO] Setting property: resource.loader => 'classpath'.
[INFO] Setting property: resource.manager.logwhenfound => 'false'.
[INFO] [remote-resources:process {execution: default}]
[INFO] snapshot org.eclipse.jetty.toolchain:jetty-artifact-remote-resources:1.0-SNAPSHOT: checking for updates from oss.sonatype.org
Downloading: http://oss.sonatype.org/content/repositories/jetty-snapshots//org/eclipse/jetty/toolchain/jetty-artifact-remote-resources/1.0-SNAPSHOT/jetty-artifact-remote-resources-1.0-SNAPSHOT.jar
[INFO] ------------------------------------------------------------------------
[ERROR] BUILD ERROR
[INFO] ------------------------------------------------------------------------
[INFO] Resources JAR cannot be found.

Embedded error: Requested download does not exist.
Unable to download the artifact from any repository
[INFO] ------------------------------------------------------------------------
[INFO] For more information, run Maven with the -e switch
[INFO] ------------------------------------------------------------------------
[INFO] Total time: 55 seconds
[INFO] Finished at: Thu Jun 11 02:33:04 GMT-08:00 2009
[INFO] Final Memory: 15M/28M
[INFO] ------------------------------------------------------------------------
---------------------------------------------

To subscribe to this information via syndicated feeds:
- RSS: http://vmgump.apache.org/gump/public/jetty/jetty/rss.xml
- Atom: http://vmgump.apache.org/gump/public/jetty/jetty/atom.xml

============================== Gump Tracking Only ===
Produced by Gump version 2.3.
Gump Run 06000011062009, vmgump:vmgump-public:06000011062009
Gump E-mail Identifier (unique within run) #30.

*********************************************************** G U M P
[GUMP@vmgump]: Project ws-commons-policy (in module ws-axis2-commons) failed
To whom it may engage...
        
This is an automated request, but not an unsolicited one. For 
more information please visit http://gump.apache.org/nagged.html, 
and/or contact the folk at general@gump.apache.org.

Project ws-commons-policy has an issue affecting its community integration.
This issue affects 1 projects,
 and has been outstanding for 981 runs.
The current state of this project is 'Failed', with reason 'Build Failed'.
For reference only, the following projects are affected by this:
    - ws-commons-policy :  Common stuff for the WS projects.


Full details are available at:
    http://vmgump.apache.org/gump/public/ws-axis2-commons/ws-commons-policy/index.html

That said, some information snippets are provided here.

The following annotations (debug/informational/warning/error messages) were provided:
 -DEBUG- Sole output [ws-commons-policy-11062009.jar] identifier set to project name
 -INFO- Optional dependency ws-commons-axiom failed with reason missing build outputs
 -DEBUG- (Gump generated) Maven2 Settings in: /srv/gump/public/workspace/ws-axis2-commons/neethi/gump_mvn_settings.xml
 -INFO- Failed with reason build failed
 -DEBUG- Maven POM in: /srv/gump/public/workspace/ws-axis2-commons/neethi/pom.xml
 -INFO- Failed to extract fallback artifacts from Gump Repository



The following work was performed:
http://vmgump.apache.org/gump/public/ws-axis2-commons/ws-commons-policy/gump_work/build_ws-axis2-commons_ws-commons-policy.html
Work Name: build_ws-axis2-commons_ws-commons-policy (Type: Build)
Work ended in a state of : Failed
Elapsed: 10 secs
Command Line: mvn --batch-mode --settings /srv/gump/public/workspace/ws-axis2-commons/neethi/gump_mvn_settings.xml package 
[Working Directory: /srv/gump/public/workspace/ws-axis2-commons/neethi]
CLASSPATH: /usr/lib/jvm/java-6-sun/lib/tools.jar:/srv/gump/public/workspace/apache-commons/logging/target/commons-logging-11062009.jar:/srv/gump/public/workspace/apache-commons/logging/target/commons-logging-api-11062009.jar:/srv/gump/public/workspace/ws-axis2-commons/axiom/modules/axiom-api/target/axiom-api-SNAPSHOT.jar:/srv/gump/public/workspace/ws-axis2-commons/axiom/modules/axiom-impl/target/axiom-impl-SNAPSHOT.jar:/srv/gump/public/workspace/ws-axis2-commons/axiom/modules/axiom-dom/target/axiom-dom-SNAPSHOT.jar:/srv/gump/public/workspace/wsdl4j/build/lib/qname.jar:/srv/gump/public/workspace/wsdl4j/build/lib/wsdl4j.jar
---------------------------------------------
Missing:
----------
1) org.apache.ws.commons.axiom:axiom-api:jar:SNAPSHOT

  Try downloading the file manually from the project website.

  Then, install it using the command: 
      mvn install:install-file -DgroupId=org.apache.ws.commons.axiom -DartifactId=axiom-api -Dversion=SNAPSHOT -Dpackaging=jar -Dfile=/path/to/file

  Alternatively, if you host your own repository you can deploy the file there: 
      mvn deploy:deploy-file -DgroupId=org.apache.ws.commons.axiom -DartifactId=axiom-api -Dversion=SNAPSHOT -Dpackaging=jar -Dfile=/path/to/file -Durl=[url] -DrepositoryId=[id]

  Path to dependency: 
  	1) org.apache.neethi:neethi:jar:SNAPSHOT
  	2) org.apache.ws.commons.axiom:axiom-api:jar:SNAPSHOT

2) org.apache.ws.commons.axiom:axiom-impl:jar:SNAPSHOT

  Try downloading the file manually from the project website.

  Then, install it using the command: 
      mvn install:install-file -DgroupId=org.apache.ws.commons.axiom -DartifactId=axiom-impl -Dversion=SNAPSHOT -Dpackaging=jar -Dfile=/path/to/file

  Alternatively, if you host your own repository you can deploy the file there: 
      mvn deploy:deploy-file -DgroupId=org.apache.ws.commons.axiom -DartifactId=axiom-impl -Dversion=SNAPSHOT -Dpackaging=jar -Dfile=/path/to/file -Durl=[url] -DrepositoryId=[id]

  Path to dependency: 
  	1) org.apache.neethi:neethi:jar:SNAPSHOT
  	2) org.apache.ws.commons.axiom:axiom-impl:jar:SNAPSHOT

----------
2 required artifacts are missing.

for artifact: 
  org.apache.neethi:neethi:jar:SNAPSHOT

from the specified remote repositories:
  gump-central (http://localhost:8192/maven2),
  maven-central (http://repo1.maven.org/maven/),
  apache-ws-snapshots2 (http://ws.zones.apache.org/repository2)



[INFO] ------------------------------------------------------------------------
[INFO] For more information, run Maven with the -e switch
[INFO] ------------------------------------------------------------------------
[INFO] Total time: 8 seconds
[INFO] Finished at: Thu Jun 11 02:33:15 GMT-08:00 2009
[INFO] Final Memory: 9M/16M
[INFO] ------------------------------------------------------------------------
---------------------------------------------

To subscribe to this information via syndicated feeds:
- RSS: http://vmgump.apache.org/gump/public/ws-axis2-commons/ws-commons-policy/rss.xml
- Atom: http://vmgump.apache.org/gump/public/ws-axis2-commons/ws-commons-policy/atom.xml

============================== Gump Tracking Only ===
Produced by Gump version 2.3.
Gump Run 06000011062009, vmgump:vmgump-public:06000011062009
Gump E-mail Identifier (unique within run) #31.

*********************************************************** G U M P
[GUMP@vmgump]: Project commons-jci (in module apache-commons) failed
To whom it may engage...
        
This is an automated request, but not an unsolicited one. For 
more information please visit http://gump.apache.org/nagged.html, 
and/or contact the folk at general@gump.apache.org.

Project commons-jci has an issue affecting its community integration.
This issue affects 3 projects,
 and has been outstanding for 1000 runs.
The current state of this project is 'Failed', with reason 'Build Failed'.
For reference only, the following projects are affected by this:
    - commons-javaflow :  Commons Javaflow
    - commons-jci :  Commons JCI
    - commons-jci-test :  Apache Commons


Full details are available at:
    http://vmgump.apache.org/gump/public/apache-commons/commons-jci/index.html

That said, some information snippets are provided here.

The following annotations (debug/informational/warning/error messages) were provided:
 -DEBUG- Sole output [commons-jci-11062009.jar] identifier set to project name
 -DEBUG- (Gump generated) Maven2 Settings in: /srv/gump/public/workspace/apache-commons/jci/gump_mvn_settings.xml
 -INFO- Failed with reason build failed
 -DEBUG- Maven POM in: /srv/gump/public/workspace/apache-commons/jci/pom.xml
 -INFO- Failed to extract fallback artifacts from Gump Repository



The following work was performed:
http://vmgump.apache.org/gump/public/apache-commons/commons-jci/gump_work/build_apache-commons_commons-jci.html
Work Name: build_apache-commons_commons-jci (Type: Build)
Work ended in a state of : Failed
Elapsed: 43 secs
Command Line: mvn --batch-mode -Dmaven.test.skip.exec=true --settings /srv/gump/public/workspace/apache-commons/jci/gump_mvn_settings.xml package 
[Working Directory: /srv/gump/public/workspace/apache-commons/jci]
CLASSPATH: /usr/lib/jvm/java-6-sun/lib/tools.jar:/srv/gump/public/workspace/jakarta-bcel/target/bcel-5.3-SNAPSHOT.jar:/srv/gump/public/workspace/apache-commons/collections/build/commons-collections-11062009.jar:/srv/gump/public/workspace/apache-commons/io/target/commons-io-11062009.jar:/srv/gump/public/workspace/apache-commons/lang/target/commons-lang-3.0-SNAPSHOT.jar:/srv/gump/public/workspace/apache-commons/logging/target/commons-logging-11062009.jar:/srv/gump/public/workspace/apache-commons/logging/target/commons-logging-api-11062009.jar:/srv/gump/packages/eclipse/plugins/org.eclipse.jdt.core_3.4.2/jdtcore.jar:/srv/gump/packages/jarjar/jarjar-0.6.jar:/srv/gump/public/workspace/asm/output/dist/lib/asm-analysis-11062009.jar:/srv/gump/public/workspace/asm/output/dist/lib/asm-util-11062009.jar:/srv/gump/public/workspace/asm/output/dist/lib/asm-xml-11062009.jar:/srv/gump/public/workspace/asm/output/dist/lib/asm-commons-11062009.jar:/srv/gump/public/workspace/asm/output/dist/lib
 /asm-11062009.jar:/srv/gump/public/workspace/asm/output/dist/lib/asm-tree-11062009.jar:/srv/gump/packages/antlr-2.7.6/antlr.jar:/srv/gump/packages/groovy-1.0-jsr-03/groovy-1.0-jsr-03.jar:/srv/gump/packages/maven-cobertura-plugin/maven-cobertura-plugin-1.1.jar
---------------------------------------------
1K downloaded
Downloading: http://localhost:8192/maven2/asm/asm-analysis/2.2.1/asm-analysis-2.2.1.pom
1K downloaded
Downloading: http://localhost:8192/maven2/asm/asm-attrs/2.2.1/asm-attrs-2.2.1.pom
1K downloaded
Downloading: http://localhost:8192/maven2/commons-io/commons-io/1.1/commons-io-1.1.pom
5K downloaded
Downloading: http://localhost:8192/maven2/asm/asm/2.2/asm-2.2.pom
807b downloaded
Downloading: http://localhost:8192/maven2/org/vafer/dependency/0.2/dependency-0.2.jar
17K downloaded
Downloading: http://localhost:8192/maven2/asm/asm-commons/2.2.1/asm-commons-2.2.1.jar
32K downloaded
Downloading: http://localhost:8192/maven2/asm/asm/2.2/asm-2.2.jar
42K downloaded
Downloading: http://localhost:8192/maven2/asm/asm-util/2.2.1/asm-util-2.2.1.jar
34K downloaded
Downloading: http://localhost:8192/maven2/asm/asm-analysis/2.2.1/asm-analysis-2.2.1.jar
17K downloaded
Downloading: http://localhost:8192/maven2/asm/asm-attrs/2.2.1/asm-attrs-2.2.1.jar
6K downloaded
[INFO] [antrun:run {execution: javadoc.resources}]
[INFO] Executing tasks
[INFO] Executed tasks
[INFO] [resources:resources]
[WARNING] Using platform encoding (UTF-8 actually) to copy filtered resources, i.e. build is platform dependent!
[INFO] Copying 0 resource to META-INF
[INFO] [compiler:compile]
[INFO] Compiling 6 source files to /srv/gump/public/workspace/apache-commons/jci/compilers/javac/target/classes
[INFO] ------------------------------------------------------------------------
[ERROR] BUILD FAILURE
[INFO] ------------------------------------------------------------------------
[INFO] Compilation failure

/srv/gump/public/workspace/apache-commons/jci/compilers/javac/src/main/java/org/apache/commons/jci/compilers/JavacClassLoader.java:[108,46] cannot find symbol
symbol  : constructor ClassWriter(boolean,boolean)
location: class org.objectweb.asm.ClassWriter

/srv/gump/public/workspace/apache-commons/jci/compilers/javac/src/main/java/org/apache/commons/jci/compilers/JavacClassLoader.java:[109,44] cannot find symbol
symbol  : method accept(org.vafer.dependency.asm.RenamingVisitor,boolean)
location: class org.objectweb.asm.ClassReader


[INFO] ------------------------------------------------------------------------
[INFO] For more information, run Maven with the -e switch
[INFO] ------------------------------------------------------------------------
[INFO] Total time: 41 seconds
[INFO] Finished at: Thu Jun 11 04:02:02 GMT-08:00 2009
[INFO] Final Memory: 27M/51M
[INFO] ------------------------------------------------------------------------
---------------------------------------------

To subscribe to this information via syndicated feeds:
- RSS: http://vmgump.apache.org/gump/public/apache-commons/commons-jci/rss.xml
- Atom: http://vmgump.apache.org/gump/public/apache-commons/commons-jci/atom.xml

============================== Gump Tracking Only ===
Produced by Gump version 2.3.
Gump Run 06000011062009, vmgump:vmgump-public:06000011062009
Gump E-mail Identifier (unique within run) #39.

*********************************************************** G U M P
[GUMP@vmgump]: Module poi success, but with warnings.
To whom it may engage...
        
This is an automated request, but not an unsolicited one. For 
more information please visit http://gump.apache.org/nagged.html, 
and/or contact the folk at general@gump.apache.org.

Module poi contains errors.
The current state of this module is 'Success'.

Full details are available at:
    http://vmgump.apache.org/gump/public/poi/index.html

That said, some information snippets are provided here.

The following annotations (debug/informational/warning/error messages) were provided:
 -ERROR- *** Failed to update from source control.Stale contents ***



The following work was performed:
http://vmgump.apache.org/gump/public/poi/gump_work/update_poi.html
Work Name: update_poi (Type: Update)
Work ended in a state of : Failed
Elapsed: 
Command Line: svn --quiet update --non-interactive poi 
[Working Directory: /srv/gump/public/workspace/cvs]
---------------------------------------------
svn: Working copy 'poi' locked
svn: run 'svn cleanup' to remove locks (type 'svn help cleanup' for details)
---------------------------------------------

To subscribe to this information via syndicated feeds:
- RSS: http://vmgump.apache.org/gump/public/poi/rss.xml
- Atom: http://vmgump.apache.org/gump/public/poi/atom.xml

============================== Gump Tracking Only ===
Produced by Gump version 2.3.
Gump Run 06000011062009, vmgump:vmgump-public:06000011062009
Gump E-mail Identifier (unique within run) #41.

*********************************************************** G U M P
[GUMP@vmgump]: Project maven (in module maven) failed
To whom it may engage...
        
This is an automated request, but not an unsolicited one. For 
more information please visit http://gump.apache.org/nagged.html, 
and/or contact the folk at general@gump.apache.org.

Project maven has an issue affecting its community integration.
This issue affects 1 projects,
 and has been outstanding for 21 runs.
The current state of this project is 'Failed', with reason 'Build Failed'.
For reference only, the following projects are affected by this:
    - maven :  Project Management Tools


Full details are available at:
    http://vmgump.apache.org/gump/public/maven/maven/index.html

That said, some information snippets are provided here.

The following annotations (debug/informational/warning/error messages) were provided:
 -DEBUG- Sole output [maven-11062009.jar] identifier set to project name
 -INFO- Made directory [/srv/gump/public/workspace/maven/target/classes]
 -INFO- Made directory [/srv/gump/public/workspace/maven/target/test-classes]
 -DEBUG- (Gump generated) Maven Properties in: /srv/gump/public/workspace/maven/build.properties
 -INFO- Failed with reason build failed
 -DEBUG- Maven POM in: /srv/gump/public/workspace/maven/project.xml
 -DEBUG- Maven project properties in: /srv/gump/public/workspace/maven/project.properties
 -INFO- Failed to extract fallback artifacts from Gump Repository



The following work was performed:
http://vmgump.apache.org/gump/public/maven/maven/gump_work/build_maven_maven.html
Work Name: build_maven_maven (Type: Build)
Work ended in a state of : Failed
Elapsed: 2 secs
Command Line: maven --offline jar 
[Working Directory: /srv/gump/public/workspace/maven]
CLASSPATH: /usr/lib/jvm/java-6-sun/lib/tools.jar:/srv/gump/public/workspace/maven/target/classes:/srv/gump/public/workspace/maven/target/test-classes:/srv/gump/public/workspace/ant/dist/lib/ant-jmf.jar:/srv/gump/public/workspace/ant/dist/lib/ant-swing.jar:/srv/gump/public/workspace/ant/dist/lib/ant-apache-resolver.jar:/srv/gump/public/workspace/ant/dist/lib/ant-apache-xalan2.jar:/srv/gump/public/workspace/ant/dist/lib/ant-trax.jar:/srv/gump/public/workspace/ant/dist/lib/ant-junit.jar:/srv/gump/public/workspace/ant/dist/lib/ant-launcher.jar:/srv/gump/public/workspace/ant/dist/lib/ant-nodeps.jar:/srv/gump/public/workspace/ant/dist/lib/ant.jar:/srv/gump/public/workspace/apache-commons/beanutils/dist/commons-beanutils-11062009.jar:/srv/gump/public/workspace/apache-commons/cli/target/commons-cli-11062009.jar:/srv/gump/public/workspace/apache-commons/collections/build/commons-collections-11062009.jar:/srv/gump/public/workspace/apache-commons/digester/dist/commons-digester.jar:/srv/
 gump/public/workspace/commons-dormant/graph2/target/commons-graph-11062009.jar:/srv/gump/public/workspace/httpcomponents/oac.hc3x/dist/commons-httpclient.jar:/srv/gump/public/workspace/apache-commons/io/target/commons-io-11062009.jar:/srv/gump/public/workspace/commons-jelly/target/commons-jelly-11062009.jar:/srv/gump/public/workspace/commons-jelly/jelly-tags/ant/target/commons-jelly-tags-ant-11062009.jar:/srv/gump/public/workspace/commons-jelly/jelly-tags/define/target/commons-jelly-tags-define-11062009.jar:/srv/gump/public/workspace/commons-jelly/jelly-tags/util/target/commons-jelly-tags-util-11062009.jar:/srv/gump/public/workspace/commons-jelly/jelly-tags/xml/target/commons-jelly-tags-xml-11062009.jar:/srv/gump/public/workspace/apache-commons/jexl/dist/commons-jexl-11062009.jar:/srv/gump/public/workspace/apache-commons/lang/target/commons-lang-3.0-SNAPSHOT.jar:/srv/gump/public/workspace/apache-commons/logging/target/commons-logging-11062009.jar:/srv/gump/public/workspace/a
 pache-commons/logging/target/commons-logging-api-11062009.jar:/srv/gump/public/workspace/dom4j/build/dom4j.jar:/srv/gump/public/workspace/logging-log4j-12/dist/lib/log4j-11062009.jar:/srv/gump/public/workspace/xml-commons/java/external/build/xml-apis-ext.jar:/srv/gump/public/workspace/xml-commons/java/build/which.jar:/srv/gump/public/workspace/xml-commons/java/build/resolver.jar:/srv/gump/public/workspace/xpp/build/xpp3-11062009.jar
---------------------------------------------
 __  __
|  \/  |__ _Apache__ ___
| |\/| / _` \ V / -_) ' \  ~ intelligent projects ~
|_|  |_\__,_|\_/\___|_||_|  v. 1.0.2

The build cannot continue because of the following unsatisfied dependencies:

jaxen-1.1-beta-9.jar
commons-codec-1.2.jar (try downloading from http://commons.apache.org/codec/)
xercesImpl-2.8.0.jar (try downloading from http://xerces.apache.org/xerces2-j/)
plexus-utils-1.0.5.jar
maven-model-3.0.2.jar
stax-1.2.0.jar
stax-api-1.0.1.jar
stax-utils-20060502.jar
wagon-provider-api-1.0-beta-2.jar
wagon-http-1.0-beta-2.jar
wagon-file-1.0-beta-2.jar
wagon-ssh-common-1.0-beta-2.jar
wagon-ssh-1.0-beta-2.jar
jsch-0.1.27.jar

Total time: 2 seconds
Finished at: Thu Jun 11 04:32:09 GMT-08:00 2009

---------------------------------------------

To subscribe to this information via syndicated feeds:
- RSS: http://vmgump.apache.org/gump/public/maven/maven/rss.xml
- Atom: http://vmgump.apache.org/gump/public/maven/maven/atom.xml

============================== Gump Tracking Only ===
Produced by Gump version 2.3.
Gump Run 06000011062009, vmgump:vmgump-public:06000011062009
Gump E-mail Identifier (unique within run) #42.

*********************************************************** G U M P
[GUMP@vmgump]: Project rat-test (in module rat) failed
To whom it may engage...
        
This is an automated request, but not an unsolicited one. For 
more information please visit http://gump.apache.org/nagged.html, 
and/or contact the folk at general@gump.apache.org.

Project rat-test has an issue affecting its community integration.
This issue affects 1 projects,
 and has been outstanding for 129 runs.
The current state of this project is 'Failed', with reason 'Build Failed'.
For reference only, the following projects are affected by this:
    - rat-test :  Release Audit Tool


Full details are available at:
    http://vmgump.apache.org/gump/public/rat/rat-test/index.html

That said, some information snippets are provided here.

The following annotations (debug/informational/warning/error messages) were provided:
 -WARNING- Overriding Maven2 settings: [/srv/gump/public/workspace/rat/gump_mvn_settings.xml]
 -DEBUG- (Gump generated) Maven2 Settings in: /srv/gump/public/workspace/rat/gump_mvn_settings.xml
 -INFO- Failed with reason build failed
 -DEBUG- Maven POM in: /srv/gump/public/workspace/rat/pom.xml



The following work was performed:
http://vmgump.apache.org/gump/public/rat/rat-test/gump_work/build_rat_rat-test.html
Work Name: build_rat_rat-test (Type: Build)
Work ended in a state of : Failed
Elapsed: 2 mins 18 secs
Command Line: mvn --batch-mode --settings /srv/gump/public/workspace/rat/gump_mvn_settings.xml package 
[Working Directory: /srv/gump/public/workspace/rat]
CLASSPATH: /usr/lib/jvm/java-6-sun/lib/tools.jar:/srv/gump/public/workspace/rat/apache-rat-tasks/target/apache-rat-tasks-0.7-SNAPSHOT.jar:/srv/gump/public/workspace/rat/apache-rat-core/target/apache-rat-core-0.7-SNAPSHOT.jar:/srv/gump/public/workspace/rat/apache-rat-plugin/target/apache-rat-plugin-0.7-SNAPSHOT.jar
---------------------------------------------
[INFO] Using 2 extractors.
[INFO] Applying extractor for language: java
[INFO] Extractor for language: java found 2 mojo descriptors.
[INFO] Applying extractor for language: bsh
[INFO] Extractor for language: bsh found 0 mojo descriptors.
[INFO] [resources:resources]
[INFO] Using 'UTF-8' encoding to copy filtered resources.
[INFO] Copying 1 resource
[INFO] Copying 1 resource
[INFO] Copying 2 resources to META-INF
[INFO] [compiler:compile]
[INFO] Nothing to compile - all classes are up to date
[INFO] [resources:testResources]
[INFO] Using 'UTF-8' encoding to copy filtered resources.
[INFO] skip non existing resourceDirectory /srv/gump/public/workspace/rat/apache-rat-plugin/src/test/resources
[INFO] Copying 0 resource
Downloading: http://localhost:8192/maven2/junit/junit/3.8.2/junit-3.8.2.jar
246K downloaded
[INFO] [compiler:testCompile]
[INFO] Nothing to compile - all classes are up to date
[INFO] [surefire:test]
[INFO] Surefire report directory: /srv/gump/public/workspace/rat/apache-rat-plugin/target/surefire-reports

-------------------------------------------------------
 T E S T S
-------------------------------------------------------
Running org.apache.rat.mp.RatCheckMojoTest
Tests run: 2, Failures: 0, Errors: 2, Skipped: 0, Time elapsed: 0.099 sec <<< FAILURE!

Results :

Tests in error: 
  testIt1(org.apache.rat.mp.RatCheckMojoTest)
  testIt2(org.apache.rat.mp.RatCheckMojoTest)

Tests run: 2, Failures: 0, Errors: 2, Skipped: 0

[INFO] ------------------------------------------------------------------------
[ERROR] BUILD FAILURE
[INFO] ------------------------------------------------------------------------
[INFO] There are test failures.

Please refer to /srv/gump/public/workspace/rat/apache-rat-plugin/target/surefire-reports for the individual test results.
[INFO] ------------------------------------------------------------------------
[INFO] For more information, run Maven with the -e switch
[INFO] ------------------------------------------------------------------------
[INFO] Total time: 2 minutes 17 seconds
[INFO] Finished at: Thu Jun 11 04:34:33 GMT-08:00 2009
[INFO] Final Memory: 18M/35M
[INFO] ------------------------------------------------------------------------
---------------------------------------------

To subscribe to this information via syndicated feeds:
- RSS: http://vmgump.apache.org/gump/public/rat/rat-test/rss.xml
- Atom: http://vmgump.apache.org/gump/public/rat/rat-test/atom.xml

============================== Gump Tracking Only ===
Produced by Gump version 2.3.
Gump Run 06000011062009, vmgump:vmgump-public:06000011062009
Gump E-mail Identifier (unique within run) #43.

*********************************************************** G U M P
[GUMP@vmgump]: Project maven-bootstrap (in module maven) failed
To whom it may engage...
        
This is an automated request, but not an unsolicited one. For 
more information please visit http://gump.apache.org/nagged.html, 
and/or contact the folk at general@gump.apache.org.

Project maven-bootstrap has an issue affecting its community integration.
This issue affects 1 projects,
 and has been outstanding for 21 runs.
The current state of this project is 'Failed', with reason 'Build Failed'.
For reference only, the following projects are affected by this:
    - maven-bootstrap :  Project Management Tools


Full details are available at:
    http://vmgump.apache.org/gump/public/maven/maven-bootstrap/index.html

That said, some information snippets are provided here.

The following annotations (debug/informational/warning/error messages) were provided:
 -DEBUG- Dependency on ant exists, no need to add for property maven.jar.ant.
 -DEBUG- Dependency on xml-commons-which exists, no need to add for property maven.jar.which.
 -INFO- Failed with reason build failed



The following work was performed:
http://vmgump.apache.org/gump/public/maven/maven-bootstrap/gump_work/build_maven_maven-bootstrap.html
Work Name: build_maven_maven-bootstrap (Type: Build)
Work ended in a state of : Failed
Elapsed: 4 secs
Command Line: /usr/lib/jvm/java-6-sun/bin/java -Djava.awt.headless=true -Xbootclasspath/p:/srv/gump/public/workspace/xml-commons/java/external/build/xml-apis.jar:/srv/gump/public/workspace/xml-xerces2/build/xercesImpl.jar org.apache.tools.ant.Main -Dgump.merge=/srv/gump/public/gump/work/merge.xml -Dbuild.sysclasspath=only -Dmaven.jar.ant=/srv/gump/public/workspace/ant/dist/lib/ant.jar -Dmaven.bootstrap.dir=/srv/gump/public/workspace/maven/bootstrap -Dmaven.repo.local=/srv/gump/public/workspace/maven/bootstrap/maven.local.repo -Dmaven.bootstrap.classes=/srv/gump/public/workspace/maven/bootstrap/bootstrap-classes -Dmaven.jar.commons-logging=/srv/gump/public/workspace/apache-commons/logging/target/commons-logging-11062009.jar -Dmaven.home=/srv/gump/public/workspace/maven/bootstrap/maven.home -Dmaven.home.local=/srv/gump/public/workspace/maven/bootstrap/maven.home -Dmaven.jar.commons-cli=/srv/gump/public/workspace/apache-commons/cli/target/commons-cli-11062009.jar -Dmaven.jar.ove
 rride=true -Dmaven.jar.commons-lang=/srv/gump/public/workspace/apache-commons/lang/target/commons-lang-3.0-SNAPSHOT.jar -Dmaven.jar.commons-httpclient=/srv/gump/public/workspace/httpcomponents/oac.hc3x/dist/commons-httpclient.jar -Dmaven.bootstrap.online=-o -Dmaven.bootstrap.phase1.classes=/srv/gump/public/workspace/maven/bootstrap/phase1-classes -Dmaven.jar.velocity=/srv/gump/public/workspace/velocity-engine/bin/velocity-11062009.jar -Dmaven.jar.which=/srv/gump/public/workspace/xml-commons/java/build/which.jar -Dmaven.jar.dom4j=/srv/gump/public/workspace/dom4j/build/dom4j.jar -f build-bootstrap.xml 
[Working Directory: /srv/gump/public/workspace/maven]
CLASSPATH: /usr/lib/jvm/java-6-sun/lib/tools.jar:/srv/gump/public/workspace/maven/bootstrap/bootstrap-classes:/srv/gump/public/workspace/ant/dist/lib/ant-jmf.jar:/srv/gump/public/workspace/ant/dist/lib/ant-swing.jar:/srv/gump/public/workspace/ant/dist/lib/ant-apache-resolver.jar:/srv/gump/public/workspace/ant/dist/lib/ant-apache-xalan2.jar:/srv/gump/public/workspace/ant/dist/lib/ant-trax.jar:/srv/gump/public/workspace/ant/dist/lib/ant-junit.jar:/srv/gump/public/workspace/ant/dist/lib/ant-launcher.jar:/srv/gump/public/workspace/ant/dist/lib/ant-nodeps.jar:/srv/gump/public/workspace/ant/dist/lib/ant.jar:/srv/gump/packages/junit3.8.1/junit.jar:/srv/gump/public/workspace/xml-commons/java/build/resolver.jar:/srv/gump/public/workspace/xml-commons/java/external/build/xml-apis-ext.jar:/srv/gump/public/workspace/apache-commons/betwixt/target/commons-betwixt-11062009.jar:/srv/gump/public/workspace/apache-commons/beanutils/dist/commons-beanutils-11062009.jar:/srv/gump/public/workspace/a
 pache-commons/collections/build/commons-collections-11062009.jar:/srv/gump/public/workspace/apache-commons/digester/dist/commons-digester.jar:/srv/gump/public/workspace/apache-commons/jexl/dist/commons-jexl-11062009.jar:/srv/gump/public/workspace/commons-jelly/target/commons-jelly-11062009.jar:/srv/gump/public/workspace/commons-jelly/jelly-tags/ant/target/commons-jelly-tags-ant-11062009.jar:/srv/gump/public/workspace/commons-jelly/jelly-tags/define/target/commons-jelly-tags-define-11062009.jar:/srv/gump/public/workspace/commons-jelly/jelly-tags/util/target/commons-jelly-tags-util-11062009.jar:/srv/gump/public/workspace/commons-jelly/jelly-tags/xml/target/commons-jelly-tags-xml-11062009.jar:/srv/gump/public/workspace/commons-dormant/graph2/target/commons-graph-11062009.jar:/srv/gump/public/workspace/apache-commons/io/target/commons-io-11062009.jar:/srv/gump/packages/jdepend-2.6/lib/jdepend.jar:/srv/gump/public/workspace/logging-log4j-12/dist/lib/log4j-11062009.jar:/srv/gump/p
 ublic/workspace/xml-commons/java/build/which.jar:/srv/gump/public/workspace/xpp/build/xpp3_xpath-11062009.jar:/srv/gump/public/workspace/xpp/build/xpp3-11062009.jar:/srv/gump/public/workspace/xpp/build/xpp3_min-11062009.jar:/srv/gump/public/workspace/apache-commons/cli/target/commons-cli-11062009.jar:/srv/gump/public/workspace/apache-commons/lang/target/commons-lang-3.0-SNAPSHOT.jar:/srv/gump/public/workspace/apache-commons/logging/target/commons-logging-11062009.jar:/srv/gump/public/workspace/httpcomponents/oac.hc3x/dist/commons-httpclient.jar:/srv/gump/public/workspace/dom4j/build/dom4j.jar:/srv/gump/public/workspace/velocity-engine/bin/velocity-11062009.jar
---------------------------------------------
    [javac] symbol  : class TransferEvent
    [javac] location: class org.apache.maven.util.ConsoleDownloadMeter
    [javac]     public void transferStarted( TransferEvent transferEvent )
    [javac]                                  ^
    [javac] /srv/gump/public/workspace/maven/src/java/org/apache/maven/util/ConsoleDownloadMeter.java:50: cannot find symbol
    [javac] symbol  : class TransferEvent
    [javac] location: class org.apache.maven.util.ConsoleDownloadMeter
    [javac]     public void transferProgress( TransferEvent transferEvent, byte[] buffer, int length )
    [javac]                                   ^
    [javac] /srv/gump/public/workspace/maven/src/java/org/apache/maven/util/ConsoleDownloadMeter.java:57: cannot find symbol
    [javac] symbol  : class TransferEvent
    [javac] location: class org.apache.maven.util.ConsoleDownloadMeter
    [javac]     public void transferCompleted( TransferEvent transferEvent )
    [javac]                                    ^
    [javac] /srv/gump/public/workspace/maven/src/java/org/apache/maven/util/ConsoleDownloadMeter.java:63: cannot find symbol
    [javac] symbol  : class TransferEvent
    [javac] location: class org.apache.maven.util.ConsoleDownloadMeter
    [javac]     public void transferError( TransferEvent transferEvent )
    [javac]                                ^
    [javac] /srv/gump/public/workspace/maven/src/java/org/apache/maven/util/DVSLPathTool.java:21: package org.codehaus.plexus.util does not exist
    [javac] import org.codehaus.plexus.util.StringUtils;
    [javac]                                ^
    [javac] /srv/gump/public/workspace/maven/src/java/org/apache/maven/util/HttpUtils.java:28: package org.apache.maven.wagon does not exist
    [javac] import org.apache.maven.wagon.ConnectionException;
    [javac]                              ^
    [javac] /srv/gump/public/workspace/maven/src/java/org/apache/maven/util/HttpUtils.java:29: package org.apache.maven.wagon does not exist
    [javac] import org.apache.maven.wagon.Wagon;
    [javac]                              ^
    [javac] /srv/gump/public/workspace/maven/src/java/org/apache/maven/util/HttpUtils.java:30: package org.apache.maven.wagon.providers.file does not exist
    [javac] import org.apache.maven.wagon.providers.file.FileWagon;
    [javac]                                             ^
    [javac] /srv/gump/public/workspace/maven/src/java/org/apache/maven/util/HttpUtils.java:31: package org.apache.maven.wagon.providers.http does not exist
    [javac] import org.apache.maven.wagon.providers.http.HttpWagon;
    [javac]                                             ^
    [javac] /srv/gump/public/workspace/maven/src/java/org/apache/maven/util/HttpUtils.java:32: package org.apache.maven.wagon.proxy does not exist
    [javac] import org.apache.maven.wagon.proxy.ProxyInfo;
    [javac]                                    ^
    [javac] /srv/gump/public/workspace/maven/src/java/org/apache/maven/util/HttpUtils.java:33: package org.apache.maven.wagon.repository does not exist
    [javac] import org.apache.maven.wagon.repository.Repository;
    [javac]                                         ^
    [javac] Note: Some input files use or override a deprecated API.
    [javac] Note: Recompile with -Xlint:deprecation for details.
    [javac] Note: Some input files use unchecked or unsafe operations.
    [javac] Note: Recompile with -Xlint:unchecked for details.
    [javac] 100 errors

BUILD FAILED
/srv/gump/public/workspace/maven/build-bootstrap.xml:234: Compile failed; see the compiler error output for details.

Total time: 3 seconds
---------------------------------------------

To subscribe to this information via syndicated feeds:
- RSS: http://vmgump.apache.org/gump/public/maven/maven-bootstrap/rss.xml
- Atom: http://vmgump.apache.org/gump/public/maven/maven-bootstrap/atom.xml

============================== Gump Tracking Only ===
Produced by Gump version 2.3.
Gump Run 06000011062009, vmgump:vmgump-public:06000011062009
Gump E-mail Identifier (unique within run) #44.

*********************************************************** G U M P
[GUMP@vmgump]: Project cocoon (in module cocoon) failed
To whom it may engage...
        
This is an automated request, but not an unsolicited one. For 
more information please visit http://gump.apache.org/nagged.html, 
and/or contact the folk at general@gump.apache.org.

Project cocoon has an issue affecting its community integration.
This issue affects 2 projects,
 and has been outstanding for 1004 runs.
The current state of this project is 'Failed', with reason 'Build Failed'.
For reference only, the following projects are affected by this:
    - cocoon :  Java XML Framework
    - lenya :  Content Management System


Full details are available at:
    http://vmgump.apache.org/gump/public/cocoon/cocoon/index.html

That said, some information snippets are provided here.

The following annotations (debug/informational/warning/error messages) were provided:
 -INFO- Optional dependency htmlunit prerequisite failed with reason build failed
 -DEBUG- (Gump generated) Maven2 Settings in: /srv/gump/public/workspace/cocoon/gump_mvn_settings.xml
 -INFO- Failed with reason build failed
 -DEBUG- Maven POM in: /srv/gump/public/workspace/cocoon/pom.xml



The following work was performed:
http://vmgump.apache.org/gump/public/cocoon/cocoon/gump_work/build_cocoon_cocoon.html
Work Name: build_cocoon_cocoon (Type: Build)
Work ended in a state of : Failed
Elapsed: 3 mins
Command Line: mvn --batch-mode --settings /srv/gump/public/workspace/cocoon/gump_mvn_settings.xml package 
[Working Directory: /srv/gump/public/workspace/cocoon]
CLASSPATH: /usr/lib/jvm/java-6-sun/lib/tools.jar:/srv/gump/public/workspace/junit/dist/junit-11062009.jar:/srv/gump/public/workspace/apache-commons/lang/target/commons-lang-3.0-SNAPSHOT.jar:/srv/gump/public/workspace/ant/dist/lib/ant-jmf.jar:/srv/gump/public/workspace/ant/dist/lib/ant-swing.jar:/srv/gump/public/workspace/ant/dist/lib/ant-apache-resolver.jar:/srv/gump/public/workspace/ant/dist/lib/ant-apache-xalan2.jar:/srv/gump/public/workspace/ant/dist/lib/ant-trax.jar:/srv/gump/public/workspace/ant/dist/lib/ant-junit.jar:/srv/gump/public/workspace/ant/dist/lib/ant-launcher.jar:/srv/gump/public/workspace/ant/dist/lib/ant-nodeps.jar:/srv/gump/public/workspace/ant/dist/lib/ant.jar:/srv/gump/public/workspace/aopalliance/build/aopalliance.jar:/srv/gump/packages/bsh-2.0b4/bsh-commands-2.0b4.jar:/srv/gump/packages/bsh-2.0b4/bsh-classpath-2.0b4.jar:/srv/gump/packages/bsh-2.0b4/bsh-core-2.0b4.jar:/srv/gump/packages/bsh-2.0b4/bsh-bsf-2.0b4.jar:/srv/gump/packages/bsh-2.0b4/bsh-2.0b4.j
 ar:/srv/gump/packages/bsh-2.0b4/bsh-reflect-2.0b4.jar:/srv/gump/packages/bsh-2.0b4/bsh-util-2.0b4.jar:/srv/gump/public/workspace/apache-commons/beanutils/dist/commons-beanutils-11062009.jar:/srv/gump/public/workspace/apache-commons/codec/dist/commons-codec-11062009.jar:/srv/gump/public/workspace/apache-commons/collections/build/commons-collections-11062009.jar:/srv/gump/public/workspace/apache-commons/configuration/target/commons-configuration-1.7-SNAPSHOT.jar:/srv/gump/public/workspace/apache-commons/digester/dist/commons-digester.jar:/srv/gump/public/workspace/httpcomponents/oac.hc3x/dist/commons-httpclient.jar:/srv/gump/public/workspace/apache-commons/io/target/commons-io-11062009.jar:/srv/gump/public/workspace/apache-commons/jexl/dist/commons-jexl-11062009.jar:/srv/gump/public/workspace/apache-commons/jxpath/dist/commons-jxpath.jar:/srv/gump/public/workspace/apache-commons/logging/target/commons-logging-11062009.jar:/srv/gump/public/workspace/apache-commons/logging/targe
 t/commons-logging-api-11062009.jar:/srv/gump/public/workspace/apache-commons/validator/dist/commons-validator-11062009.jar:/srv/gump/packages/dougLea/concurrent.jar:/srv/gump/public/workspace/dom4j/build/dom4j.jar:/srv/gump/public/workspace/excalibur/components/datasource/target/excalibur-datasource-11062009.jar:/srv/gump/public/workspace/excalibur/components/pool/instrumented/target/excalibur-pool-instrumented-11062009.jar:/srv/gump/public/workspace/hsqldb/lib/hsqldb.jar:/srv/gump/public/workspace/htmlunit/target/htmlunit-11062009.jar:/srv/gump/public/workspace/jakarta-oro/jakarta-oro-11062009.jar:/srv/gump/public/workspace/jakarta-regexp/build/jakarta-regexp-11062009.jar:/srv/gump/public/workspace/jaxen/target/jaxen-11062009.jar:/srv/gump/public/workspace/jdom/build/jdom.jar:/srv/gump/public/workspace/jmock/build/dist/jmock-core-11062009.jar:/srv/gump/public/workspace/jmock/build/dist/jmock-cglib-11062009.jar:/srv/gump/packages/jtidy-04aug2000r7-dev/build/Tidy.jar:/srv/gum
 p/public/workspace/logging-log4j-12/dist/lib/log4j-11062009.jar:/srv/gump/packages/nekohtml-0.9.5/nekohtml.jar:/srv/gump/public/workspace/rhino/build/rhino_11062009/js.jar:/srv/gump/public/workspace/velocity-engine/bin/velocity-11062009.jar:/srv/gump/public/workspace/velocity-engine/bin/velocity-11062009-dep.jar:/srv/gump/public/workspace/xml-commons/java/external/build/xml-apis-ext.jar:/srv/gump/public/workspace/xml-commons/java/external/build/xml-apis.jar:/srv/gump/public/workspace/xml-batik/batik-11062009/lib/batik-util.jar:/srv/gump/public/workspace/xml-batik/batik-11062009/lib/batik-swing.jar:/srv/gump/public/workspace/xml-batik/batik-11062009/lib/batik-css.jar:/srv/gump/public/workspace/xml-batik/batik-11062009/lib/batik-bridge.jar:/srv/gump/public/workspace/xml-batik/batik-11062009/lib/batik-xml.jar:/srv/gump/public/workspace/xml-batik/batik-11062009/lib/batik-svg-dom.jar:/srv/gump/public/workspace/xml-batik/batik-11062009/lib/batik-awt-util.jar:/srv/gump/public/works
 pace/xml-batik/batik-11062009/lib/batik-transcoder.jar:/srv/gump/public/workspace/xml-batik/batik-11062009/lib/batik-gui-util.jar:/srv/gump/public/workspace/xml-batik/batik-11062009/lib/batik-dom.jar:/srv/gump/public/workspace/xml-batik/batik-11062009/lib/batik-ext.jar:/srv/gump/public/workspace/xml-batik/batik-11062009/lib/batik-script.jar:/srv/gump/public/workspace/xml-batik/batik-11062009/lib/batik-svggen.jar:/srv/gump/public/workspace/xml-batik/batik-11062009/lib/batik-parser.jar:/srv/gump/public/workspace/xml-batik/batik-11062009/lib/batik-extension.jar:/srv/gump/public/workspace/xml-batik/batik-11062009/lib/batik-gvt.jar:/srv/gump/public/workspace/xml-fop/build/fop.jar:/srv/gump/public/workspace/xml-commons/java/build/resolver.jar:/srv/gump/public/workspace/xml-xerces2/build/xercesImpl.jar:/srv/gump/public/workspace/xmlunit/build/java/lib/xmlunit-sumo-11062009.jar:/srv/gump/public/workspace/xmlunit/build/java/lib/xmlunit-legacy-11062009.jar:/srv/gump/public/workspace/x
 mlunit/build/java/lib/xmlunit-core-11062009.jar:/srv/gump/public/workspace/xom/build/xom-11062009.jar
---------------------------------------------
Downloading: http://localhost:8192/maven2/org/apache/maven/maven-repository-metadata/2.0.1/maven-repository-metadata-2.0.1.jar
19K downloaded
Downloading: http://people.apache.org/~gkossakowski/maven2/repository/org/apache/maven/wagon/wagon-provider-api/1.0-alpha-5/wagon-provider-api-1.0-alpha-5.jar
Downloading: http://localhost:8192/maven2/org/apache/maven/wagon/wagon-provider-api/1.0-alpha-5/wagon-provider-api-1.0-alpha-5.jar
50K downloaded
Downloading: http://localhost:8192/maven2/org/apache/maven/plugins/maven-war-plugin/2.0.2/maven-war-plugin-2.0.2.jar
27K downloaded
Downloading: http://people.apache.org/~gkossakowski/maven2/repository/org/apache/maven/maven-archiver/2.2/maven-archiver-2.2.jar
Downloading: http://localhost:8192/maven2/org/apache/maven/maven-archiver/2.2/maven-archiver-2.2.jar
9K downloaded
Downloading: http://localhost:8192/maven2/javax/servlet/servlet-api/2.4/servlet-api-2.4.jar
91K downloaded
[INFO] [plugin:descriptor]
[WARNING] 

Goal prefix is specified as: 'cocoon'. Maven currently expects it to be 'cocoon'.

[INFO] Using 2 extractors.
[INFO] Applying extractor for language: java
[INFO] Extractor for language: java found 4 mojo descriptors.
[INFO] Applying extractor for language: bsh
[INFO] Extractor for language: bsh found 0 mojo descriptors.
[INFO] [resources:resources]
[WARNING] Using platform encoding (UTF-8 actually) to copy filtered resources, i.e. build is platform dependent!
[INFO] Copying 7 resources
[INFO] Copying 2 resources to META-INF
[INFO] [compiler:compile]
[INFO] Compiling 24 source files to /srv/gump/public/workspace/cocoon/tools/cocoon-maven-plugin/target/classes
[INFO] ------------------------------------------------------------------------
[ERROR] BUILD FAILURE
[INFO] ------------------------------------------------------------------------
[INFO] Compilation failure
/srv/gump/public/workspace/cocoon/tools/cocoon-maven-plugin/src/main/java/org/apache/cocoon/maven/rcl/PrepareWebappMojo.java:[285,8] cannot access org.apache.commons.lang.exception.NestableException
class file for org.apache.commons.lang.exception.NestableException not found
        try {



/srv/gump/public/workspace/cocoon/tools/cocoon-maven-plugin/src/main/java/org/apache/cocoon/maven/rcl/PrepareWebappMojo.java:[285,8] cannot access org.apache.commons.lang.exception.NestableException
class file for org.apache.commons.lang.exception.NestableException not found
        try {


[INFO] ------------------------------------------------------------------------
[INFO] For more information, run Maven with the -e switch
[INFO] ------------------------------------------------------------------------
[INFO] Total time: 2 minutes 58 seconds
[INFO] Finished at: Thu Jun 11 04:50:31 GMT-08:00 2009
[INFO] Final Memory: 54M/96M
[INFO] ------------------------------------------------------------------------
---------------------------------------------

To subscribe to this information via syndicated feeds:
- RSS: http://vmgump.apache.org/gump/public/cocoon/cocoon/rss.xml
- Atom: http://vmgump.apache.org/gump/public/cocoon/cocoon/atom.xml

============================== Gump Tracking Only ===
Produced by Gump version 2.3.
Gump Run 06000011062009, vmgump:vmgump-public:06000011062009
Gump E-mail Identifier (unique within run) #46.

*********************************************************** G U M P
[GUMP@vmgump]: Project kerberos-common (in module kerberos-shared) failed
To whom it may engage...
        
This is an automated request, but not an unsolicited one. For 
more information please visit http://gump.apache.org/nagged.html, 
and/or contact the folk at general@gump.apache.org.

Project kerberos-common has an issue affecting its community integration.
This issue affects 2 projects,
 and has been outstanding for 61 runs.
The current state of this project is 'Failed', with reason 'Build Failed'.
For reference only, the following projects are affected by this:
    - kerberos-common :  Apache Directory Project
    - kerberos-protocol :  Apache Kerberos Server


Full details are available at:
    http://vmgump.apache.org/gump/public/kerberos-shared/kerberos-common/index.html

That said, some information snippets are provided here.

The following annotations (debug/informational/warning/error messages) were provided:
 -DEBUG- Sole output [kerberos-common-11062009.jar] identifier set to project name
 -DEBUG- (Gump generated) Maven2 Settings in: /srv/gump/public/workspace/kerberos-shared/gump_mvn_settings.xml
 -INFO- Failed with reason build failed
 -DEBUG- Maven POM in: /srv/gump/public/workspace/kerberos-shared/pom.xml
 -INFO- Project Reports in: /srv/gump/public/workspace/kerberos-shared/common/target/test-reports
 -WARNING- No directory [/srv/gump/public/workspace/kerberos-shared/common/target/test-reports]
 -INFO- Failed to extract fallback artifacts from Gump Repository



The following work was performed:
http://vmgump.apache.org/gump/public/kerberos-shared/kerberos-common/gump_work/build_kerberos-shared_kerberos-common.html
Work Name: build_kerberos-shared_kerberos-common (Type: Build)
Work ended in a state of : Failed
Elapsed: 2 secs
Command Line: mvn --batch-mode --settings /srv/gump/public/workspace/kerberos-shared/gump_mvn_settings.xml package 
[Working Directory: /srv/gump/public/workspace/kerberos-shared]
CLASSPATH: /usr/lib/jvm/java-6-sun/lib/tools.jar:/srv/gump/public/workspace/directory-shared/asn1/target/shared-asn1-0.9.15-SNAPSHOT.jar:/srv/gump/packages/bouncycastle-jdk14/bcprov-130.jar:/srv/gump/public/workspace/directory-shared/ldap/target/shared-ldap-0.9.15-SNAPSHOT.jar
---------------------------------------------
	at org.apache.maven.cli.MavenCli.main(MavenCli.java:301)
	at sun.reflect.NativeMethodAccessorImpl.invoke0(Native Method)
	at sun.reflect.NativeMethodAccessorImpl.invoke(NativeMethodAccessorImpl.java:39)
	at sun.reflect.DelegatingMethodAccessorImpl.invoke(DelegatingMethodAccessorImpl.java:25)
	at java.lang.reflect.Method.invoke(Method.java:597)
	at org.codehaus.classworlds.Launcher.launchEnhanced(Launcher.java:315)
	at org.codehaus.classworlds.Launcher.launch(Launcher.java:255)
	at org.codehaus.classworlds.Launcher.mainWithExitCode(Launcher.java:430)
	at org.codehaus.classworlds.Launcher.main(Launcher.java:375)
Caused by: org.apache.maven.project.ProjectBuildingException: Cannot find parent: org.apache.directory.server:apacheds-parent for project: null:apacheds-kerberos-shared:jar:null for project null:apacheds-kerberos-shared:jar:null
	at org.apache.maven.project.DefaultMavenProjectBuilder.assembleLineage(DefaultMavenProjectBuilder.java:1369)
	at org.apache.maven.project.DefaultMavenProjectBuilder.buildInternal(DefaultMavenProjectBuilder.java:820)
	at org.apache.maven.project.DefaultMavenProjectBuilder.buildFromSourceFileInternal(DefaultMavenProjectBuilder.java:505)
	at org.apache.maven.project.DefaultMavenProjectBuilder.build(DefaultMavenProjectBuilder.java:197)
	at org.apache.maven.DefaultMaven.getProject(DefaultMaven.java:583)
	at org.apache.maven.DefaultMaven.collectProjects(DefaultMaven.java:461)
	at org.apache.maven.DefaultMaven.getProjects(DefaultMaven.java:365)
	... 11 more
Caused by: org.apache.maven.project.ProjectBuildingException: POM 'org.apache.directory.server:apacheds-parent' not found in repository: Unable to download the artifact from any repository

  org.apache.directory.server:apacheds-parent:pom:1.5.5-SNAPSHOT

from the specified remote repositories:
  gump-central (http://localhost:8192/maven2)

 for project org.apache.directory.server:apacheds-parent
	at org.apache.maven.project.DefaultMavenProjectBuilder.findModelFromRepository(DefaultMavenProjectBuilder.java:602)
	at org.apache.maven.project.DefaultMavenProjectBuilder.assembleLineage(DefaultMavenProjectBuilder.java:1365)
	... 17 more
Caused by: org.apache.maven.artifact.resolver.ArtifactNotFoundException: Unable to download the artifact from any repository

  org.apache.directory.server:apacheds-parent:pom:1.5.5-SNAPSHOT

from the specified remote repositories:
  gump-central (http://localhost:8192/maven2)


	at org.apache.maven.artifact.resolver.DefaultArtifactResolver.resolve(DefaultArtifactResolver.java:212)
	at org.apache.maven.artifact.resolver.DefaultArtifactResolver.resolve(DefaultArtifactResolver.java:74)
	at org.apache.maven.project.DefaultMavenProjectBuilder.findModelFromRepository(DefaultMavenProjectBuilder.java:555)
	... 18 more
Caused by: org.apache.maven.wagon.ResourceDoesNotExistException: Unable to download the artifact from any repository
	at org.apache.maven.artifact.manager.DefaultWagonManager.getArtifact(DefaultWagonManager.java:332)
	at org.apache.maven.artifact.resolver.DefaultArtifactResolver.resolve(DefaultArtifactResolver.java:200)
	... 20 more
[INFO] ------------------------------------------------------------------------
[INFO] Total time: < 1 second
[INFO] Finished at: Thu Jun 11 04:58:55 GMT-08:00 2009
[INFO] Final Memory: 1M/4M
[INFO] ------------------------------------------------------------------------
---------------------------------------------

To subscribe to this information via syndicated feeds:
- RSS: http://vmgump.apache.org/gump/public/kerberos-shared/kerberos-common/rss.xml
- Atom: http://vmgump.apache.org/gump/public/kerberos-shared/kerberos-common/atom.xml

============================== Gump Tracking Only ===
Produced by Gump version 2.3.
Gump Run 06000011062009, vmgump:vmgump-public:06000011062009
Gump E-mail Identifier (unique within run) #51.

*********************************************************** G U M P
[GUMP@vmgump]: Project naming-config-test (in module directory-naming) failed
To whom it may engage...
        
This is an automated request, but not an unsolicited one. For 
more information please visit http://gump.apache.org/nagged.html, 
and/or contact the folk at general@gump.apache.org.

Project naming-config-test has an issue affecting its community integration.
This issue affects 1 projects,
 and has been outstanding for 21 runs.
The current state of this project is 'Failed', with reason 'Build Failed'.
For reference only, the following projects are affected by this:
    - naming-config-test :  Apache Directory Naming Component


Full details are available at:
    http://vmgump.apache.org/gump/public/directory-naming/naming-config-test/index.html

That said, some information snippets are provided here.

The following annotations (debug/informational/warning/error messages) were provided:
 -WARNING- Overriding Maven properties: [/srv/gump/public/workspace/directory-naming/naming-config/build.properties]
 -DEBUG- (Gump generated) Maven Properties in: /srv/gump/public/workspace/directory-naming/naming-config/build.properties
 -INFO- Failed with reason build failed
 -DEBUG- Maven POM in: /srv/gump/public/workspace/directory-naming/naming-config/project.xml
 -DEBUG- Maven project properties in: /srv/gump/public/workspace/directory-naming/naming-config/project.properties
 -INFO- Project Reports in: /srv/gump/public/workspace/directory-naming/naming-config/target/test-reports



The following work was performed:
http://vmgump.apache.org/gump/public/directory-naming/naming-config-test/gump_work/build_directory-naming_naming-config-test.html
Work Name: build_directory-naming_naming-config-test (Type: Build)
Work ended in a state of : Failed
Elapsed: 6 secs
Command Line: maven --offline test 
[Working Directory: /srv/gump/public/workspace/directory-naming/naming-config]
CLASSPATH: /usr/lib/jvm/java-6-sun/lib/tools.jar:/srv/gump/public/workspace/apache-commons/beanutils/dist/commons-beanutils-11062009.jar:/srv/gump/public/workspace/apache-commons/collections/build/commons-collections-11062009.jar:/srv/gump/public/workspace/apache-commons/dbcp/dist/commons-dbcp.jar:/srv/gump/public/workspace/apache-commons/digester/dist/commons-digester.jar:/srv/gump/public/workspace/apache-commons/lang/target/commons-lang-3.0-SNAPSHOT.jar:/srv/gump/public/workspace/apache-commons/logging/target/commons-logging-11062009.jar:/srv/gump/public/workspace/apache-commons/logging/target/commons-logging-api-11062009.jar:/srv/gump/public/workspace/apache-commons/pool/dist/commons-pool.jar:/srv/gump/public/workspace/hsqldb/lib/hsqldb.jar:/srv/gump/public/workspace/junit/dist/junit-11062009.jar:/srv/gump/public/workspace/directory-naming/naming-config/target/naming-config-11062009.jar:/srv/gump/public/workspace/directory-naming/naming-core/target/naming-core-11062009.jar
 :/srv/gump/public/workspace/directory-naming/naming-factory/target/naming-factory-11062009.jar:/srv/gump/public/workspace/directory-naming/naming-java/target/naming-java-11062009.jar:/srv/gump/packages/maven-site-plugin/maven-site-plugin-1.6.1.jar
---------------------------------------------
 __  __
|  \/  |__ _Apache__ ___
| |\/| / _` \ V / -_) ' \  ~ intelligent projects ~
|_|  |_\__,_|\_/\___|_||_|  v. 1.0.2

You are working offline so the build will continue, but naming-core-0.9-SNAPSHOT.jar may be out of date!
You are working offline so the build will continue, but naming-factory-0.9-SNAPSHOT.jar may be out of date!
You are working offline so the build will continue, but naming-java-0.9-SNAPSHOT.jar may be out of date!
build:start:

java:prepare-filesystem:

java:compile:
    [echo] Compiling to /srv/gump/public/workspace/directory-naming/naming-config/target/classes

java:jar-resources:

test:prepare-filesystem:

test:test-resources:
Copying 5 files to /srv/gump/public/workspace/directory-naming/naming-config/target/test-classes

test:compile:
    [javac] Compiling 1 source file to /srv/gump/public/workspace/directory-naming/naming-config/target/test-classes

test:test:
    [junit] Running org.apache.naming.config.XmlConfiguratorTest
    [junit] Tests run: 5, Failures: 0, Errors: 5, Time elapsed: 0.467 sec
    [junit] [ERROR] TEST org.apache.naming.config.XmlConfiguratorTest FAILED

BUILD FAILED
File...... /home/gump/.maven/cache/maven-test-plugin-1.6.2/plugin.jelly
Element... fail
Line...... 181
Column.... 54
There were test failures.
Total time: 5 seconds
Finished at: Thu Jun 11 04:59:01 GMT-08:00 2009

---------------------------------------------

To subscribe to this information via syndicated feeds:
- RSS: http://vmgump.apache.org/gump/public/directory-naming/naming-config-test/rss.xml
- Atom: http://vmgump.apache.org/gump/public/directory-naming/naming-config-test/atom.xml

============================== Gump Tracking Only ===
Produced by Gump version 2.3.
Gump Run 06000011062009, vmgump:vmgump-public:06000011062009
Gump E-mail Identifier (unique within run) #52.

*********************************************************** G U M P
[GUMP@vmgump]: Project tapestry (in module tapestry) failed
To whom it may engage...
        
This is an automated request, but not an unsolicited one. For 
more information please visit http://gump.apache.org/nagged.html, 
and/or contact the folk at general@gump.apache.org.

Project tapestry has an issue affecting its community integration.
This issue affects 1 projects,
 and has been outstanding for 980 runs.
The current state of this project is 'Failed', with reason 'Build Failed'.
For reference only, the following projects are affected by this:
    - tapestry :  Component-based web application framework organized around i...


Full details are available at:
    http://vmgump.apache.org/gump/public/tapestry/tapestry/index.html

That said, some information snippets are provided here.

The following annotations (debug/informational/warning/error messages) were provided:
 -DEBUG- Sole output [tapestry-11062009.jar] identifier set to project name
 -DEBUG- (Gump generated) Maven2 Settings in: /srv/gump/public/workspace/tapestry/gump_mvn_settings.xml
 -INFO- Failed with reason build failed
 -DEBUG- Maven POM in: /srv/gump/public/workspace/tapestry/pom.xml
 -INFO- Failed to extract fallback artifacts from Gump Repository



The following work was performed:
http://vmgump.apache.org/gump/public/tapestry/tapestry/gump_work/build_tapestry_tapestry.html
Work Name: build_tapestry_tapestry (Type: Build)
Work ended in a state of : Failed
Elapsed: 2 mins 48 secs
Command Line: mvn --batch-mode --settings /srv/gump/public/workspace/tapestry/gump_mvn_settings.xml package 
[Working Directory: /srv/gump/public/workspace/tapestry]
CLASSPATH: /usr/lib/jvm/java-6-sun/lib/tools.jar:/srv/gump/public/workspace/apache-commons/beanutils/dist/commons-beanutils-11062009.jar:/srv/gump/public/workspace/apache-commons/codec/dist/commons-codec-11062009.jar:/srv/gump/public/workspace/apache-commons/digester/dist/commons-digester.jar:/srv/gump/public/workspace/apache-commons/fileupload/target/commons-fileupload-11062009.jar:/srv/gump/public/workspace/apache-commons/io/target/commons-io-11062009.jar:/srv/gump/public/workspace/apache-commons/lang/target/commons-lang-3.0-SNAPSHOT.jar:/srv/gump/public/workspace/apache-commons/logging/target/commons-logging-11062009.jar:/srv/gump/public/workspace/apache-commons/logging/target/commons-logging-api-11062009.jar:/srv/gump/packages/easymock1.2_Java1.3/easymock.jar:/srv/gump/packages/easymockclassextension1.2/easymockclassextension.jar:/srv/gump/public/workspace/jakarta-oro/jakarta-oro-11062009.jar:/srv/gump/public/workspace/jakarta-servletapi-4/lib/servlet.jar:/srv/gump/public
 /workspace/javassist/javassist.jar:/srv/gump/public/workspace/jdom/build/jdom.jar:/srv/gump/public/workspace/logging-log4j-12/dist/lib/log4j-11062009.jar:/srv/gump/packages/ognl-2.6.7/ognl-2.6.7.jar:/srv/gump/public/workspace/xml-commons/java/external/build/xml-apis-ext.jar:/srv/gump/packages/jCharts-0.7.5/jCharts-0.7.5.jar
---------------------------------------------
location: class org.apache.tapestry.services.impl.HiveMindExpressionCompiler

/srv/gump/public/workspace/tapestry/tapestry-framework/src/java/org/apache/tapestry/services/impl/HiveMindExpressionCompiler.java:[425,21] cannot find symbol
symbol  : method getRootExpression(ognl.Node,java.lang.Object,ognl.OgnlContext)
location: class org.apache.tapestry.services.impl.HiveMindExpressionCompiler

/srv/gump/public/workspace/tapestry/tapestry-framework/src/java/org/apache/tapestry/listener/ListenerMapPropertyAccessor.java:[81,20] cannot find symbol
symbol  : method getPropertyClass(ognl.OgnlContext,java.lang.Object,java.lang.Object)
location: class ognl.ObjectPropertyAccessor

/srv/gump/public/workspace/tapestry/tapestry-framework/src/java/org/apache/tapestry/listener/ListenerMapPropertyAccessor.java:[91,36] cannot find symbol
symbol  : method getCompiler()
location: class ognl.OgnlRuntime

/srv/gump/public/workspace/tapestry/tapestry-framework/src/java/org/apache/tapestry/listener/ListenerMapPropertyAccessor.java:[93,12] cannot find symbol
symbol  : variable ExpressionCompiler
location: class org.apache.tapestry.listener.ListenerMapPropertyAccessor

/srv/gump/public/workspace/tapestry/tapestry-framework/src/java/org/apache/tapestry/listener/ListenerMapPropertyAccessor.java:[95,19] cannot find symbol
symbol  : method setCurrentAccessor(java.lang.Class)
location: class ognl.OgnlContext

/srv/gump/public/workspace/tapestry/tapestry-framework/src/java/org/apache/tapestry/listener/ListenerMapPropertyAccessor.java:[96,19] cannot find symbol
symbol  : method setCurrentType(java.lang.Class)
location: class ognl.OgnlContext

/srv/gump/public/workspace/tapestry/tapestry-framework/src/java/org/apache/tapestry/listener/ListenerMapPropertyAccessor.java:[101,20] cannot find symbol
symbol  : method getSourceAccessor(ognl.OgnlContext,java.lang.Object,java.lang.Object)
location: class ognl.ObjectPropertyAccessor

/srv/gump/public/workspace/tapestry/tapestry-framework/src/java/org/apache/tapestry/listener/ListenerMapPropertyAccessor.java:[106,18] cannot find symbol
symbol  : class UnsupportedCompilationException
location: class org.apache.tapestry.listener.ListenerMapPropertyAccessor

/srv/gump/public/workspace/tapestry/tapestry-framework/src/java/org/apache/tapestry/binding/ExpressionBinding.java:[135,45] cannot find symbol
symbol  : method getAccessor()
location: interface ognl.Node

/srv/gump/public/workspace/tapestry/tapestry-framework/src/java/org/apache/tapestry/binding/ExpressionBinding.java:[210,53] cannot find symbol
symbol  : method getAccessor()
location: interface ognl.Node


[INFO] ------------------------------------------------------------------------
[INFO] For more information, run Maven with the -e switch
[INFO] ------------------------------------------------------------------------
[INFO] Total time: 2 minutes 46 seconds
[INFO] Finished at: Thu Jun 11 05:02:33 GMT-08:00 2009
[INFO] Final Memory: 11M/45M
[INFO] ------------------------------------------------------------------------
---------------------------------------------

To subscribe to this information via syndicated feeds:
- RSS: http://vmgump.apache.org/gump/public/tapestry/tapestry/rss.xml
- Atom: http://vmgump.apache.org/gump/public/tapestry/tapestry/atom.xml

============================== Gump Tracking Only ===
Produced by Gump version 2.3.
Gump Run 06000011062009, vmgump:vmgump-public:06000011062009
Gump E-mail Identifier (unique within run) #53.

*********************************************************** G U M P
[GUMP@vmgump]: Project apacheds-shared (in module apacheds) failed
To whom it may engage...
        
This is an automated request, but not an unsolicited one. For 
more information please visit http://gump.apache.org/nagged.html, 
and/or contact the folk at general@gump.apache.org.

Project apacheds-shared has an issue affecting its community integration.
This issue affects 5 projects,
 and has been outstanding for 21 runs.
The current state of this project is 'Failed', with reason 'Build Failed'.
For reference only, the following projects are affected by this:
    - apacheds-core :  Apache Directory Server
    - apacheds-main :  Apache Directory Server
    - apacheds-shared :  Apache Directory Server
    - apacheds-shared-test :  Apache Directory Server
    - maven-directory-plugin :  Apache Directory Server


Full details are available at:
    http://vmgump.apache.org/gump/public/apacheds/apacheds-shared/index.html

That said, some information snippets are provided here.

The following annotations (debug/informational/warning/error messages) were provided:
 -DEBUG- Sole output [apacheds-shared-11062009.jar] identifier set to project name
 -DEBUG- (Gump generated) Maven2 Settings in: /srv/gump/public/workspace/apacheds/gump_mvn_settings.xml
 -INFO- Failed with reason build failed
 -DEBUG- Maven POM in: /srv/gump/public/workspace/apacheds/pom.xml
 -INFO- Failed to extract fallback artifacts from Gump Repository



The following work was performed:
http://vmgump.apache.org/gump/public/apacheds/apacheds-shared/gump_work/build_apacheds_apacheds-shared.html
Work Name: build_apacheds_apacheds-shared (Type: Build)
Work ended in a state of : Failed
Elapsed: 1 min 28 secs
Command Line: mvn --batch-mode -Dmaven.test.skip.exec=true --settings /srv/gump/public/workspace/apacheds/gump_mvn_settings.xml install 
[Working Directory: /srv/gump/public/workspace/apacheds]
CLASSPATH: /usr/lib/jvm/java-6-sun/lib/tools.jar:/srv/gump/public/workspace/junit/dist/junit-11062009.jar:/srv/gump/public/workspace/directory-shared/ldap/target/shared-ldap-0.9.15-SNAPSHOT.jar
---------------------------------------------
[INFO] [resources:testResources]
[INFO] Using 'UTF-8' encoding to copy filtered resources.
[INFO] skip non existing resourceDirectory /srv/gump/public/workspace/apacheds/shared/cursor/src/test/resources
[INFO] Copying 3 resources
[INFO] [compiler:testCompile]
[INFO] Compiling 1 source file to /srv/gump/public/workspace/apacheds/shared/cursor/target/test-classes
[INFO] [surefire:test]
[INFO] Tests are skipped.
[INFO] [jar:jar]
[INFO] Building jar: /srv/gump/public/workspace/apacheds/shared/cursor/target/shared-cursor-0.9.15-SNAPSHOT.jar
[INFO] [tools:verify-legal-files {execution: verify-legal-files}]
[INFO] Checking legal files in: shared-cursor-0.9.15-SNAPSHOT.jar
[INFO] [install:install]
[INFO] Installing /srv/gump/public/workspace/apacheds/shared/cursor/target/shared-cursor-0.9.15-SNAPSHOT.jar to /srv/gump/public/workspace/mvnlocalrepo/org/apache/directory/shared/shared-cursor/0.9.15-SNAPSHOT/shared-cursor-0.9.15-SNAPSHOT.jar
[INFO] ------------------------------------------------------------------------
[INFO] Building Apache Directory Protocol Ldap client API
[INFO]    task-segment: [install]
[INFO] ------------------------------------------------------------------------
[INFO] [antrun:run {execution: default}]
[INFO] Executing tasks
[INFO] Executed tasks
[INFO] [remote-resources:process {execution: default}]
[INFO] [resources:resources]
[INFO] Using 'UTF-8' encoding to copy filtered resources.
[INFO] skip non existing resourceDirectory /srv/gump/public/workspace/apacheds/shared/client-api/src/main/resources
[INFO] Copying 3 resources
[INFO] [compiler:compile]
[INFO] Compiling 55 source files to /srv/gump/public/workspace/apacheds/shared/client-api/target/classes
[INFO] ------------------------------------------------------------------------
[ERROR] BUILD FAILURE
[INFO] ------------------------------------------------------------------------
[INFO] Compilation failure
/srv/gump/public/workspace/apacheds/shared/client-api/src/main/java/org/apache/directory/shared/ldap/client/api/LdapConnection.java:[1892,105] cannot find symbol
symbol  : variable ENTRY_UUID_AT
location: interface org.apache.directory.shared.ldap.constants.SchemaConstants



/srv/gump/public/workspace/apacheds/shared/client-api/src/main/java/org/apache/directory/shared/ldap/client/api/LdapConnection.java:[1892,105] cannot find symbol
symbol  : variable ENTRY_UUID_AT
location: interface org.apache.directory.shared.ldap.constants.SchemaConstants


[INFO] ------------------------------------------------------------------------
[INFO] For more information, run Maven with the -e switch
[INFO] ------------------------------------------------------------------------
[INFO] Total time: 1 minute 26 seconds
[INFO] Finished at: Thu Jun 11 05:06:21 GMT-08:00 2009
[INFO] Final Memory: 43M/97M
[INFO] ------------------------------------------------------------------------
---------------------------------------------

To subscribe to this information via syndicated feeds:
- RSS: http://vmgump.apache.org/gump/public/apacheds/apacheds-shared/rss.xml
- Atom: http://vmgump.apache.org/gump/public/apacheds/apacheds-shared/atom.xml

============================== Gump Tracking Only ===
Produced by Gump version 2.3.
Gump Run 06000011062009, vmgump:vmgump-public:06000011062009
Gump E-mail Identifier (unique within run) #54.

*********************************************************** G U M P
[GUMP@vmgump]: Project ldap-protocol (in module ldap-protocol) failed
To whom it may engage...
        
This is an automated request, but not an unsolicited one. For 
more information please visit http://gump.apache.org/nagged.html, 
and/or contact the folk at general@gump.apache.org.

Project ldap-protocol has an issue affecting its community integration.
This issue affects 1 projects,
 and has been outstanding for 12 runs.
The current state of this project is 'Failed', with reason 'Build Failed'.
For reference only, the following projects are affected by this:
    - ldap-protocol :  Apache Directory Server


Full details are available at:
    http://vmgump.apache.org/gump/public/ldap-protocol/ldap-protocol/index.html

That said, some information snippets are provided here.

The following annotations (debug/informational/warning/error messages) were provided:
 -DEBUG- Sole output [ldap-protocol-11062009.jar] identifier set to project name
 -DEBUG- (Gump generated) Maven Properties in: /srv/gump/public/workspace/ldap-protocol/build.properties
 -INFO- Failed with reason build failed
 -INFO- Project Reports in: /srv/gump/public/workspace/ldap-protocol/target/test-reports
 -INFO- Failed to extract fallback artifacts from Gump Repository



The following work was performed:
http://vmgump.apache.org/gump/public/ldap-protocol/ldap-protocol/gump_work/build_ldap-protocol_ldap-protocol.html
Work Name: build_ldap-protocol_ldap-protocol (Type: Build)
Work ended in a state of : Failed
Elapsed: 3 secs
Command Line: maven --offline jar 
[Working Directory: /srv/gump/public/workspace/ldap-protocol]
CLASSPATH: /usr/lib/jvm/java-6-sun/lib/tools.jar:/srv/gump/public/workspace/directory-shared/asn1-codec/target/shared-asn1-codec-0.9.15-SNAPSHOT.jar:/srv/gump/public/workspace/directory-shared/ldap/target/shared-ldap-0.9.15-SNAPSHOT.jar:/srv/gump/public/workspace/mina/core/target/mina-core-2.0.0-M7-SNAPSHOT.jar:/srv/gump/public/workspace/mina/integration-beans/target/mina-integration-beans-2.0.0-M7-SNAPSHOT.jar:/srv/gump/public/workspace/mina/statemachine/target/mina-statemachine-2.0.0-M7-SNAPSHOT.jar:/srv/gump/public/workspace/mina/integration-ognl/target/mina-integration-ognl-2.0.0-M7-SNAPSHOT.jar:/srv/gump/public/workspace/mina/transport-apr/target/mina-transport-apr-2.0.0-M7-SNAPSHOT.jar:/srv/gump/public/workspace/mina/integration-jmx/target/mina-integration-jmx-2.0.0-M7-SNAPSHOT.jar:/srv/gump/public/workspace/mina/filter-compression/target/mina-filter-compression-2.0.0-M7-SNAPSHOT.jar:/srv/gump/public/workspace/mina/filter-codec-netty/target/mina-filter-codec-netty-2.0.0
 -M7-SNAPSHOT.jar
---------------------------------------------
 __  __
|  \/  |__ _Apache__ ___
| |\/| / _` \ V / -_) ' \  ~ intelligent projects ~
|_|  |_\__,_|\_/\___|_||_|  v. 1.0.2

build:start:

java:prepare-filesystem:
    [mkdir] Created dir: /srv/gump/public/workspace/ldap-protocol/target/classes

java:compile:
    [echo] Compiling to /srv/gump/public/workspace/ldap-protocol/target/classes
    [echo] No java source files to compile.
resources or todir was null

java:jar-resources:

test:prepare-filesystem:
    [mkdir] Created dir: /srv/gump/public/workspace/ldap-protocol/target/test-classes
    [mkdir] Created dir: /srv/gump/public/workspace/ldap-protocol/target/test-reports

test:test-resources:

test:compile:
    [echo] No test source files to compile.

test:test:
    [echo] No tests to run.

BUILD FAILED
File...... /home/gump/.maven/cache/maven-jar-plugin-1.6.1/plugin.jelly
Element... ant:fail
Line...... 53
Column.... 19
You must define currentVersion in your POM.
Total time: 2 seconds
Finished at: Thu Jun 11 05:13:56 GMT-08:00 2009

---------------------------------------------

To subscribe to this information via syndicated feeds:
- RSS: http://vmgump.apache.org/gump/public/ldap-protocol/ldap-protocol/rss.xml
- Atom: http://vmgump.apache.org/gump/public/ldap-protocol/ldap-protocol/atom.xml

============================== Gump Tracking Only ===
Produced by Gump version 2.3.
Gump Run 06000011062009, vmgump:vmgump-public:06000011062009
Gump E-mail Identifier (unique within run) #55.

*********************************************************** G U M P
[GUMP@vmgump]: Project portals-bridges-velocity (in module portals-bridges) failed
To whom it may engage...
        
This is an automated request, but not an unsolicited one. For 
more information please visit http://gump.apache.org/nagged.html, 
and/or contact the folk at general@gump.apache.org.

Project portals-bridges-velocity has an issue affecting its community integration.
This issue affects 2 projects,
 and has been outstanding for 21 runs.
The current state of this project is 'Failed', with reason 'Build Failed'.
For reference only, the following projects are affected by this:
    - portals-bridges-frameworks :  Support for JSR168 compliant Portlet development
    - portals-bridges-velocity :  Support for JSR168 compliant Portlet development


Full details are available at:
    http://vmgump.apache.org/gump/public/portals-bridges/portals-bridges-velocity/index.html

That said, some information snippets are provided here.

The following annotations (debug/informational/warning/error messages) were provided:
 -DEBUG- Sole output [portals-bridges-velocity-11062009.jar] identifier set to project name
 -DEBUG- Dependency on portals-pluto-api-1.0 exists, no need to add for property maven.jar.portlet-api.
 -DEBUG- Dependency on jakarta-servletapi-5-servlet exists, no need to add for property maven.jar.servletapi.
 -DEBUG- (Gump generated) Maven Properties in: /srv/gump/public/workspace/portals-bridges/velocity/build.properties
 -INFO- Failed with reason build failed
 -DEBUG- Maven POM in: /srv/gump/public/workspace/portals-bridges/velocity/project.xml
 -DEBUG- Maven project properties in: /srv/gump/public/workspace/portals-bridges/velocity/project.properties
 -INFO- Failed to extract fallback artifacts from Gump Repository



The following work was performed:
http://vmgump.apache.org/gump/public/portals-bridges/portals-bridges-velocity/gump_work/build_portals-bridges_portals-bridges-velocity.html
Work Name: build_portals-bridges_portals-bridges-velocity (Type: Build)
Work ended in a state of : Failed
Elapsed: 5 secs
Command Line: maven --offline jar 
[Working Directory: /srv/gump/public/workspace/portals-bridges/velocity]
CLASSPATH: /usr/lib/jvm/java-6-sun/lib/tools.jar:/srv/gump/public/workspace/jakarta-servletapi-5/jsr154/dist/lib/servlet-api.jar:/srv/gump/public/workspace/portals-bridges/common/target/portals-bridges-common-11062009.jar:/srv/gump/public/workspace/portals-pluto-1.0/api/target/portlet-api-1.0.jar:/srv/gump/public/workspace/velocity-engine/bin/velocity-11062009.jar:/srv/gump/public/workspace/velocity-tools/dist/velocity-tools-11062009.jar
---------------------------------------------
 __  __
|  \/  |__ _Apache__ ___
| |\/| / _` \ V / -_) ' \  ~ intelligent projects ~
|_|  |_\__,_|\_/\___|_||_|  v. 1.0.2

build:start:

java:prepare-filesystem:
    [mkdir] Created dir: /srv/gump/public/workspace/portals-bridges/velocity/target/classes

java:compile:
    [echo] Compiling to /srv/gump/public/workspace/portals-bridges/velocity/target/classes
    [javac] Compiling 3 source files to /srv/gump/public/workspace/portals-bridges/velocity/target/classes
    [javac] /srv/gump/public/workspace/portals-bridges/velocity/src/java/org/apache/portals/bridges/velocity/BridgesVelocityViewServlet.java:35: warning: [deprecation] org.apache.velocity.tools.view.servlet.VelocityViewServlet in org.apache.velocity.tools.view.servlet has been deprecated
    [javac] import org.apache.velocity.tools.view.servlet.VelocityViewServlet;
    [javac]                                              ^
    [javac] /srv/gump/public/workspace/portals-bridges/velocity/src/java/org/apache/portals/bridges/velocity/BridgesVelocityViewServlet.java:42: warning: [deprecation] org.apache.velocity.tools.view.servlet.VelocityViewServlet in org.apache.velocity.tools.view.servlet has been deprecated
    [javac] public class BridgesVelocityViewServlet extends VelocityViewServlet
    [javac]                                                 ^
    [javac] /srv/gump/public/workspace/portals-bridges/velocity/src/java/org/apache/portals/bridges/velocity/BridgesVelocityViewServlet.java:92: mergeTemplate(org.apache.velocity.Template,org.apache.velocity.context.Context,javax.servlet.http.HttpServletResponse) in org.apache.portals.bridges.velocity.BridgesVelocityViewServlet cannot override mergeTemplate(org.apache.velocity.Template,org.apache.velocity.context.Context,javax.servlet.http.HttpServletResponse) in org.apache.velocity.tools.view.VelocityViewServlet; overridden method does not throw java.lang.Exception
    [javac]     protected void mergeTemplate(Template template, Context context, HttpServletResponse response)
    [javac]                    ^
    [javac] 1 error
    [javac] 2 warnings

BUILD FAILED
File...... /home/gump/.maven/cache/maven-java-plugin-1.5/plugin.jelly
Element... ant:javac
Line...... 63
Column.... 48
Compile failed; see the compiler error output for details.
Total time: 4 seconds
Finished at: Thu Jun 11 05:18:14 GMT-08:00 2009

---------------------------------------------

To subscribe to this information via syndicated feeds:
- RSS: http://vmgump.apache.org/gump/public/portals-bridges/portals-bridges-velocity/rss.xml
- Atom: http://vmgump.apache.org/gump/public/portals-bridges/portals-bridges-velocity/atom.xml

============================== Gump Tracking Only ===
Produced by Gump version 2.3.
Gump Run 06000011062009, vmgump:vmgump-public:06000011062009
Gump E-mail Identifier (unique within run) #56.

*********************************************************** G U M P
[GUMP@vmgump]: Project authx-example (in module authx) failed
To whom it may engage...
        
This is an automated request, but not an unsolicited one. For 
more information please visit http://gump.apache.org/nagged.html, 
and/or contact the folk at general@gump.apache.org.

Project authx-example has an issue affecting its community integration.
This issue affects 1 projects,
 and has been outstanding for 21 runs.
The current state of this project is 'Failed', with reason 'Build Failed'.
For reference only, the following projects are affected by this:
    - authx-example :  Apache Authentication and Authorization Framework


Full details are available at:
    http://vmgump.apache.org/gump/public/authx/authx-example/index.html

That said, some information snippets are provided here.

The following annotations (debug/informational/warning/error messages) were provided:
 -DEBUG- Sole output [authx-example-11062009.jar] identifier set to project name
 -DEBUG- Dependency on jakarta-servletapi-5-servlet exists, no need to add for property maven.jar.servletapi.
 -DEBUG- Dependency on xml-xerces exists, no need to add for property maven.jar.xercesImpl.
 -DEBUG- Dependency on asm exists, no need to add for property maven.jar.asm-util.
 -DEBUG- Dependency on velocity-engine exists, no need to add for property maven.jar.velocity.
 -DEBUG- Dependency on velocity-tools exists, no need to add for property maven.jar.velocity-tools-view.
 -DEBUG- Dependency on packaged-jmock exists, no need to add for property maven.jar.jmock.
 -DEBUG- (Gump generated) Maven Properties in: /srv/gump/public/workspace/authx/example/build.properties
 -INFO- Failed with reason build failed
 -DEBUG- Maven POM in: /srv/gump/public/workspace/authx/example/project.xml
 -DEBUG- Maven project properties in: /srv/gump/public/workspace/authx/example/project.properties
 -INFO- Project Reports in: /srv/gump/public/workspace/authx/example/target/test-reports
 -WARNING- No directory [/srv/gump/public/workspace/authx/example/target/test-reports]
 -INFO- Failed to extract fallback artifacts from Gump Repository



The following work was performed:
http://vmgump.apache.org/gump/public/authx/authx-example/gump_work/build_authx_authx-example.html
Work Name: build_authx_authx-example (Type: Build)
Work ended in a state of : Failed
Elapsed: 3 secs
Command Line: maven --offline jar 
[Working Directory: /srv/gump/public/workspace/authx/example]
CLASSPATH: /usr/lib/jvm/java-6-sun/lib/tools.jar:/srv/gump/public/workspace/asm/output/dist/lib/asm-util-11062009.jar:/srv/gump/public/workspace/authx/core/target/authx-core-11062009.jar:/srv/gump/public/workspace/authx/script/target/authx-script-11062009.jar:/srv/gump/public/workspace/dom4j/build/dom4j.jar:/srv/gump/public/workspace/groovy/target/groovy-1.7-beta-1-SNAPSHOT.jar:/srv/gump/public/workspace/jakarta-servletapi-5/jsr154/dist/lib/servlet-api.jar:/srv/gump/public/workspace/velocity-engine/bin/velocity-11062009.jar:/srv/gump/public/workspace/velocity-tools/dist/velocity-tools-view-11062009.jar:/srv/gump/packages/jmock/jmock-1.0.1.jar:/srv/gump/packages/nanocontainer/nanocontainer-1.0-beta-3.jar:/srv/gump/packages/nanocontainer/nanocontainer-nanowar-1.0-beta-3.jar:/srv/gump/packages/ognl-2.6.7/ognl-2.6.7.jar:/srv/gump/packages/picocontainer-1.1/picocontainer-1.1.jar:/srv/gump/public/workspace/xml-commons/java/external/build/xml-apis-ext.jar
---------------------------------------------
 __  __
|  \/  |__ _Apache__ ___
| |\/| / _` \ V / -_) ' \  ~ intelligent projects ~
|_|  |_\__,_|\_/\___|_||_|  v. 1.0.2

You are working offline so the build will continue, but authx-core-0.4-SNAPSHOT.jar may be out of date!
You are working offline so the build will continue, but authx-script-0.4-SNAPSHOT.jar may be out of date!
The build cannot continue because of the following unsatisfied dependency:

groovy-all-1.0-jsr-04.jar

Total time: 2 seconds
Finished at: Thu Jun 11 05:19:00 GMT-08:00 2009

---------------------------------------------

To subscribe to this information via syndicated feeds:
- RSS: http://vmgump.apache.org/gump/public/authx/authx-example/rss.xml
- Atom: http://vmgump.apache.org/gump/public/authx/authx-example/atom.xml

============================== Gump Tracking Only ===
Produced by Gump version 2.3.
Gump Run 06000011062009, vmgump:vmgump-public:06000011062009
Gump E-mail Identifier (unique within run) #58.

*********************************************************** G U M P
[GUMP@vmgump]: Project portals-pluto-portal-1.0 (in module portals-pluto-1.0) failed
To whom it may engage...
        
This is an automated request, but not an unsolicited one. For 
more information please visit http://gump.apache.org/nagged.html, 
and/or contact the folk at general@gump.apache.org.

Project portals-pluto-portal-1.0 has an issue affecting its community integration.
This issue affects 1 projects,
 and has been outstanding for 21 runs.
The current state of this project is 'Failed', with reason 'Build Failed'.
For reference only, the following projects are affected by this:
    - portals-pluto-portal-1.0 :  JSR168 Container


Full details are available at:
    http://vmgump.apache.org/gump/public/portals-pluto-1.0/portals-pluto-portal-1.0/index.html

That said, some information snippets are provided here.

The following annotations (debug/informational/warning/error messages) were provided:
 -DEBUG- Dependency on ant exists, no need to add for property env.ANT_HOME.
 -INFO- Failed with reason build failed
 -INFO- Failed to extract fallback artifacts from Gump Repository



The following work was performed:
http://vmgump.apache.org/gump/public/portals-pluto-1.0/portals-pluto-portal-1.0/gump_work/build_portals-pluto-1.0_portals-pluto-portal-1.0.html
Work Name: build_portals-pluto-1.0_portals-pluto-portal-1.0 (Type: Build)
Work ended in a state of : Failed
Elapsed: 4 secs
Command Line: /usr/lib/jvm/java-6-sun/bin/java -Djava.awt.headless=true -Xbootclasspath/p:/srv/gump/public/workspace/xml-commons/java/external/build/xml-apis.jar:/srv/gump/public/workspace/xml-xerces2/build/xercesImpl.jar org.apache.tools.ant.Main -Dgump.merge=/srv/gump/public/gump/work/merge.xml -Dbuild.sysclasspath=only -Denv.ANT_HOME=/srv/gump/public/workspace/ant/dist -Dversion=11062009 -Dfinal.portal.name=pluto-portal-impl-11062009 all 
[Working Directory: /srv/gump/public/workspace/portals-pluto-1.0]
CLASSPATH: /usr/lib/jvm/java-6-sun/lib/tools.jar:/srv/gump/public/workspace/portals-pluto-1.0/build/ant/lib/ForeachTask.jar:/srv/gump/public/workspace/ant/dist/lib/ant-jmf.jar:/srv/gump/public/workspace/ant/dist/lib/ant-swing.jar:/srv/gump/public/workspace/ant/dist/lib/ant-apache-resolver.jar:/srv/gump/public/workspace/ant/dist/lib/ant-apache-xalan2.jar:/srv/gump/public/workspace/ant/dist/lib/ant-trax.jar:/srv/gump/public/workspace/ant/dist/lib/ant-junit.jar:/srv/gump/public/workspace/ant/dist/lib/ant-launcher.jar:/srv/gump/public/workspace/ant/dist/lib/ant-nodeps.jar:/srv/gump/public/workspace/ant/dist/lib/ant.jar:/srv/gump/packages/junit3.8.1/junit.jar:/srv/gump/public/workspace/xml-commons/java/build/resolver.jar:/srv/gump/public/workspace/castor/core/target/castor-core-1.3.1-SNAPSHOT.jar:/srv/gump/public/workspace/castor/xml/target/castor-xml-1.3.1-SNAPSHOT.jar:/srv/gump/public/workspace/apache-commons/fileupload/target/commons-fileupload-11062009.jar:/srv/gump/public/wor
 kspace/apache-commons/logging/target/commons-logging-11062009.jar:/srv/gump/public/workspace/apache-commons/logging/target/commons-logging-api-11062009.jar:/srv/gump/public/workspace/junit/dist/junit-11062009.jar:/srv/gump/public/workspace/jakarta-regexp/build/jakarta-regexp-11062009.jar:/srv/gump/public/workspace/jakarta-servletapi-5/jsr154/dist/lib/servlet-api.jar:/srv/gump/public/workspace/jakarta-servletapi-5/jsr152/dist/lib/jsp-api.jar:/srv/gump/public/workspace/portals-pluto-1.0/api/target/portlet-api-1.0.jar:/srv/gump/public/workspace/portals-pluto-1.0/container/target/pluto-1.0.jar:/srv/gump/public/workspace/portals-pluto-1.0/descriptors/target/pluto-descriptors-1.0.jar:/srv/gump/public/workspace/xml-commons/java/external/build/xml-apis-ext.jar
---------------------------------------------

compile-tests:

internal-test:

test:

jar:

portal:

init:
    [mkdir] Created dir: /srv/gump/public/workspace/portals-pluto-1.0/portal/target/lib

get-deps:

compile:
    [mkdir] Created dir: /srv/gump/public/workspace/portals-pluto-1.0/portal/target/classes
    [javac] Compiling 149 source files to /srv/gump/public/workspace/portals-pluto-1.0/portal/target/classes
    [javac] /srv/gump/public/workspace/portals-pluto-1.0/portal/src/java/org/apache/pluto/portalImpl/Deploy.java:62: warning: [deprecation] org.apache.xml.serialize.OutputFormat in org.apache.xml.serialize has been deprecated
    [javac] import org.apache.xml.serialize.OutputFormat;
    [javac]                                ^
    [javac] /srv/gump/public/workspace/portals-pluto-1.0/portal/src/java/org/apache/pluto/portalImpl/Deploy.java:63: warning: [deprecation] org.apache.xml.serialize.XMLSerializer in org.apache.xml.serialize has been deprecated
    [javac] import org.apache.xml.serialize.XMLSerializer;
    [javac]                                ^
    [javac] /srv/gump/public/workspace/portals-pluto-1.0/portal/src/java/org/apache/pluto/portalImpl/core/PortalURL.java:179: warning: [deprecation] encode(java.lang.String) in java.net.URLEncoder has been deprecated
    [javac]         value = URLEncoder.encode(value);
    [javac]                           ^
    [javac] /srv/gump/public/workspace/portals-pluto-1.0/portal/src/java/org/apache/pluto/portalImpl/services/portletdefinitionregistry/PortletDefinitionRegistryServiceContextImpl.java:113: exception java.io.IOException is never thrown in body of corresponding try statement
    [javac]         } catch (IOException e) {
    [javac]           ^
    [javac] /srv/gump/public/workspace/portals-pluto-1.0/portal/src/java/org/apache/pluto/portalImpl/services/portletdefinitionregistry/PortletDefinitionRegistryServiceContextImpl.java:115: exception org.exolab.castor.mapping.MappingException is never thrown in body of corresponding try statement
    [javac]         } catch (MappingException e) {
    [javac]           ^
    [javac] /srv/gump/public/workspace/portals-pluto-1.0/portal/src/java/org/apache/pluto/portalImpl/services/portletdefinitionregistry/PortletDefinitionRegistryServiceFileImpl.java:233: warning: [deprecation] toURL() in java.io.File has been deprecated
    [javac]             source.setSystemId(portletXml.toURL().toExternalForm());
    [javac]                                          ^
    [javac] /srv/gump/public/workspace/portals-pluto-1.0/portal/src/java/org/apache/pluto/portlet/admin/services/DeployWarService.java:165: warning: [deprecation] org.apache.pluto.portalImpl.Deploy in org.apache.pluto.portalImpl has been deprecated
    [javac] 		            org.apache.pluto.portalImpl.Deploy.main(args);
    [javac] 		                                       ^
    [javac] Note: Some input files use unchecked or unsafe operations.
    [javac] Note: Recompile with -Xlint:unchecked for details.
    [javac] 2 errors
    [javac] 5 warnings

BUILD FAILED
/srv/gump/public/workspace/portals-pluto-1.0/build.xml:51: The following error occurred while executing this line:
/srv/gump/public/workspace/portals-pluto-1.0/portal/build.xml:50: Compile failed; see the compiler error output for details.

Total time: 3 seconds
---------------------------------------------

To subscribe to this information via syndicated feeds:
- RSS: http://vmgump.apache.org/gump/public/portals-pluto-1.0/portals-pluto-portal-1.0/rss.xml
- Atom: http://vmgump.apache.org/gump/public/portals-pluto-1.0/portals-pluto-portal-1.0/atom.xml

============================== Gump Tracking Only ===
Produced by Gump version 2.3.
Gump Run 06000011062009, vmgump:vmgump-public:06000011062009
Gump E-mail Identifier (unique within run) #59.


--
Apache Gump
http://gump.apache.org/ [Instance: vmgump]

---------------------------------------------------------------------
To unsubscribe, e-mail: general-unsubscribe@gump.apache.org
For additional commands, e-mail: general-help@gump.apache.org


Mime
View raw message