gump-general mailing list archives

Site index · List index
Message view « Date » · « Thread »
Top « Date » · « Thread »
From g...@vmgump.apache.org
Subject BATCH: All dressed up, with nowhere to go...
Date Fri, 29 May 2009 04:13:21 GMT
Dear Gumpmeisters,
            
The following 16 notifys should have been sent

*********************************************************** G U M P
[GUMP@vmgump]: Project apr-configure (in module apr) failed
[GUMP@vmgump]: Project ws-commons-xmlschema (in module ws-axis2-commons) failed
[GUMP@vmgump]: Project emma (in module emma) failed
[GUMP@vmgump]: Project jtidy-cvs (in module jtidy) failed
[GUMP@vmgump]: Project castor-test (in module castor) failed
[GUMP@vmgump]: Project ws-commons-axiom (in module ws-axis2-commons) failed
[GUMP@vmgump]: Project JacORB-idllib (in module JacORB) failed
[GUMP@vmgump]: Project jetty (in module jetty) failed
[GUMP@vmgump]: Project ws-commons-policy (in module ws-axis2-commons) failed
[GUMP@vmgump]: Project commons-jci (in module apache-commons) failed
[GUMP@vmgump]: Module poi success, but with warnings.
[GUMP@vmgump]: Project mina (in module mina) failed
[GUMP@vmgump]: Project rat-test (in module rat) failed
[GUMP@vmgump]: Project cocoon (in module cocoon) failed
[GUMP@vmgump]: Project kerberos-common (in module kerberos-shared) failed
[GUMP@vmgump]: Project tapestry (in module tapestry) failed
*********************************************************** G U M P
[GUMP@vmgump]: Project apr-configure (in module apr) failed
To whom it may engage...
        
This is an automated request, but not an unsolicited one. For 
more information please visit http://gump.apache.org/nagged.html, 
and/or contact the folk at general@gump.apache.org.

Project apr-configure has an issue affecting its community integration.
This issue affects 23 projects,
 and has been outstanding for 140 runs.
The current state of this project is 'Failed', with reason 'Build Failed'.
For reference only, the following projects are affected by this:
    - apache-httpd-buildconf :  Apache HTTP Server
    - apache-httpd-configure :  Apache HTTP Server
    - apache-httpd-make :  Apache HTTP Server
    - apache-httpd-make-install :  Apache HTTP Server
    - apr-configure :  Apache Portable Runtime
    - apr-iconv-buildconf :  Apache Portable Runtime
    - apr-iconv-configure :  Apache Portable Runtime
    - apr-iconv-make :  Apache Portable Runtime
    - apr-make :  Apache Portable Runtime
    - apr-make-install :  Apache Portable Runtime
    - apr-util-buildconf :  Apache Portable Runtime
    - apr-util-configure :  Apache Portable Runtime
    - apr-util-make :  Apache Portable Runtime
    - apr-util-make-install :  Apache Portable Runtime
    - jakarta-tomcat-jk-native :  Connectors to various web servers
    - jakarta-tomcat-jk-native-buildconf :  Connectors to various web servers
    - jakarta-tomcat-jk-native-configure :  Connectors to various web servers
    - logging-log4cxx-ant :  Apache log4cxx
    - logging-log4cxx-ant-no_wchar_t :  Apache log4cxx
    - logging-log4cxx-ant-static :  Apache log4cxx
    - logging-log4cxx-configure :  Apache log4cxx
    - logging-log4cxx-make :  Apache log4cxx
    - logging-log4cxx-make-install :  Apache log4cxx


Full details are available at:
    http://vmgump.apache.org/gump/public/apr/apr-configure/index.html

That said, some information snippets are provided here.

The following annotations (debug/informational/warning/error messages) were provided:
 -INFO- Failed with reason build failed



The following work was performed:
http://vmgump.apache.org/gump/public/apr/apr-configure/gump_work/buildscript_apr_apr-configure.html
Work Name: buildscript_apr_apr-configure (Type: Build)
Work ended in a state of : Failed
Elapsed: 3 mins 49 secs
Command Line: /srv/gump/public/workspace/apr/configure --prefix=/srv/gump/public/workspace/apr/dest-29052009 
[Working Directory: /srv/gump/public/workspace/apr]
---------------------------------------------
checking for sockaddr_storage... yes
checking for sockaddr_un... yes
checking for working AI_ADDRCONFIG... yes
checking if APR supports IPv6... yes
checking langinfo.h usability... yes
checking langinfo.h presence... yes
checking for langinfo.h... yes
checking for nl_langinfo... yes
Applying apr-util hints file rules for i686-pc-linux-gnu

checking for ldap support...
checking for default DBM... sdbm (default)
checking for pg_config... no
checking libpq-fe.h usability... no
checking libpq-fe.h presence... no
checking for libpq-fe.h... no
checking postgresql/libpq-fe.h usability... no
checking postgresql/libpq-fe.h presence... no
checking for postgresql/libpq-fe.h... no
checking sqlite3.h usability... no
checking sqlite3.h presence... no
checking for sqlite3.h... no
checking sqlite.h usability... no
checking sqlite.h presence... no
checking for sqlite.h... no
checking sybdb.h usability... no
checking sybdb.h presence... no
checking for sybdb.h... no
checking freetds/sybdb.h usability... no
checking freetds/sybdb.h presence... no
checking for freetds/sybdb.h... no
checking for odbc_config... no
checking sql.h usability... no
checking sql.h presence... no
checking for sql.h... no
checking odbc/sql.h usability... no
checking odbc/sql.h presence... no
checking for odbc/sql.h... no
checking Expat 1.95.x... no
checking old Debian-packaged expat... no
checking old FreeBSD-packaged expat... no
checking Expat 1.0/1.1... no
  setting LDFLAGS to "-L/usr/local/lib"
  setting INCLUDES to "-I/usr/local/include"
checking Expat 1.95.x in /usr/local... no
  nulling LDFLAGS
  nulling INCLUDES
configuring package in xml/expat now
/bin/bash: /srv/gump/public/workspace/apr/xml/expat/configure: No such file or directory
configure failed for xml/expat
---------------------------------------------

To subscribe to this information via syndicated feeds:
- RSS: http://vmgump.apache.org/gump/public/apr/apr-configure/rss.xml
- Atom: http://vmgump.apache.org/gump/public/apr/apr-configure/atom.xml

============================== Gump Tracking Only ===
Produced by Gump version 2.3.
Gump Run 31000029052009, vmgump:vmgump-public:31000029052009
Gump E-mail Identifier (unique within run) #3.

*********************************************************** G U M P
[GUMP@vmgump]: Project ws-commons-xmlschema (in module ws-axis2-commons) failed
To whom it may engage...
        
This is an automated request, but not an unsolicited one. For 
more information please visit http://gump.apache.org/nagged.html, 
and/or contact the folk at general@gump.apache.org.

Project ws-commons-xmlschema has an issue affecting its community integration.
This issue affects 1 projects,
 and has been outstanding for 76 runs.
The current state of this project is 'Failed', with reason 'Missing Build Outputs'.
For reference only, the following projects are affected by this:
    - ws-commons-xmlschema :  Common stuff for the WS projects.


Full details are available at:
    http://vmgump.apache.org/gump/public/ws-axis2-commons/ws-commons-xmlschema/index.html

That said, some information snippets are provided here.

The following annotations (debug/informational/warning/error messages) were provided:
 -DEBUG- Sole output [ws-commons-xmlschema-29052009.jar] identifier set to project name
 -INFO- Optional dependency xmlunit prerequisite failed with reason build failed
 -INFO- Optional dependency junit failed with reason build failed
 -DEBUG- (Gump generated) Maven2 Settings in: /srv/gump/public/workspace/ws-axis2-commons/XmlSchema/gump_mvn_settings.xml
 -DEBUG- Maven POM in: /srv/gump/public/workspace/ws-axis2-commons/XmlSchema/pom.xml
 -INFO- Failed with reason missing build outputs
 -ERROR- Missing Output: /srv/gump/public/workspace/ws-axis2-commons/XmlSchema/build/lib/ws-commons-xmlschema-29052009.jar
 -ERROR- No such directory (where output is expected) : /srv/gump/public/workspace/ws-axis2-commons/XmlSchema/build/lib
 -INFO- Failed to extract fallback artifacts from Gump Repository



The following work was performed:
http://vmgump.apache.org/gump/public/ws-axis2-commons/ws-commons-xmlschema/gump_work/build_ws-axis2-commons_ws-commons-xmlschema.html
Work Name: build_ws-axis2-commons_ws-commons-xmlschema (Type: Build)
Work ended in a state of : Success
Elapsed: 2 mins 18 secs
Command Line: mvn --batch-mode --settings /srv/gump/public/workspace/ws-axis2-commons/XmlSchema/gump_mvn_settings.xml install 
[Working Directory: /srv/gump/public/workspace/ws-axis2-commons/XmlSchema]
CLASSPATH: /usr/lib/jvm/java-6-sun/lib/tools.jar:/srv/gump/public/workspace/xml-commons/java/external/build/xml-apis-ext.jar:xmlunit-sumo-gump-27052009.jar:xmlunit-legacy-gump-27052009.jar:xmlunit-core-gump-27052009.jar:/srv/gump/public/workspace/ant/dist/lib/ant-jmf.jar:/srv/gump/public/workspace/ant/dist/lib/ant-swing.jar:/srv/gump/public/workspace/ant/dist/lib/ant-apache-resolver.jar:/srv/gump/public/workspace/ant/dist/lib/ant-apache-xalan2.jar:/srv/gump/public/workspace/ant/dist/lib/ant-trax.jar:/srv/gump/public/workspace/ant/dist/lib/ant-junit.jar:/srv/gump/public/workspace/ant/dist/lib/ant-launcher.jar:/srv/gump/public/workspace/ant/dist/lib/ant-nodeps.jar:/srv/gump/public/workspace/ant/dist/lib/ant.jar:/srv/gump/packages/junit3.8.1/junit.jar:/srv/gump/public/workspace/xml-commons/java/build/resolver.jar:/srv/gump/packages/stax/jsr173_1.0_api.jar:/srv/gump/packages/stax/jsr173_1.0_ri.jar:junit-gump-27052009.jar
---------------------------------------------
Tests run: 1, Failures: 0, Errors: 0, Skipped: 0, Time elapsed: 0.003 sec
Running tests.customext.attrib.CustomExtensionSerializerTest
Tests run: 1, Failures: 0, Errors: 0, Skipped: 0, Time elapsed: 0.006 sec
Running tests.WSCOMMONS377Test
Tests run: 1, Failures: 0, Errors: 0, Skipped: 0, Time elapsed: 0.005 sec
Running tests.FacetsTest
Tests run: 9, Failures: 0, Errors: 0, Skipped: 0, Time elapsed: 0.023 sec
Running tests.TestUnqualifiedSchema
Tests run: 1, Failures: 0, Errors: 0, Skipped: 0, Time elapsed: 0.002 sec
Running tests.AnnotationDeepTest
Tests run: 2, Failures: 0, Errors: 0, Skipped: 0, Time elapsed: 0.007 sec
Running tests.UnionTest
Tests run: 1, Failures: 0, Errors: 0, Skipped: 0, Time elapsed: 0.008 sec
Running tests.CircularSchemaTest
Tests run: 1, Failures: 0, Errors: 0, Skipped: 0, Time elapsed: 0.003 sec
Running tests.GroupTest
Tests run: 1, Failures: 0, Errors: 0, Skipped: 0, Time elapsed: 0.003 sec
Running tests.AnnotationTest
Tests run: 5, Failures: 0, Errors: 0, Skipped: 0, Time elapsed: 0.009 sec
Running tests.TestElementForm
Tests run: 1, Failures: 0, Errors: 0, Skipped: 0, Time elapsed: 0.003 sec
Running tests.TestLocalUnnamedSimpleType
Tests run: 1, Failures: 0, Errors: 0, Skipped: 0, Time elapsed: 0.003 sec
Running tests.RecursiveImportTest
Tests run: 1, Failures: 0, Errors: 0, Skipped: 0, Time elapsed: 0.009 sec
Running tests.NotationTest
Tests run: 1, Failures: 0, Errors: 0, Skipped: 0, Time elapsed: 0.004 sec

Results :

Tests run: 4036, Failures: 0, Errors: 0, Skipped: 3

Downloading: http://localhost:8192/maven2/biz/aQute/bndlib/0.0.311/bndlib-0.0.311.pom
864b downloaded
Downloading: http://localhost:8192/maven2/biz/aQute/bndlib/0.0.311/bndlib-0.0.311.jar
150K downloaded
[INFO] [bundle:bundle]
[INFO] [install:install]
[INFO] Installing /srv/gump/public/workspace/ws-axis2-commons/XmlSchema/target/XmlSchema-2.0-SNAPSHOT.jar to /srv/gump/public/workspace/mvnlocalrepo/org/apache/ws/commons/schema/XmlSchema/2.0-SNAPSHOT/XmlSchema-2.0-SNAPSHOT.jar
[INFO] [bundle:install]
[INFO] Parsing file:/srv/gump/public/workspace/mvnlocalrepo/repository.xml
[INFO] Installing org/apache/ws/commons/schema/XmlSchema/2.0-SNAPSHOT/XmlSchema-2.0-SNAPSHOT.jar
[INFO] Writing OBR metadata
[INFO] ------------------------------------------------------------------------
[INFO] BUILD SUCCESSFUL
[INFO] ------------------------------------------------------------------------
[INFO] Total time: 2 minutes 16 seconds
[INFO] Finished at: Fri May 29 00:36:22 GMT-08:00 2009
[INFO] Final Memory: 22M/44M
[INFO] ------------------------------------------------------------------------
---------------------------------------------

To subscribe to this information via syndicated feeds:
- RSS: http://vmgump.apache.org/gump/public/ws-axis2-commons/ws-commons-xmlschema/rss.xml
- Atom: http://vmgump.apache.org/gump/public/ws-axis2-commons/ws-commons-xmlschema/atom.xml

============================== Gump Tracking Only ===
Produced by Gump version 2.3.
Gump Run 31000029052009, vmgump:vmgump-public:31000029052009
Gump E-mail Identifier (unique within run) #6.

*********************************************************** G U M P
[GUMP@vmgump]: Project emma (in module emma) failed
To whom it may engage...
        
This is an automated request, but not an unsolicited one. For 
more information please visit http://gump.apache.org/nagged.html, 
and/or contact the folk at general@gump.apache.org.

Project emma has an issue affecting its community integration.
This issue affects 1 projects,
 and has been outstanding for 266 runs.
The current state of this project is 'Failed', with reason 'Build Failed'.
For reference only, the following projects are affected by this:
    - emma :  code coverage tool


Full details are available at:
    http://vmgump.apache.org/gump/public/emma/emma/index.html

That said, some information snippets are provided here.

The following annotations (debug/informational/warning/error messages) were provided:
 -INFO- Failed with reason build failed
 -INFO- Failed to extract fallback artifacts from Gump Repository



The following work was performed:
http://vmgump.apache.org/gump/public/emma/emma/gump_work/build_emma_emma.html
Work Name: build_emma_emma (Type: Build)
Work ended in a state of : Failed
Elapsed: 5 secs
Command Line: /usr/lib/jvm/java-6-sun/bin/java -Djava.awt.headless=true -Xbootclasspath/p:/srv/gump/public/workspace/xml-commons/java/external/build/xml-apis.jar:/srv/gump/public/workspace/xml-xerces2/build/xercesImpl.jar org.apache.tools.ant.Main -Dgump.merge=/srv/gump/public/gump/work/merge.xml -Dbuild.sysclasspath=only -Dapp.short.name=emma-29052009 
[Working Directory: /srv/gump/public/workspace/emma]
CLASSPATH: /usr/lib/jvm/java-6-sun/lib/tools.jar:/srv/gump/public/workspace/emma/out/core/classes:/srv/gump/public/workspace/emma/out/ant/classes:/srv/gump/public/workspace/emma/lib/internal/stamptool.jar:/srv/gump/public/workspace/ant/dist/lib/ant-jmf.jar:/srv/gump/public/workspace/ant/dist/lib/ant-swing.jar:/srv/gump/public/workspace/ant/dist/lib/ant-apache-resolver.jar:/srv/gump/public/workspace/ant/dist/lib/ant-apache-xalan2.jar:/srv/gump/public/workspace/ant/dist/lib/ant-trax.jar:/srv/gump/public/workspace/ant/dist/lib/ant-junit.jar:/srv/gump/public/workspace/ant/dist/lib/ant-launcher.jar:/srv/gump/public/workspace/ant/dist/lib/ant-nodeps.jar:/srv/gump/public/workspace/ant/dist/lib/ant.jar:/srv/gump/public/workspace/xml-commons/java/external/build/xml-apis-ext.jar
---------------------------------------------
timestamp:

-pre-compile:

core.bootstrap.compile:
    [javac] Compiling 2 source files to /srv/gump/public/workspace/emma/out/core/classes
    [javac] 
    [javac]           WARNING
    [javac] 
    [javac] The -source switch defaults to 1.5 in JDK 1.5 and 1.6.
    [javac] If you specify -target 1.2 you now must also specify -source 1.2.
    [javac] Ant will implicitly add -source 1.2 for you.  Please change your build file.

core.java14.compile:
    [javac] Compiling 1 source file to /srv/gump/public/workspace/emma/out/core/classes
    [javac] 
    [javac]           WARNING
    [javac] 
    [javac] The -source switch defaults to 1.5 in JDK 1.5 and 1.6.
    [javac] If you specify -target 1.2 you now must also specify -source 1.2.
    [javac] Ant will implicitly add -source 1.2 for you.  Please change your build file.

core.java13.compile:
    [javac] Compiling 1 source file to /srv/gump/public/workspace/emma/out/core/classes
    [javac] 
    [javac]           WARNING
    [javac] 
    [javac] The -source switch defaults to 1.5 in JDK 1.5 and 1.6.
    [javac] If you specify -target 1.2 you now must also specify -source 1.2.
    [javac] Ant will implicitly add -source 1.2 for you.  Please change your build file.

core.compile:
    [javac] Compiling 175 source files to /srv/gump/public/workspace/emma/out/core/classes
    [javac] 
    [javac]           WARNING
    [javac] 
    [javac] The -source switch defaults to 1.5 in JDK 1.5 and 1.6.
    [javac] If you specify -target 1.2 you now must also specify -source 1.2.
    [javac] Ant will implicitly add -source 1.2 for you.  Please change your build file.
    [javac] /srv/gump/public/workspace/emma/core/java12/com/vladium/emma/run/InstrClassLoader.java:346: reference to CodeSource is ambiguous, both method CodeSource(java.net.URL,java.security.cert.Certificate[]) in java.security.CodeSource and method CodeSource(java.net.URL,java.security.CodeSigner[]) in java.security.CodeSource match
    [javac]         final CodeSource csrc = new CodeSource (srcURL, null);
    [javac]                                 ^
    [javac] Note: Some input files use or override a deprecated API.
    [javac] Note: Recompile with -Xlint:deprecation for details.
    [javac] 1 error

BUILD FAILED
/srv/gump/public/workspace/emma/build.xml:297: Compile failed; see the compiler error output for details.

Total time: 4 seconds
---------------------------------------------

To subscribe to this information via syndicated feeds:
- RSS: http://vmgump.apache.org/gump/public/emma/emma/rss.xml
- Atom: http://vmgump.apache.org/gump/public/emma/emma/atom.xml

============================== Gump Tracking Only ===
Produced by Gump version 2.3.
Gump Run 31000029052009, vmgump:vmgump-public:31000029052009
Gump E-mail Identifier (unique within run) #7.

*********************************************************** G U M P
[GUMP@vmgump]: Project jtidy-cvs (in module jtidy) failed
To whom it may engage...
        
This is an automated request, but not an unsolicited one. For 
more information please visit http://gump.apache.org/nagged.html, 
and/or contact the folk at general@gump.apache.org.

Project jtidy-cvs has an issue affecting its community integration.
This issue affects 1 projects,
 and has been outstanding for 125 runs.
The current state of this project is 'Failed', with reason 'Build Failed'.
For reference only, the following projects are affected by this:
    - jtidy-cvs :  HTML Templates


Full details are available at:
    http://vmgump.apache.org/gump/public/jtidy/jtidy-cvs/index.html

That said, some information snippets are provided here.

The following annotations (debug/informational/warning/error messages) were provided:
 -DEBUG- Sole output [jtidy-29052009.jar] identifier set to project name
 -DEBUG- Dependency on xml-apis exists, no need to add for property maven.jar.dom3-xml-apis.
 -DEBUG- (Gump generated) Maven Properties in: /srv/gump/public/workspace/jtidy/build.properties
 -INFO- Failed with reason build failed
 -DEBUG- Maven POM in: /srv/gump/public/workspace/jtidy/project.xml
 -DEBUG- Maven project properties in: /srv/gump/public/workspace/jtidy/project.properties
 -INFO- Failed to extract fallback artifacts from Gump Repository



The following work was performed:
http://vmgump.apache.org/gump/public/jtidy/jtidy-cvs/gump_work/build_jtidy_jtidy-cvs.html
Work Name: build_jtidy_jtidy-cvs (Type: Build)
Work ended in a state of : Failed
Elapsed: 2 secs
Command Line: maven --offline jar 
[Working Directory: /srv/gump/public/workspace/jtidy]
CLASSPATH: /usr/lib/jvm/java-6-sun/lib/tools.jar:/srv/gump/public/workspace/ant/dist/lib/ant-jmf.jar:/srv/gump/public/workspace/ant/dist/lib/ant-swing.jar:/srv/gump/public/workspace/ant/dist/lib/ant-apache-resolver.jar:/srv/gump/public/workspace/ant/dist/lib/ant-apache-xalan2.jar:/srv/gump/public/workspace/ant/dist/lib/ant-trax.jar:/srv/gump/public/workspace/ant/dist/lib/ant-junit.jar:/srv/gump/public/workspace/ant/dist/lib/ant-launcher.jar:/srv/gump/public/workspace/ant/dist/lib/ant-nodeps.jar:/srv/gump/public/workspace/ant/dist/lib/ant.jar:/srv/gump/packages/junit3.8.1/junit.jar:/srv/gump/public/workspace/xml-commons/java/build/resolver.jar:/srv/gump/public/workspace/xml-commons/java/external/build/xml-apis-ext.jar:/srv/gump/public/workspace/apache-commons/logging/target/commons-logging-29052009.jar:/srv/gump/public/workspace/apache-commons/logging/target/commons-logging-api-29052009.jar
---------------------------------------------
	... 33 more
[MethodExpression] Cannot evaluate expression
java.lang.reflect.InvocationTargetException
	at sun.reflect.NativeMethodAccessorImpl.invoke0(Native Method)
	at sun.reflect.NativeMethodAccessorImpl.invoke(NativeMethodAccessorImpl.java:39)
	at sun.reflect.DelegatingMethodAccessorImpl.invoke(DelegatingMethodAccessorImpl.java:25)
	at java.lang.reflect.Method.invoke(Method.java:597)
	at org.apache.commons.betwixt.expression.MethodExpression.evaluate(MethodExpression.java:96)
	at org.apache.commons.betwixt.io.AbstractBeanWriter.writeContent(AbstractBeanWriter.java:658)
	at org.apache.commons.betwixt.io.AbstractBeanWriter.writeRestOfElement(AbstractBeanWriter.java:539)
	at org.apache.commons.betwixt.io.AbstractBeanWriter.write(AbstractBeanWriter.java:481)
	at org.apache.commons.betwixt.io.AbstractBeanWriter.writeContent(AbstractBeanWriter.java:643)
	at org.apache.commons.betwixt.io.AbstractBeanWriter.writeRestOfElement(AbstractBeanWriter.java:539)
	at org.apache.commons.betwixt.io.AbstractBeanWriter.write(AbstractBeanWriter.java:513)
	at org.apache.commons.betwixt.io.AbstractBeanWriter.write(AbstractBeanWriter.java:233)
	at org.apache.commons.betwixt.io.AbstractBeanWriter.writeContent(AbstractBeanWriter.java:630)
	at org.apache.commons.betwixt.io.AbstractBeanWriter.writeRestOfElement(AbstractBeanWriter.java:539)
	at org.apache.commons.betwixt.io.AbstractBeanWriter.write(AbstractBeanWriter.java:513)
	at org.apache.commons.betwixt.io.AbstractBeanWriter.write(AbstractBeanWriter.java:233)
	at org.apache.commons.betwixt.io.AbstractBeanWriter.write(AbstractBeanWriter.java:162)
	at org.apache.commons.betwixt.io.BeanWriter.write(BeanWriter.java:217)
	at org.apache.maven.MavenUtils.getProjectString(MavenUtils.java:432)
	at org.apache.maven.MavenUtils.getInterpolatedPOM(MavenUtils.java:383)
	at org.apache.maven.MavenUtils.getJellyProject(MavenUtils.java:360)
	at org.apache.maven.MavenUtils.getProject(MavenUtils.java:144)
	at org.apache.maven.MavenUtils.getProject(MavenUtils.java:122)
	at org.apache.maven.MavenSession.initializeRootProject(MavenSession.java:232)
	at org.apache.maven.MavenSession.initialize(MavenSession.java:172)
	at org.apache.maven.cli.App.doMain(App.java:475)
	at org.apache.maven.cli.App.main(App.java:1239)
	at sun.reflect.NativeMethodAccessorImpl.invoke0(Native Method)
	at sun.reflect.NativeMethodAccessorImpl.invoke(NativeMethodAccessorImpl.java:39)
	at sun.reflect.DelegatingMethodAccessorImpl.invoke(DelegatingMethodAccessorImpl.java:25)
	at java.lang.reflect.Method.invoke(Method.java:597)
	at com.werken.forehead.Forehead.run(Forehead.java:551)
	at com.werken.forehead.Forehead.main(Forehead.java:581)
Caused by: java.lang.IllegalArgumentException: cvs repository connection string doesn't contain six tokens
	at org.apache.maven.project.Repository.splitSCMConnection(Repository.java:258)
	at org.apache.maven.project.Repository.getScmType(Repository.java:115)
	... 33 more
The build cannot continue because of the following unsatisfied dependencies:

maven-sourceforge-plugin-1.0.jar (try downloading from http://maven-plugins.sourceforge.net)
maven-statcvs-plugin-2.7.jar
maven-xhtml-plugin-1.2.jar (try downloading from http://maven-validator.sourceforge.net)
maven-checkstyle-plugin-2.4.1.jar (try downloading from http://maven.apache.org/reference/plugins/checkstyle)

Total time: 1 seconds
Finished at: Fri May 29 01:05:26 GMT-08:00 2009

---------------------------------------------

To subscribe to this information via syndicated feeds:
- RSS: http://vmgump.apache.org/gump/public/jtidy/jtidy-cvs/rss.xml
- Atom: http://vmgump.apache.org/gump/public/jtidy/jtidy-cvs/atom.xml

============================== Gump Tracking Only ===
Produced by Gump version 2.3.
Gump Run 31000029052009, vmgump:vmgump-public:31000029052009
Gump E-mail Identifier (unique within run) #8.

*********************************************************** G U M P
[GUMP@vmgump]: Project castor-test (in module castor) failed
To whom it may engage...
        
This is an automated request, but not an unsolicited one. For 
more information please visit http://gump.apache.org/nagged.html, 
and/or contact the folk at general@gump.apache.org.

Project castor-test has an issue affecting its community integration.
This issue affects 1 projects,
 and has been outstanding for 4 runs.
The current state of this project is 'Failed', with reason 'Build Failed'.
For reference only, the following projects are affected by this:
    - castor-test :  Java to XML, SQL, LDAP bindings


Full details are available at:
    http://vmgump.apache.org/gump/public/castor/castor-test/index.html

That said, some information snippets are provided here.

The following annotations (debug/informational/warning/error messages) were provided:
 -WARNING- Overriding Maven2 settings: [/srv/gump/public/workspace/castor/gump_mvn_settings.xml]
 -DEBUG- (Gump generated) Maven2 Settings in: /srv/gump/public/workspace/castor/gump_mvn_settings.xml
 -INFO- Failed with reason build failed
 -DEBUG- Maven POM in: /srv/gump/public/workspace/castor/pom.xml



The following work was performed:
http://vmgump.apache.org/gump/public/castor/castor-test/gump_work/build_castor_castor-test.html
Work Name: build_castor_castor-test (Type: Build)
Work ended in a state of : Failed
Elapsed: 8 mins 56 secs
Command Line: mvn --batch-mode --settings /srv/gump/public/workspace/castor/gump_mvn_settings.xml package 
[Working Directory: /srv/gump/public/workspace/castor]
CLASSPATH: /usr/lib/jvm/java-6-sun/lib/tools.jar
---------------------------------------------
Downloading: http://snapshots.repository.codehaus.org/xerces/xmlParserAPIs/2.6.2/xmlParserAPIs-2.6.2.pom
Downloading: http://localhost:8192/maven2/xerces/xmlParserAPIs/2.6.2/xmlParserAPIs-2.6.2.pom
153b downloaded
Downloading: https://maven-repository.dev.java.net/nonav/repository/poi/poms/poi-2.5.1-final-20040804.pom
Downloading: http://localhost:8192/maven/2/poi/poi/2.5.1-final-20040804/poi-2.5.1-final-20040804.pom
Downloading: http://snapshots.repository.codehaus.org/poi/poi/2.5.1-final-20040804/poi-2.5.1-final-20040804.pom
Downloading: http://localhost:8192/maven2/poi/poi/2.5.1-final-20040804/poi-2.5.1-final-20040804.pom
191b downloaded
Downloading: https://maven-repository.dev.java.net/nonav/repository/org.slf4j/poms/slf4j-api-1.4.3.pom
Downloading: http://localhost:8192/maven/2/org/slf4j/slf4j-api/1.4.3/slf4j-api-1.4.3.pom
Downloading: http://snapshots.repository.codehaus.org/org/slf4j/slf4j-api/1.4.3/slf4j-api-1.4.3.pom
Downloading: http://localhost:8192/maven2/org/slf4j/slf4j-api/1.4.3/slf4j-api-1.4.3.pom
2K downloaded
Downloading: https://maven-repository.dev.java.net/nonav/repository/org.slf4j/poms/slf4j-parent-1.4.3.pom
Downloading: http://localhost:8192/maven/2/org/slf4j/slf4j-parent/1.4.3/slf4j-parent-1.4.3.pom
Downloading: http://snapshots.repository.codehaus.org/org/slf4j/slf4j-parent/1.4.3/slf4j-parent-1.4.3.pom
Downloading: http://localhost:8192/maven2/org/slf4j/slf4j-parent/1.4.3/slf4j-parent-1.4.3.pom
7K downloaded
Downloading: https://maven-repository.dev.java.net/nonav/repository/org.slf4j/poms/slf4j-nop-1.4.3.pom
Downloading: http://localhost:8192/maven/2/org/slf4j/slf4j-nop/1.4.3/slf4j-nop-1.4.3.pom
Downloading: http://snapshots.repository.codehaus.org/org/slf4j/slf4j-nop/1.4.3/slf4j-nop-1.4.3.pom
Downloading: http://localhost:8192/maven2/org/slf4j/slf4j-nop/1.4.3/slf4j-nop-1.4.3.pom
1K downloaded
[INFO] [compiler:compile]
[INFO] Nothing to compile - all classes are up to date
[INFO] [resources:testResources]
[WARNING] Using platform encoding (UTF-8 actually) to copy filtered resources, i.e. build is platform dependent!
[INFO] Copying 43 resources
Downloading: http://localhost:8192/maven2/org/apache/maven/maven-settings/2.0/maven-settings-2.0.pom
1K downloaded
Downloading: https://maven-repository.dev.java.net/nonav/repository/junit/poms/junit-3.8.2.pom
Downloading: http://localhost:8192/maven/2/junit/junit/3.8.2/junit-3.8.2.pom
Downloading: http://snapshots.repository.codehaus.org/junit/junit/3.8.2/junit-3.8.2.pom
Downloading: http://localhost:8192/maven2/junit/junit/3.8.2/junit-3.8.2.pom
747b downloaded
[INFO] [sql:execute {execution: create schema}]
[INFO] Executing file: /srv/gump/public/workspace/castor/jdo-extensions-it/src/test/resources/org/castor/cpa/functional/create-derby.sql
[ERROR] Failed to execute:  CREATE TABLE book( isbn INTEGER NOT NULL, title VARCHAR(200) NOT NULL, PRIMARY KEY (isbn) )
[INFO] ------------------------------------------------------------------------
[ERROR] BUILD ERROR
[INFO] ------------------------------------------------------------------------
[INFO] Table/View 'BOOK' already exists in Schema 'TEST'.

[INFO] ------------------------------------------------------------------------
[INFO] For more information, run Maven with the -e switch
[INFO] ------------------------------------------------------------------------
[INFO] Total time: 8 minutes 54 seconds
[INFO] Finished at: Fri May 29 01:18:03 GMT-08:00 2009
[INFO] Final Memory: 26M/46M
[INFO] ------------------------------------------------------------------------
---------------------------------------------

To subscribe to this information via syndicated feeds:
- RSS: http://vmgump.apache.org/gump/public/castor/castor-test/rss.xml
- Atom: http://vmgump.apache.org/gump/public/castor/castor-test/atom.xml

============================== Gump Tracking Only ===
Produced by Gump version 2.3.
Gump Run 31000029052009, vmgump:vmgump-public:31000029052009
Gump E-mail Identifier (unique within run) #9.

*********************************************************** G U M P
[GUMP@vmgump]: Project ws-commons-axiom (in module ws-axis2-commons) failed
To whom it may engage...
        
This is an automated request, but not an unsolicited one. For 
more information please visit http://gump.apache.org/nagged.html, 
and/or contact the folk at general@gump.apache.org.

Project ws-commons-axiom has an issue affecting its community integration.
This issue affects 2 projects,
 and has been outstanding for 403 runs.
The current state of this project is 'Failed', with reason 'Missing Build Outputs'.
For reference only, the following projects are affected by this:
    - ws-commons-axiom :  Common stuff for the WS projects.
    - ws-commons-axiom-test :  Common stuff for the WS projects.


Full details are available at:
    http://vmgump.apache.org/gump/public/ws-axis2-commons/ws-commons-axiom/index.html

That said, some information snippets are provided here.

The following annotations (debug/informational/warning/error messages) were provided:
 -INFO- Optional dependency jaxen prerequisite failed with reason build failed
 -INFO- Optional dependency xmlunit prerequisite failed with reason build failed
 -INFO- Optional dependency junit failed with reason build failed
 -DEBUG- (Gump generated) Maven2 Settings in: /srv/gump/public/workspace/ws-axis2-commons/axiom/gump_mvn_settings.xml
 -DEBUG- Maven POM in: /srv/gump/public/workspace/ws-axis2-commons/axiom/pom.xml
 -INFO- Failed with reason missing build outputs
 -ERROR- Missing Output: /srv/gump/public/workspace/ws-axis2-commons/axiom/modules/axiom-api/target/axiom-api-SNAPSHOT.jar
 -ERROR- Missing Output: /srv/gump/public/workspace/ws-axis2-commons/axiom/modules/axiom-impl/target/axiom-impl-SNAPSHOT.jar
 -ERROR- Missing Output: /srv/gump/public/workspace/ws-axis2-commons/axiom/modules/axiom-dom/target/axiom-dom-SNAPSHOT.jar
 -ERROR- See Directory Listing Work for Missing Outputs
 -INFO- Failed to extract fallback artifacts from Gump Repository



The following work was performed:
http://vmgump.apache.org/gump/public/ws-axis2-commons/ws-commons-axiom/gump_work/build_ws-axis2-commons_ws-commons-axiom.html
Work Name: build_ws-axis2-commons_ws-commons-axiom (Type: Build)
Work ended in a state of : Success
Elapsed: 2 mins 42 secs
Command Line: mvn --batch-mode -Dmaven.test.skip.exec=true --settings /srv/gump/public/workspace/ws-axis2-commons/axiom/gump_mvn_settings.xml install 
[Working Directory: /srv/gump/public/workspace/ws-axis2-commons/axiom]
CLASSPATH: /usr/lib/jvm/java-6-sun/lib/tools.jar:/srv/gump/public/workspace/logging-log4j-12/dist/lib/log4j-29052009.jar:/srv/gump/packages/jaf-1.1ea/activation.jar:/srv/gump/packages/javamail-1.4/mail.jar:/srv/gump/packages/javamail-1.4/lib/mailapi.jar:jaxen-gump-27052009.jar:/srv/gump/packages/jsse1.0.3/lib/jcert.jar:/srv/gump/packages/jsse1.0.3/lib/jnet.jar:/srv/gump/packages/jsse1.0.3/lib/jsse.jar:/srv/gump/packages/jms1.1/lib/jms.jar:/srv/gump/public/workspace/xml-commons/java/external/build/xml-apis-ext.jar:/srv/gump/public/workspace/xml-security/build/xmlsec-29052009.jar:xmlunit-sumo-gump-27052009.jar:xmlunit-legacy-gump-27052009.jar:xmlunit-core-gump-27052009.jar:junit-gump-27052009.jar
---------------------------------------------
Downloading: http://dist.wso2.org/maven2//org/apache/maven/maven-project/2.0.6/maven-project-2.0.6.jar
Downloading: http://localhost:8192/maven2/org/apache/maven/maven-project/2.0.6/maven-project-2.0.6.jar
113K downloaded
Downloading: http://dist.wso2.org/maven2//org/apache/maven/maven-settings/2.0.6/maven-settings-2.0.6.jar
Downloading: http://localhost:8192/maven2/org/apache/maven/maven-settings/2.0.6/maven-settings-2.0.6.jar
47K downloaded
Downloading: http://dist.wso2.org/maven2//org/apache/maven/maven-plugin-registry/2.0.6/maven-plugin-registry-2.0.6.jar
Downloading: http://localhost:8192/maven2/org/apache/maven/maven-plugin-registry/2.0.6/maven-plugin-registry-2.0.6.jar
28K downloaded
Downloading: http://dist.wso2.org/maven2//org/apache/maven/maven-plugin-api/2.0.6/maven-plugin-api-2.0.6.jar
Downloading: http://localhost:8192/maven2/org/apache/maven/maven-plugin-api/2.0.6/maven-plugin-api-2.0.6.jar
12K downloaded
[INFO] [compiler:testCompile]
[INFO] Compiling 9 source files to /srv/gump/public/workspace/ws-axis2-commons/axiom/modules/axiom-integration/target/test-classes
[INFO] [surefire:test]
[INFO] Tests are skipped.
[INFO] [jar:jar]
[WARNING] JAR will be empty - no content was marked for inclusion!
[INFO] Building jar: /srv/gump/public/workspace/ws-axis2-commons/axiom/modules/axiom-integration/target/axiom-integration-1.2.9-SNAPSHOT.jar
[INFO] Preparing source:jar
[WARNING] Removing: jar from forked lifecycle, to prevent recursive invocation.
[INFO] No goals needed for project - skipping
[INFO] [source:jar {execution: default}]
[INFO] Building jar: /srv/gump/public/workspace/ws-axis2-commons/axiom/modules/axiom-integration/target/axiom-integration-1.2.9-SNAPSHOT-sources.jar
[INFO] [install:install]
[INFO] Installing /srv/gump/public/workspace/ws-axis2-commons/axiom/modules/axiom-integration/target/axiom-integration-1.2.9-SNAPSHOT.jar to /srv/gump/public/workspace/mvnlocalrepo/org/apache/ws/commons/axiom/axiom-integration/1.2.9-SNAPSHOT/axiom-integration-1.2.9-SNAPSHOT.jar
[INFO] Installing /srv/gump/public/workspace/ws-axis2-commons/axiom/modules/axiom-integration/target/axiom-integration-1.2.9-SNAPSHOT-sources.jar to /srv/gump/public/workspace/mvnlocalrepo/org/apache/ws/commons/axiom/axiom-integration/1.2.9-SNAPSHOT/axiom-integration-1.2.9-SNAPSHOT-sources.jar
[INFO] 
[INFO] 
[INFO] ------------------------------------------------------------------------
[INFO] Reactor Summary:
[INFO] ------------------------------------------------------------------------
[INFO] Axiom ................................................. SUCCESS [8.000s]
[INFO] Axiom API ............................................. SUCCESS [48.491s]
[INFO] Axiom Impl ............................................ SUCCESS [7.570s]
[INFO] Axiom DOM ............................................. SUCCESS [5.976s]
[INFO] Axiom C14N ............................................ SUCCESS [5.819s]
[INFO] Axiom Test Suite ...................................... SUCCESS [2.952s]
[INFO] Axiom OSGI Test Suite Parent .......................... SUCCESS [0.009s]
[INFO] Axiom OSGI Test Suite - Build ......................... SUCCESS [8.627s]
[INFO] Axiom OSGI Test Suite - Run ........................... SUCCESS [37.062s]
[INFO] Axiom Integration Test Suite .......................... SUCCESS [33.627s]
[INFO] ------------------------------------------------------------------------
[INFO] ------------------------------------------------------------------------
[INFO] BUILD SUCCESSFUL
[INFO] ------------------------------------------------------------------------
[INFO] Total time: 2 minutes 40 seconds
[INFO] Finished at: Fri May 29 01:38:30 GMT-08:00 2009
[INFO] Final Memory: 33M/64M
[INFO] ------------------------------------------------------------------------
---------------------------------------------

To subscribe to this information via syndicated feeds:
- RSS: http://vmgump.apache.org/gump/public/ws-axis2-commons/ws-commons-axiom/rss.xml
- Atom: http://vmgump.apache.org/gump/public/ws-axis2-commons/ws-commons-axiom/atom.xml

============================== Gump Tracking Only ===
Produced by Gump version 2.3.
Gump Run 31000029052009, vmgump:vmgump-public:31000029052009
Gump E-mail Identifier (unique within run) #14.

*********************************************************** G U M P
[GUMP@vmgump]: Project JacORB-idllib (in module JacORB) failed
To whom it may engage...
        
This is an automated request, but not an unsolicited one. For 
more information please visit http://gump.apache.org/nagged.html, 
and/or contact the folk at general@gump.apache.org.

Project JacORB-idllib has an issue affecting its community integration.
This issue affects 1 projects,
 and has been outstanding for 125 runs.
The current state of this project is 'Failed', with reason 'Build Failed'.
For reference only, the following projects are affected by this:
    - JacORB-idllib :  The free Java implementation of the OMG's CORBA standard.


Full details are available at:
    http://vmgump.apache.org/gump/public/JacORB/JacORB-idllib/index.html

That said, some information snippets are provided here.

The following annotations (debug/informational/warning/error messages) were provided:
 -DEBUG- Sole output [idl.jar] identifier set to project name
 -INFO- Failed with reason build failed
 -INFO- Failed to extract fallback artifacts from Gump Repository



The following work was performed:
http://vmgump.apache.org/gump/public/JacORB/JacORB-idllib/gump_work/build_JacORB_JacORB-idllib.html
Work Name: build_JacORB_JacORB-idllib (Type: Build)
Work ended in a state of : Failed
Elapsed: 8 secs
Command Line: /usr/lib/jvm/java-6-sun/bin/java -Djava.awt.headless=true -Xbootclasspath/p:/srv/gump/public/workspace/xml-commons/java/external/build/xml-apis.jar:/srv/gump/public/workspace/xml-xerces2/build/xercesImpl.jar org.apache.tools.ant.Main -Dgump.merge=/srv/gump/public/gump/work/merge.xml -Dbuild.sysclasspath=only init idllib 
[Working Directory: /srv/gump/public/workspace/JacORB]
CLASSPATH: /usr/lib/jvm/java-6-sun/lib/tools.jar:/srv/gump/public/workspace/ant/build/lib/ant-stylebook.jar:/srv/gump/public/workspace/ant/build/lib/ant-swing.jar:/srv/gump/public/workspace/ant/build/lib/ant-apache-resolver.jar:/srv/gump/public/workspace/ant/build/lib/ant-nodeps.jar:/srv/gump/public/workspace/ant/build/lib/ant-apache-xalan2.jar:/srv/gump/public/workspace/ant/build/lib/ant-apache-regexp.jar:/srv/gump/public/workspace/ant/build/lib/ant-commons-net.jar:/srv/gump/public/workspace/ant/build/lib/ant-apache-log4j.jar:/srv/gump/public/workspace/ant/build/lib/ant-commons-logging.jar:/srv/gump/public/workspace/ant/build/lib/ant-jai.jar:/srv/gump/public/workspace/ant/build/lib/ant-jmf.jar:/srv/gump/public/workspace/ant/build/lib/ant-launcher.jar:/srv/gump/public/workspace/ant/build/lib/ant-jdepend.jar:/srv/gump/public/workspace/ant/build/lib/ant-apache-bsf.jar:/srv/gump/public/workspace/ant/build/lib/ant-apache-oro.jar:/srv/gump/public/workspace/ant/build/lib/ant-apache
 -bcel.jar:/srv/gump/public/workspace/ant/build/lib/ant-trax.jar:/srv/gump/public/workspace/ant/build/lib/ant-antlr.jar:/srv/gump/public/workspace/ant/build/lib/ant-junit.jar:/srv/gump/public/workspace/ant/build/lib/ant-jsch.jar:/srv/gump/public/workspace/ant/build/lib/ant-javamail.jar:/srv/gump/public/workspace/ant/build/lib/ant.jar:/srv/gump/public/workspace/xml-commons/java/external/build/xml-apis-ext.jar:/srv/gump/packages/antlr-2.7.6/antlr.jar:/srv/gump/public/workspace/excalibur/framework/api/target/excalibur-framework-api-29052009.jar:/srv/gump/packages/dougLea/concurrent.jar:/srv/gump/packages/avalon/avalon-logkit-2.1.jar:/srv/gump/public/workspace/xml-xalan/tools/java_cup.jar:/srv/gump/public/workspace/xml-xalan/lib/runtime.jar
---------------------------------------------
    [javac] location: package org.jacorb.idl.runtime
    [javac]               CUP$parser$result = new org.jacorb.idl.runtime.Symbol(91/*parameter_dcls*/, ((org.jacorb.idl.runtime.Symbol)CUP$parser$stack.elementAt(CUP$parser$top-1)).left, ((org.jacorb.idl.runtime.Symbol)CUP$parser$stack.elementAt(CUP$parser$top-0)).right, RESULT);
    [javac]                                                             ^
    [javac] /srv/gump/public/workspace/JacORB/src/org/jacorb/idl/parser.java:2029: cannot find symbol
    [javac] symbol  : class Symbol
    [javac] location: package org.jacorb.idl.runtime
    [javac]               CUP$parser$result = new org.jacorb.idl.runtime.Symbol(91/*parameter_dcls*/, ((org.jacorb.idl.runtime.Symbol)CUP$parser$stack.elementAt(CUP$parser$top-1)).left, ((org.jacorb.idl.runtime.Symbol)CUP$parser$stack.elementAt(CUP$parser$top-0)).right, RESULT);
    [javac]                                                                                                                   ^
    [javac] /srv/gump/public/workspace/JacORB/src/org/jacorb/idl/parser.java:2029: cannot find symbol
    [javac] symbol  : class Symbol
    [javac] location: package org.jacorb.idl.runtime
    [javac]               CUP$parser$result = new org.jacorb.idl.runtime.Symbol(91/*parameter_dcls*/, ((org.jacorb.idl.runtime.Symbol)CUP$parser$stack.elementAt(CUP$parser$top-1)).left, ((org.jacorb.idl.runtime.Symbol)CUP$parser$stack.elementAt(CUP$parser$top-0)).right, RESULT);
    [javac]                                                                                                                                                                                                       ^
    [javac] /srv/gump/public/workspace/JacORB/src/org/jacorb/idl/parser.java:2037: cannot find symbol
    [javac] symbol  : class Symbol
    [javac] location: package org.jacorb.idl.runtime
    [javac] 		int pdsleft = ((org.jacorb.idl.runtime.Symbol)CUP$parser$stack.elementAt(CUP$parser$top-1)).left;
    [javac] 		                                      ^
    [javac] /srv/gump/public/workspace/JacORB/src/org/jacorb/idl/parser.java:2038: cannot find symbol
    [javac] symbol  : class Symbol
    [javac] location: package org.jacorb.idl.runtime
    [javac] 		int pdsright = ((org.jacorb.idl.runtime.Symbol)CUP$parser$stack.elementAt(CUP$parser$top-1)).right;
    [javac] 		                                       ^
    [javac] /srv/gump/public/workspace/JacORB/src/org/jacorb/idl/parser.java:2039: cannot find symbol
    [javac] symbol  : class Symbol
    [javac] location: package org.jacorb.idl.runtime
    [javac] 		SymbolList pds = (SymbolList)((org.jacorb.idl.runtime.Symbol) CUP$parser$stack.elementAt(CUP$parser$top-1)).value;
    [javac] 		                                                     ^
    [javac] /srv/gump/public/workspace/JacORB/src/org/jacorb/idl/parser.java:2043: cannot find symbol
    [javac] symbol  : class Symbol
    [javac] location: package org.jacorb.idl.runtime
    [javac]               CUP$parser$result = new org.jacorb.idl.runtime.Symbol(91/*parameter_dcls*/, ((org.jacorb.idl.runtime.Symbol)CUP$parser$stack.elementAt(CUP$parser$top-2)).left, ((org.jacorb.idl.runtime.Symbol)CUP$parser$stack.elementAt(CUP$parser$top-0)).right, RESULT);
    [javac]                                                             ^
    [javac] /srv/gump/public/workspace/JacORB/src/org/jacorb/idl/parser.java:2043: cannot find symbol
    [javac] symbol  : class Symbol
    [javac] location: package org.jacorb.idl.runtime
    [javac]               CUP$parser$result = new org.jacorb.idl.runtime.Symbol(91/*parameter_dcls*/, ((org.jacorb.idl.runtime.Symbol)CUP$parser$stack.elementAt(CUP$parser$top-2)).left, ((org.jacorb.idl.runtime.Symbol)CUP$parser$stack.elementAt(CUP$parser$top-0)).right, RESULT);
    [javac]                                                                                                                   ^
    [javac] Note: Some input files use or override a deprecated API.
    [javac] Note: Recompile with -Xlint:deprecation for details.
    [javac] Note: Some input files use unchecked or unsafe operations.
    [javac] Note: Recompile with -Xlint:unchecked for details.
    [javac] 100 errors

BUILD FAILED
/srv/gump/public/workspace/JacORB/build.xml:68: The following error occurred while executing this line:
/srv/gump/public/workspace/JacORB/src/org/jacorb/idl/build.xml:18: The following error occurred while executing this line:
/srv/gump/public/workspace/JacORB/etc/common.xml:90: Compile failed; see the compiler error output for details.

Total time: 6 seconds
---------------------------------------------

To subscribe to this information via syndicated feeds:
- RSS: http://vmgump.apache.org/gump/public/JacORB/JacORB-idllib/rss.xml
- Atom: http://vmgump.apache.org/gump/public/JacORB/JacORB-idllib/atom.xml

============================== Gump Tracking Only ===
Produced by Gump version 2.3.
Gump Run 31000029052009, vmgump:vmgump-public:31000029052009
Gump E-mail Identifier (unique within run) #15.

*********************************************************** G U M P
[GUMP@vmgump]: Project jetty (in module jetty) failed
To whom it may engage...
        
This is an automated request, but not an unsolicited one. For 
more information please visit http://gump.apache.org/nagged.html, 
and/or contact the folk at general@gump.apache.org.

Project jetty has an issue affecting its community integration.
This issue affects 2 projects,
 and has been outstanding for 19 runs.
The current state of this project is 'Failed', with reason 'Build Failed'.
For reference only, the following projects are affected by this:
    - jetty :  Java HTTP Servlet Server
    - jetty-test :  Java HTTP Servlet Server


Full details are available at:
    http://vmgump.apache.org/gump/public/jetty/jetty/index.html

That said, some information snippets are provided here.

The following annotations (debug/informational/warning/error messages) were provided:
 -INFO- Optional dependency slide-webdavlib prerequisite failed with reason build failed
 -INFO- Optional dependency commons-httpclient prerequisite failed with reason build failed
 -INFO- Optional dependency mx4j-tools prerequisite failed with reason build failed
 -INFO- Optional dependency mx4j prerequisite failed with reason build failed
 -INFO- Optional dependency commons-digester prerequisite failed with reason build failed
 -INFO- Optional dependency commons-beanutils prerequisite failed with reason build failed
 -INFO- Optional dependency junit failed with reason build failed
 -DEBUG- (Gump generated) Maven2 Settings in: /srv/gump/public/workspace/jetty/gump_mvn_settings.xml
 -INFO- Failed with reason build failed
 -DEBUG- Maven POM in: /srv/gump/public/workspace/jetty/pom.xml
 -INFO- Failed to extract fallback artifacts from Gump Repository



The following work was performed:
http://vmgump.apache.org/gump/public/jetty/jetty/gump_work/build_jetty_jetty.html
Work Name: build_jetty_jetty (Type: Build)
Work ended in a state of : Failed
Elapsed: 1 min 26 secs
Command Line: mvn --batch-mode -Dmaven.test.skip.exec=true --settings /srv/gump/public/workspace/jetty/gump_mvn_settings.xml package 
[Working Directory: /srv/gump/public/workspace/jetty]
CLASSPATH: /usr/lib/jvm/java-6-sun/lib/tools.jar:/srv/gump/public/workspace/ant/dist/lib/ant-jmf.jar:/srv/gump/public/workspace/ant/dist/lib/ant-swing.jar:/srv/gump/public/workspace/ant/dist/lib/ant-apache-resolver.jar:/srv/gump/public/workspace/ant/dist/lib/ant-apache-xalan2.jar:/srv/gump/public/workspace/ant/dist/lib/ant-trax.jar:/srv/gump/public/workspace/ant/dist/lib/ant-junit.jar:/srv/gump/public/workspace/ant/dist/lib/ant-launcher.jar:/srv/gump/public/workspace/ant/dist/lib/ant-nodeps.jar:/srv/gump/public/workspace/ant/dist/lib/ant.jar:/srv/gump/packages/bsh-2.0b4/bsh-commands-2.0b4.jar:/srv/gump/packages/bsh-2.0b4/bsh-classpath-2.0b4.jar:/srv/gump/packages/bsh-2.0b4/bsh-core-2.0b4.jar:/srv/gump/packages/bsh-2.0b4/bsh-bsf-2.0b4.jar:/srv/gump/packages/bsh-2.0b4/bsh-2.0b4.jar:/srv/gump/packages/bsh-2.0b4/bsh-reflect-2.0b4.jar:/srv/gump/packages/bsh-2.0b4/bsh-util-2.0b4.jar:commons-beanutils-gump-27052009.jar:commons-digester-gump-27052009.jar:/srv/gump/packages/commons-el
 -1.0/commons-el.jar:commons-httpclient-gump-27052009.jar:/srv/gump/packages/jaf-1.1ea/activation.jar:/srv/gump/public/workspace/jakarta-servletapi-5/jsr154/dist/lib/servlet-api.jar:/srv/gump/packages/javamail-1.4/mail.jar:/srv/gump/packages/javamail-1.4/lib/mailapi.jar:/srv/gump/packages/jtidy-04aug2000r7-dev/build/Tidy.jar:junit-gump-27052009.jar:mx4j-impl-gump-27052009.jar:mx4j-jmx-gump-27052009.jar:mx4j-gump-27052009.jar:mx4j-tools-gump-27052009.jar:/srv/gump/public/workspace/slf4j/jcl104-over-slf4j/target/jcl104-over-slf4j-1.5.7-SNAPSHOT.jar:/srv/gump/public/workspace/slf4j/slf4j-migrator/target/slf4j-migrator-1.5.7-SNAPSHOT.jar:/srv/gump/public/workspace/slf4j/slf4j-api/target/slf4j-api-1.5.7-SNAPSHOT.jar:/srv/gump/public/workspace/slf4j/slf4j-jcl/target/slf4j-jcl-1.5.7-SNAPSHOT.jar:/srv/gump/public/workspace/slf4j/slf4j-jdk14/target/slf4j-jdk14-1.5.7-SNAPSHOT.jar:/srv/gump/public/workspace/slf4j/slf4j-ext/target/slf4j-ext-1.5.7-SNAPSHOT.jar:/srv/gump/public/workspace/s
 lf4j/slf4j-nop/target/slf4j-nop-1.5.7-SNAPSHOT.jar:/srv/gump/public/workspace/slf4j/jul-to-slf4j/target/jul-to-slf4j-1.5.7-SNAPSHOT.jar:/srv/gump/public/workspace/slf4j/log4j-over-slf4j/target/log4j-over-slf4j-1.5.7-SNAPSHOT.jar:/srv/gump/public/workspace/slf4j/slf4j-simple/target/slf4j-simple-1.5.7-SNAPSHOT.jar:/srv/gump/public/workspace/slf4j/slf4j-log4j12/target/slf4j-log4j12-1.5.7-SNAPSHOT.jar:/srv/gump/public/workspace/slf4j/jcl-over-slf4j/target/jcl-over-slf4j-1.5.7-SNAPSHOT.jar:slide-webdavlib-gump-27052009.jar:/srv/gump/public/workspace/xml-commons/java/external/build/xml-apis-ext.jar
---------------------------------------------
2K downloaded
Downloading: http://download.java.net/maven/2/org/mortbay/jetty/jetty-parent/8/jetty-parent-8.pom
Downloading: http://download.java.net/maven/1/org.mortbay.jetty/poms/jetty-parent-8.pom
Downloading: http://localhost:8192/maven2/org/mortbay/jetty/jetty-parent/8/jetty-parent-8.pom
2K downloaded
Downloading: http://download.java.net/maven/2/org/mortbay/jetty/jetty-util/6.1.18/jetty-util-6.1.18.pom
Downloading: http://download.java.net/maven/1/org.mortbay.jetty/poms/jetty-util-6.1.18.pom
Downloading: http://localhost:8192/maven2/org/mortbay/jetty/jetty-util/6.1.18/jetty-util-6.1.18.pom
3K downloaded
Downloading: http://download.java.net/maven/2/org/mortbay/jetty/project/6.1.18/project-6.1.18.pom
Downloading: http://download.java.net/maven/1/org.mortbay.jetty/poms/project-6.1.18.pom
Downloading: http://localhost:8192/maven2/org/mortbay/jetty/project/6.1.18/project-6.1.18.pom
8K downloaded
Downloading: http://download.java.net/maven/2/org/mortbay/jetty/servlet-api/3.0.PFD20090525/servlet-api-3.0.PFD20090525.jar
Downloading: http://download.java.net/maven/1/org.mortbay.jetty/jars/servlet-api-3.0.PFD20090525.jar
Downloading: http://localhost:8192/maven2/org/mortbay/jetty/servlet-api/3.0.PFD20090525/servlet-api-3.0.PFD20090525.jar
169K downloaded
Downloading: http://download.java.net/maven/2/org/mortbay/jetty/jetty-util/6.1.18/jetty-util-6.1.18.jar
Downloading: http://download.java.net/maven/1/org.mortbay.jetty/jars/jetty-util-6.1.18.jar
Downloading: http://localhost:8192/maven2/org/mortbay/jetty/jetty-util/6.1.18/jetty-util-6.1.18.jar
168K downloaded
[INFO] [enforcer:enforce {execution: enforce-java}]
[INFO] [remote-resources:process {execution: default}]
[INFO] [resources:resources]
[INFO] Using 'UTF-8' encoding to copy filtered resources.
[INFO] skip non existing resourceDirectory /srv/gump/public/workspace/jetty/jetty-continuation/src/main/resources
[INFO] Copying 1 resource
[INFO] [compiler:compile]
[INFO] Compiling 7 source files to /srv/gump/public/workspace/jetty/jetty-continuation/target/classes
[INFO] ------------------------------------------------------------------------
[ERROR] BUILD FAILURE
[INFO] ------------------------------------------------------------------------
[INFO] Compilation failure

/srv/gump/public/workspace/jetty/jetty-continuation/src/main/java/org/eclipse/jetty/continuation/ContinuationSupport.java:[39,38] incompatible types
found   : java.lang.reflect.Constructor<?>
required: java.lang.reflect.Constructor<? extends org.eclipse.jetty.continuation.Continuation>

/srv/gump/public/workspace/jetty/jetty-continuation/src/main/java/org/eclipse/jetty/continuation/ContinuationSupport.java:[57,38] incompatible types
found   : java.lang.reflect.Constructor<?>
required: java.lang.reflect.Constructor<? extends org.eclipse.jetty.continuation.Continuation>


[INFO] ------------------------------------------------------------------------
[INFO] For more information, run Maven with the -e switch
[INFO] ------------------------------------------------------------------------
[INFO] Total time: 1 minute 24 seconds
[INFO] Finished at: Fri May 29 01:42:42 GMT-08:00 2009
[INFO] Final Memory: 36M/65M
[INFO] ------------------------------------------------------------------------
---------------------------------------------

To subscribe to this information via syndicated feeds:
- RSS: http://vmgump.apache.org/gump/public/jetty/jetty/rss.xml
- Atom: http://vmgump.apache.org/gump/public/jetty/jetty/atom.xml

============================== Gump Tracking Only ===
Produced by Gump version 2.3.
Gump Run 31000029052009, vmgump:vmgump-public:31000029052009
Gump E-mail Identifier (unique within run) #16.

*********************************************************** G U M P
[GUMP@vmgump]: Project ws-commons-policy (in module ws-axis2-commons) failed
To whom it may engage...
        
This is an automated request, but not an unsolicited one. For 
more information please visit http://gump.apache.org/nagged.html, 
and/or contact the folk at general@gump.apache.org.

Project ws-commons-policy has an issue affecting its community integration.
This issue affects 1 projects,
 and has been outstanding for 958 runs.
The current state of this project is 'Failed', with reason 'Build Failed'.
For reference only, the following projects are affected by this:
    - ws-commons-policy :  Common stuff for the WS projects.


Full details are available at:
    http://vmgump.apache.org/gump/public/ws-axis2-commons/ws-commons-policy/index.html

That said, some information snippets are provided here.

The following annotations (debug/informational/warning/error messages) were provided:
 -DEBUG- Sole output [ws-commons-policy-29052009.jar] identifier set to project name
 -INFO- Optional dependency ws-commons-axiom failed with reason missing build outputs
 -DEBUG- (Gump generated) Maven2 Settings in: /srv/gump/public/workspace/ws-axis2-commons/neethi/gump_mvn_settings.xml
 -INFO- Failed with reason build failed
 -DEBUG- Maven POM in: /srv/gump/public/workspace/ws-axis2-commons/neethi/pom.xml
 -INFO- Failed to extract fallback artifacts from Gump Repository



The following work was performed:
http://vmgump.apache.org/gump/public/ws-axis2-commons/ws-commons-policy/gump_work/build_ws-axis2-commons_ws-commons-policy.html
Work Name: build_ws-axis2-commons_ws-commons-policy (Type: Build)
Work ended in a state of : Failed
Elapsed: 10 secs
Command Line: mvn --batch-mode --settings /srv/gump/public/workspace/ws-axis2-commons/neethi/gump_mvn_settings.xml package 
[Working Directory: /srv/gump/public/workspace/ws-axis2-commons/neethi]
CLASSPATH: /usr/lib/jvm/java-6-sun/lib/tools.jar:/srv/gump/public/workspace/apache-commons/logging/target/commons-logging-29052009.jar:/srv/gump/public/workspace/apache-commons/logging/target/commons-logging-api-29052009.jar:/srv/gump/public/workspace/ws-axis2-commons/axiom/modules/axiom-api/target/axiom-api-SNAPSHOT.jar:/srv/gump/public/workspace/ws-axis2-commons/axiom/modules/axiom-impl/target/axiom-impl-SNAPSHOT.jar:/srv/gump/public/workspace/ws-axis2-commons/axiom/modules/axiom-dom/target/axiom-dom-SNAPSHOT.jar:/srv/gump/public/workspace/wsdl4j/build/lib/qname.jar:/srv/gump/public/workspace/wsdl4j/build/lib/wsdl4j.jar
---------------------------------------------
Missing:
----------
1) org.apache.ws.commons.axiom:axiom-api:jar:SNAPSHOT

  Try downloading the file manually from the project website.

  Then, install it using the command: 
      mvn install:install-file -DgroupId=org.apache.ws.commons.axiom -DartifactId=axiom-api -Dversion=SNAPSHOT -Dpackaging=jar -Dfile=/path/to/file

  Alternatively, if you host your own repository you can deploy the file there: 
      mvn deploy:deploy-file -DgroupId=org.apache.ws.commons.axiom -DartifactId=axiom-api -Dversion=SNAPSHOT -Dpackaging=jar -Dfile=/path/to/file -Durl=[url] -DrepositoryId=[id]

  Path to dependency: 
  	1) org.apache.neethi:neethi:jar:SNAPSHOT
  	2) org.apache.ws.commons.axiom:axiom-api:jar:SNAPSHOT

2) org.apache.ws.commons.axiom:axiom-impl:jar:SNAPSHOT

  Try downloading the file manually from the project website.

  Then, install it using the command: 
      mvn install:install-file -DgroupId=org.apache.ws.commons.axiom -DartifactId=axiom-impl -Dversion=SNAPSHOT -Dpackaging=jar -Dfile=/path/to/file

  Alternatively, if you host your own repository you can deploy the file there: 
      mvn deploy:deploy-file -DgroupId=org.apache.ws.commons.axiom -DartifactId=axiom-impl -Dversion=SNAPSHOT -Dpackaging=jar -Dfile=/path/to/file -Durl=[url] -DrepositoryId=[id]

  Path to dependency: 
  	1) org.apache.neethi:neethi:jar:SNAPSHOT
  	2) org.apache.ws.commons.axiom:axiom-impl:jar:SNAPSHOT

----------
2 required artifacts are missing.

for artifact: 
  org.apache.neethi:neethi:jar:SNAPSHOT

from the specified remote repositories:
  gump-central (http://localhost:8192/maven2),
  maven-central (http://repo1.maven.org/maven/),
  apache-ws-snapshots2 (http://ws.zones.apache.org/repository2)



[INFO] ------------------------------------------------------------------------
[INFO] For more information, run Maven with the -e switch
[INFO] ------------------------------------------------------------------------
[INFO] Total time: 9 seconds
[INFO] Finished at: Fri May 29 01:42:54 GMT-08:00 2009
[INFO] Final Memory: 9M/16M
[INFO] ------------------------------------------------------------------------
---------------------------------------------

To subscribe to this information via syndicated feeds:
- RSS: http://vmgump.apache.org/gump/public/ws-axis2-commons/ws-commons-policy/rss.xml
- Atom: http://vmgump.apache.org/gump/public/ws-axis2-commons/ws-commons-policy/atom.xml

============================== Gump Tracking Only ===
Produced by Gump version 2.3.
Gump Run 31000029052009, vmgump:vmgump-public:31000029052009
Gump E-mail Identifier (unique within run) #17.

*********************************************************** G U M P
[GUMP@vmgump]: Project commons-jci (in module apache-commons) failed
To whom it may engage...
        
This is an automated request, but not an unsolicited one. For 
more information please visit http://gump.apache.org/nagged.html, 
and/or contact the folk at general@gump.apache.org.

Project commons-jci has an issue affecting its community integration.
This issue affects 2 projects,
 and has been outstanding for 977 runs.
The current state of this project is 'Failed', with reason 'Build Failed'.
For reference only, the following projects are affected by this:
    - commons-jci :  Commons JCI
    - commons-jci-test :  Apache Commons


Full details are available at:
    http://vmgump.apache.org/gump/public/apache-commons/commons-jci/index.html

That said, some information snippets are provided here.

The following annotations (debug/informational/warning/error messages) were provided:
 -DEBUG- Sole output [commons-jci-29052009.jar] identifier set to project name
 -INFO- Optional dependency commons-io prerequisite failed with reason build failed
 -DEBUG- (Gump generated) Maven2 Settings in: /srv/gump/public/workspace/apache-commons/jci/gump_mvn_settings.xml
 -INFO- Failed with reason build failed
 -DEBUG- Maven POM in: /srv/gump/public/workspace/apache-commons/jci/pom.xml
 -INFO- Failed to extract fallback artifacts from Gump Repository



The following work was performed:
http://vmgump.apache.org/gump/public/apache-commons/commons-jci/gump_work/build_apache-commons_commons-jci.html
Work Name: build_apache-commons_commons-jci (Type: Build)
Work ended in a state of : Failed
Elapsed: 59 secs
Command Line: mvn --batch-mode -Dmaven.test.skip.exec=true --settings /srv/gump/public/workspace/apache-commons/jci/gump_mvn_settings.xml package 
[Working Directory: /srv/gump/public/workspace/apache-commons/jci]
CLASSPATH: /usr/lib/jvm/java-6-sun/lib/tools.jar:/srv/gump/public/workspace/jakarta-bcel/target/bcel-5.3-SNAPSHOT.jar:/srv/gump/public/workspace/apache-commons/collections/build/commons-collections-29052009.jar:commons-io-gump-27052009.jar:/srv/gump/public/workspace/apache-commons/lang/target/commons-lang-3.0-SNAPSHOT.jar:/srv/gump/public/workspace/apache-commons/logging/target/commons-logging-29052009.jar:/srv/gump/public/workspace/apache-commons/logging/target/commons-logging-api-29052009.jar:/srv/gump/packages/eclipse/plugins/org.eclipse.jdt.core_3.4.2/jdtcore.jar:/srv/gump/packages/jarjar/jarjar-0.6.jar:/srv/gump/public/workspace/asm/output/dist/lib/asm-analysis-29052009.jar:/srv/gump/public/workspace/asm/output/dist/lib/asm-util-29052009.jar:/srv/gump/public/workspace/asm/output/dist/lib/asm-xml-29052009.jar:/srv/gump/public/workspace/asm/output/dist/lib/asm-commons-29052009.jar:/srv/gump/public/workspace/asm/output/dist/lib/asm-29052009.jar:/srv/gump/public/workspace/as
 m/output/dist/lib/asm-tree-29052009.jar:/srv/gump/packages/antlr-2.7.6/antlr.jar:/srv/gump/packages/groovy-1.0-jsr-03/groovy-1.0-jsr-03.jar:/srv/gump/packages/maven-cobertura-plugin/maven-cobertura-plugin-1.1.jar
---------------------------------------------
1K downloaded
Downloading: http://localhost:8192/maven2/asm/asm-analysis/2.2.1/asm-analysis-2.2.1.pom
1K downloaded
Downloading: http://localhost:8192/maven2/asm/asm-attrs/2.2.1/asm-attrs-2.2.1.pom
1K downloaded
Downloading: http://localhost:8192/maven2/commons-io/commons-io/1.1/commons-io-1.1.pom
5K downloaded
Downloading: http://localhost:8192/maven2/asm/asm/2.2/asm-2.2.pom
807b downloaded
Downloading: http://localhost:8192/maven2/org/vafer/dependency/0.2/dependency-0.2.jar
17K downloaded
Downloading: http://localhost:8192/maven2/asm/asm-commons/2.2.1/asm-commons-2.2.1.jar
32K downloaded
Downloading: http://localhost:8192/maven2/asm/asm/2.2/asm-2.2.jar
42K downloaded
Downloading: http://localhost:8192/maven2/asm/asm-util/2.2.1/asm-util-2.2.1.jar
34K downloaded
Downloading: http://localhost:8192/maven2/asm/asm-analysis/2.2.1/asm-analysis-2.2.1.jar
17K downloaded
Downloading: http://localhost:8192/maven2/asm/asm-attrs/2.2.1/asm-attrs-2.2.1.jar
6K downloaded
[INFO] [antrun:run {execution: javadoc.resources}]
[INFO] Executing tasks
[INFO] Executed tasks
[INFO] [resources:resources]
[WARNING] Using platform encoding (UTF-8 actually) to copy filtered resources, i.e. build is platform dependent!
[INFO] Copying 0 resource to META-INF
[INFO] [compiler:compile]
[INFO] Compiling 6 source files to /srv/gump/public/workspace/apache-commons/jci/compilers/javac/target/classes
[INFO] ------------------------------------------------------------------------
[ERROR] BUILD FAILURE
[INFO] ------------------------------------------------------------------------
[INFO] Compilation failure

/srv/gump/public/workspace/apache-commons/jci/compilers/javac/src/main/java/org/apache/commons/jci/compilers/JavacClassLoader.java:[108,46] cannot find symbol
symbol  : constructor ClassWriter(boolean,boolean)
location: class org.objectweb.asm.ClassWriter

/srv/gump/public/workspace/apache-commons/jci/compilers/javac/src/main/java/org/apache/commons/jci/compilers/JavacClassLoader.java:[109,44] cannot find symbol
symbol  : method accept(org.vafer.dependency.asm.RenamingVisitor,boolean)
location: class org.objectweb.asm.ClassReader


[INFO] ------------------------------------------------------------------------
[INFO] For more information, run Maven with the -e switch
[INFO] ------------------------------------------------------------------------
[INFO] Total time: 56 seconds
[INFO] Finished at: Fri May 29 02:16:19 GMT-08:00 2009
[INFO] Final Memory: 28M/50M
[INFO] ------------------------------------------------------------------------
---------------------------------------------

To subscribe to this information via syndicated feeds:
- RSS: http://vmgump.apache.org/gump/public/apache-commons/commons-jci/rss.xml
- Atom: http://vmgump.apache.org/gump/public/apache-commons/commons-jci/atom.xml

============================== Gump Tracking Only ===
Produced by Gump version 2.3.
Gump Run 31000029052009, vmgump:vmgump-public:31000029052009
Gump E-mail Identifier (unique within run) #18.

*********************************************************** G U M P
[GUMP@vmgump]: Module poi success, but with warnings.
To whom it may engage...
        
This is an automated request, but not an unsolicited one. For 
more information please visit http://gump.apache.org/nagged.html, 
and/or contact the folk at general@gump.apache.org.

Module poi contains errors.
The current state of this module is 'Success'.

Full details are available at:
    http://vmgump.apache.org/gump/public/poi/index.html

That said, some information snippets are provided here.

The following annotations (debug/informational/warning/error messages) were provided:
 -ERROR- *** Failed to update from source control.Stale contents ***



The following work was performed:
http://vmgump.apache.org/gump/public/poi/gump_work/update_poi.html
Work Name: update_poi (Type: Update)
Work ended in a state of : Failed
Elapsed: 
Command Line: svn --quiet update --non-interactive poi 
[Working Directory: /srv/gump/public/workspace/cvs]
---------------------------------------------
svn: Working copy 'poi' locked
svn: run 'svn cleanup' to remove locks (type 'svn help cleanup' for details)
---------------------------------------------

To subscribe to this information via syndicated feeds:
- RSS: http://vmgump.apache.org/gump/public/poi/rss.xml
- Atom: http://vmgump.apache.org/gump/public/poi/atom.xml

============================== Gump Tracking Only ===
Produced by Gump version 2.3.
Gump Run 31000029052009, vmgump:vmgump-public:31000029052009
Gump E-mail Identifier (unique within run) #19.

*********************************************************** G U M P
[GUMP@vmgump]: Project mina (in module mina) failed
To whom it may engage...
        
This is an automated request, but not an unsolicited one. For 
more information please visit http://gump.apache.org/nagged.html, 
and/or contact the folk at general@gump.apache.org.

Project mina has an issue affecting its community integration.
This issue affects 2 projects,
 and has been outstanding for 6 runs.
The current state of this project is 'Failed', with reason 'Build Failed'.
For reference only, the following projects are affected by this:
    - ldap-protocol :  Apache Directory Server
    - mina :  A Multipurpose Infrastrusture for Network Applications


Full details are available at:
    http://vmgump.apache.org/gump/public/mina/mina/index.html

That said, some information snippets are provided here.

The following annotations (debug/informational/warning/error messages) were provided:
 -INFO- Optional dependency commons-net prerequisite failed with reason build failed
 -INFO- Optional dependency ant-contrib prerequisite failed with reason build failed
 -INFO- Optional dependency junit failed with reason build failed
 -DEBUG- (Gump generated) Maven2 Settings in: /srv/gump/public/workspace/mina/gump_mvn_settings.xml
 -INFO- Failed with reason build failed
 -DEBUG- Maven POM in: /srv/gump/public/workspace/mina/pom.xml
 -INFO- Project Reports in: /srv/gump/public/workspace/mina/target/test-reports
 -WARNING- No directory [/srv/gump/public/workspace/mina/target/test-reports]
 -INFO- Failed to extract fallback artifacts from Gump Repository



The following work was performed:
http://vmgump.apache.org/gump/public/mina/mina/gump_work/build_mina_mina.html
Work Name: build_mina_mina (Type: Build)
Work ended in a state of : Failed
Elapsed: 2 mins 1 sec
Command Line: mvn --batch-mode -Dmaven.final.name=mina-29052009 --settings /srv/gump/public/workspace/mina/gump_mvn_settings.xml install 
[Working Directory: /srv/gump/public/workspace/mina]
CLASSPATH: /usr/lib/jvm/java-6-sun/lib/tools.jar:/srv/gump/public/workspace/mina/legal/target/mina-legal-2.0.0-M6-SNAPSHOT.jar:/srv/gump/public/workspace/ant/dist/lib/ant-jmf.jar:/srv/gump/public/workspace/ant/dist/lib/ant-swing.jar:/srv/gump/public/workspace/ant/dist/lib/ant-apache-resolver.jar:/srv/gump/public/workspace/ant/dist/lib/ant-apache-xalan2.jar:/srv/gump/public/workspace/ant/dist/lib/ant-trax.jar:/srv/gump/public/workspace/ant/dist/lib/ant-junit.jar:/srv/gump/public/workspace/ant/dist/lib/ant-launcher.jar:/srv/gump/public/workspace/ant/dist/lib/ant-nodeps.jar:/srv/gump/public/workspace/ant/dist/lib/ant.jar:/srv/gump/packages/cglib/cglib-nodep-2.1_3.jar:commons-net-gump-27052009.jar:/srv/gump/packages/easymock1.2_Java1.3/easymock.jar:/srv/gump/packages/easymockclassextension1.2/easymockclassextension.jar:/srv/gump/packages/emma-2.0.5312/lib/emma.jar:/srv/gump/packages/emma-2.0.5312/lib/emma_ant.jar:junit-gump-27052009.jar:/srv/gump/public/workspace/maven-emma-plugi
 n/target/maven-emma-plugin-29052009.jar:/srv/gump/packages/maven-site-plugin/maven-site-plugin-1.6.1.jar:/srv/gump/public/workspace/slf4j/slf4j-simple/target/slf4j-simple-1.5.7-SNAPSHOT.jar:/srv/gump/packages/spring-framework-1.2.6/dist/spring-beans.jar:/srv/gump/packages/spring-framework-1.2.6/dist/spring-core.jar:/srv/gump/packages/jsse1.0.3/lib/jcert.jar:/srv/gump/packages/jsse1.0.3/lib/jnet.jar:/srv/gump/packages/jsse1.0.3/lib/jsse.jar:/srv/gump/public/workspace/ant-contrib/target/ant-contrib-29052009.jar
---------------------------------------------
Tests run: 3, Failures: 0, Errors: 0, Skipped: 0, Time elapsed: 1.022 sec
Running org.apache.mina.core.IoBufferTest
Tests run: 29, Failures: 0, Errors: 0, Skipped: 0, Time elapsed: 1.154 sec
Running org.apache.mina.transport.socket.nio.DatagramConnectorTest
Tests run: 3, Failures: 0, Errors: 0, Skipped: 0, Time elapsed: 0.025 sec
Running org.apache.mina.handler.chain.ChainedIoHandlerTest
Tests run: 1, Failures: 0, Errors: 0, Skipped: 0, Time elapsed: 0.053 sec
Running org.apache.mina.filter.codec.CumulativeProtocolDecoderTest
Tests run: 4, Failures: 0, Errors: 0, Skipped: 0, Time elapsed: 0.027 sec
Running org.apache.mina.filter.keepalive.KeepAliveFilterTest
Tests run: 3, Failures: 0, Errors: 0, Skipped: 0, Time elapsed: 12.154 sec
Running org.apache.mina.transport.socket.nio.SocketBindTest
Tests run: 6, Failures: 0, Errors: 0, Skipped: 0, Time elapsed: 4.867 sec
Running org.apache.mina.core.IoFilterChainTest
Tests run: 8, Failures: 0, Errors: 0, Skipped: 0, Time elapsed: 0.022 sec
Running org.apache.mina.util.byteaccess.ByteAccessTest
Tests run: 14, Failures: 0, Errors: 0, Skipped: 0, Time elapsed: 0.189 sec
Running org.apache.mina.filter.codec.serialization.ObjectSerializationTest
Tests run: 2, Failures: 0, Errors: 0, Skipped: 0, Time elapsed: 0.021 sec
Running org.apache.mina.core.FutureTest
Tests run: 7, Failures: 0, Errors: 0, Skipped: 0, Time elapsed: 0.06 sec
Running org.apache.mina.filter.firewall.SubnetIPv6Test
Tests run: 1, Failures: 0, Errors: 0, Skipped: 0, Time elapsed: 0.009 sec
Running org.apache.mina.filter.stream.StreamWriteFilterTest
Tests run: 8, Failures: 0, Errors: 0, Skipped: 0, Time elapsed: 1.045 sec
Running org.apache.mina.filter.firewall.SubnetIPv4Test
Tests run: 6, Failures: 0, Errors: 0, Skipped: 0, Time elapsed: 0.006 sec
Running org.apache.mina.transport.vmpipe.VmPipeBindTest
Tests run: 6, Failures: 0, Errors: 0, Skipped: 0, Time elapsed: 2.567 sec

Results :

Failed tests: 
  testOnlyRemoteAddress(org.apache.mina.filter.logging.MdcInjectionFilterTest)

Tests run: 182, Failures: 1, Errors: 0, Skipped: 0

[INFO] ------------------------------------------------------------------------
[ERROR] BUILD FAILURE
[INFO] ------------------------------------------------------------------------
[INFO] There are test failures.

Please refer to /srv/gump/public/workspace/mina/core/target/surefire-reports for the individual test results.
[INFO] ------------------------------------------------------------------------
[INFO] For more information, run Maven with the -e switch
[INFO] ------------------------------------------------------------------------
[INFO] Total time: 1 minute 59 seconds
[INFO] Finished at: Fri May 29 02:30:07 GMT-08:00 2009
[INFO] Final Memory: 22M/68M
[INFO] ------------------------------------------------------------------------
---------------------------------------------

To subscribe to this information via syndicated feeds:
- RSS: http://vmgump.apache.org/gump/public/mina/mina/rss.xml
- Atom: http://vmgump.apache.org/gump/public/mina/mina/atom.xml

============================== Gump Tracking Only ===
Produced by Gump version 2.3.
Gump Run 31000029052009, vmgump:vmgump-public:31000029052009
Gump E-mail Identifier (unique within run) #20.

*********************************************************** G U M P
[GUMP@vmgump]: Project rat-test (in module rat) failed
To whom it may engage...
        
This is an automated request, but not an unsolicited one. For 
more information please visit http://gump.apache.org/nagged.html, 
and/or contact the folk at general@gump.apache.org.

Project rat-test has an issue affecting its community integration.
This issue affects 1 projects,
 and has been outstanding for 106 runs.
The current state of this project is 'Failed', with reason 'Build Failed'.
For reference only, the following projects are affected by this:
    - rat-test :  Release Audit Tool


Full details are available at:
    http://vmgump.apache.org/gump/public/rat/rat-test/index.html

That said, some information snippets are provided here.

The following annotations (debug/informational/warning/error messages) were provided:
 -WARNING- Overriding Maven2 settings: [/srv/gump/public/workspace/rat/gump_mvn_settings.xml]
 -DEBUG- (Gump generated) Maven2 Settings in: /srv/gump/public/workspace/rat/gump_mvn_settings.xml
 -INFO- Failed with reason build failed
 -DEBUG- Maven POM in: /srv/gump/public/workspace/rat/pom.xml



The following work was performed:
http://vmgump.apache.org/gump/public/rat/rat-test/gump_work/build_rat_rat-test.html
Work Name: build_rat_rat-test (Type: Build)
Work ended in a state of : Failed
Elapsed: 1 min 57 secs
Command Line: mvn --batch-mode --settings /srv/gump/public/workspace/rat/gump_mvn_settings.xml package 
[Working Directory: /srv/gump/public/workspace/rat]
CLASSPATH: /usr/lib/jvm/java-6-sun/lib/tools.jar:/srv/gump/public/workspace/rat/apache-rat-tasks/target/apache-rat-tasks-0.7-SNAPSHOT.jar:/srv/gump/public/workspace/rat/apache-rat-core/target/apache-rat-core-0.7-SNAPSHOT.jar:/srv/gump/public/workspace/rat/apache-rat-plugin/target/apache-rat-plugin-0.7-SNAPSHOT.jar
---------------------------------------------
[INFO] Using 2 extractors.
[INFO] Applying extractor for language: java
[INFO] Extractor for language: java found 2 mojo descriptors.
[INFO] Applying extractor for language: bsh
[INFO] Extractor for language: bsh found 0 mojo descriptors.
[INFO] [resources:resources]
[INFO] Using 'UTF-8' encoding to copy filtered resources.
[INFO] Copying 1 resource
[INFO] Copying 1 resource
[INFO] Copying 2 resources to META-INF
[INFO] [compiler:compile]
[INFO] Nothing to compile - all classes are up to date
[INFO] [resources:testResources]
[INFO] Using 'UTF-8' encoding to copy filtered resources.
[INFO] skip non existing resourceDirectory /srv/gump/public/workspace/rat/apache-rat-plugin/src/test/resources
[INFO] Copying 0 resource
Downloading: http://localhost:8192/maven2/junit/junit/3.8.2/junit-3.8.2.jar
117K downloaded
[INFO] [compiler:testCompile]
[INFO] Nothing to compile - all classes are up to date
[INFO] [surefire:test]
[INFO] Surefire report directory: /srv/gump/public/workspace/rat/apache-rat-plugin/target/surefire-reports

-------------------------------------------------------
 T E S T S
-------------------------------------------------------
Running org.apache.rat.mp.RatCheckMojoTest
Tests run: 2, Failures: 0, Errors: 2, Skipped: 0, Time elapsed: 0.111 sec <<< FAILURE!

Results :

Tests in error: 
  testIt1(org.apache.rat.mp.RatCheckMojoTest)
  testIt2(org.apache.rat.mp.RatCheckMojoTest)

Tests run: 2, Failures: 0, Errors: 2, Skipped: 0

[INFO] ------------------------------------------------------------------------
[ERROR] BUILD FAILURE
[INFO] ------------------------------------------------------------------------
[INFO] There are test failures.

Please refer to /srv/gump/public/workspace/rat/apache-rat-plugin/target/surefire-reports for the individual test results.
[INFO] ------------------------------------------------------------------------
[INFO] For more information, run Maven with the -e switch
[INFO] ------------------------------------------------------------------------
[INFO] Total time: 1 minute 55 seconds
[INFO] Finished at: Fri May 29 02:37:27 GMT-08:00 2009
[INFO] Final Memory: 18M/35M
[INFO] ------------------------------------------------------------------------
---------------------------------------------

To subscribe to this information via syndicated feeds:
- RSS: http://vmgump.apache.org/gump/public/rat/rat-test/rss.xml
- Atom: http://vmgump.apache.org/gump/public/rat/rat-test/atom.xml

============================== Gump Tracking Only ===
Produced by Gump version 2.3.
Gump Run 31000029052009, vmgump:vmgump-public:31000029052009
Gump E-mail Identifier (unique within run) #21.

*********************************************************** G U M P
[GUMP@vmgump]: Project cocoon (in module cocoon) failed
To whom it may engage...
        
This is an automated request, but not an unsolicited one. For 
more information please visit http://gump.apache.org/nagged.html, 
and/or contact the folk at general@gump.apache.org.

Project cocoon has an issue affecting its community integration.
This issue affects 1 projects,
 and has been outstanding for 981 runs.
The current state of this project is 'Failed', with reason 'Build Failed'.
For reference only, the following projects are affected by this:
    - cocoon :  Java XML Framework


Full details are available at:
    http://vmgump.apache.org/gump/public/cocoon/cocoon/index.html

That said, some information snippets are provided here.

The following annotations (debug/informational/warning/error messages) were provided:
 -INFO- Optional dependency htmlunit prerequisite failed with reason build failed
 -INFO- Optional dependency rhino prerequisite failed with reason build failed
 -INFO- Optional dependency xom prerequisite failed with reason build failed
 -INFO- Optional dependency jaxen prerequisite failed with reason build failed
 -INFO- Optional dependency dom4j prerequisite failed with reason build failed
 -INFO- Optional dependency excalibur-datasource prerequisite failed with reason build failed
 -INFO- Optional dependency excalibur-pool-instrumented prerequisite failed with reason build failed
 -INFO- Optional dependency xml-fop prerequisite failed with reason build failed
 -INFO- Optional dependency commons-httpclient prerequisite failed with reason build failed
 -INFO- Optional dependency commons-codec prerequisite failed with reason build failed
 -INFO- Optional dependency commons-validator prerequisite failed with reason build failed
 -INFO- Optional dependency commons-digester prerequisite failed with reason build failed
 -INFO- Optional dependency commons-jxpath prerequisite failed with reason build failed
 -INFO- Optional dependency commons-beanutils prerequisite failed with reason build failed
 -INFO- Optional dependency commons-io prerequisite failed with reason build failed
 -INFO- Optional dependency xmlunit prerequisite failed with reason build failed
 -INFO- Optional dependency commons-jexl prerequisite failed with reason build failed
 -INFO- Optional dependency junit failed with reason build failed
 -DEBUG- (Gump generated) Maven2 Settings in: /srv/gump/public/workspace/cocoon/gump_mvn_settings.xml
 -INFO- Failed with reason build failed
 -DEBUG- Maven POM in: /srv/gump/public/workspace/cocoon/pom.xml



The following work was performed:
http://vmgump.apache.org/gump/public/cocoon/cocoon/gump_work/build_cocoon_cocoon.html
Work Name: build_cocoon_cocoon (Type: Build)
Work ended in a state of : Failed
Elapsed: 3 mins 11 secs
Command Line: mvn --batch-mode --settings /srv/gump/public/workspace/cocoon/gump_mvn_settings.xml package 
[Working Directory: /srv/gump/public/workspace/cocoon]
CLASSPATH: /usr/lib/jvm/java-6-sun/lib/tools.jar:junit-gump-27052009.jar:/srv/gump/public/workspace/apache-commons/lang/target/commons-lang-3.0-SNAPSHOT.jar:/srv/gump/public/workspace/ant/dist/lib/ant-jmf.jar:/srv/gump/public/workspace/ant/dist/lib/ant-swing.jar:/srv/gump/public/workspace/ant/dist/lib/ant-apache-resolver.jar:/srv/gump/public/workspace/ant/dist/lib/ant-apache-xalan2.jar:/srv/gump/public/workspace/ant/dist/lib/ant-trax.jar:/srv/gump/public/workspace/ant/dist/lib/ant-junit.jar:/srv/gump/public/workspace/ant/dist/lib/ant-launcher.jar:/srv/gump/public/workspace/ant/dist/lib/ant-nodeps.jar:/srv/gump/public/workspace/ant/dist/lib/ant.jar:/srv/gump/public/workspace/aopalliance/build/aopalliance.jar:/srv/gump/packages/bsh-2.0b4/bsh-commands-2.0b4.jar:/srv/gump/packages/bsh-2.0b4/bsh-classpath-2.0b4.jar:/srv/gump/packages/bsh-2.0b4/bsh-core-2.0b4.jar:/srv/gump/packages/bsh-2.0b4/bsh-bsf-2.0b4.jar:/srv/gump/packages/bsh-2.0b4/bsh-2.0b4.jar:/srv/gump/packages/bsh-2.0b4/b
 sh-reflect-2.0b4.jar:/srv/gump/packages/bsh-2.0b4/bsh-util-2.0b4.jar:commons-beanutils-gump-27052009.jar:commons-codec-gump-27052009.jar:/srv/gump/public/workspace/apache-commons/collections/build/commons-collections-29052009.jar:/srv/gump/public/workspace/apache-commons/configuration/target/commons-configuration-1.7-SNAPSHOT.jar:commons-digester-gump-27052009.jar:commons-httpclient-gump-27052009.jar:commons-io-gump-27052009.jar:commons-jexl-gump-27052009.jar:commons-jxpath-gump-27052009.jar:/srv/gump/public/workspace/apache-commons/logging/target/commons-logging-29052009.jar:/srv/gump/public/workspace/apache-commons/logging/target/commons-logging-api-29052009.jar:commons-validator-gump-27052009.jar:/srv/gump/packages/dougLea/concurrent.jar:dom4j-gump-27052009.jar:excalibur-datasource-gump-27052009.jar:excalibur-pool-instrumented-gump-27052009.jar:/srv/gump/public/workspace/hsqldb/lib/hsqldb.jar:/srv/gump/public/workspace/htmlunit/target/htmlunit-29052009.jar:/srv/gump/publi
 c/workspace/jakarta-oro/jakarta-oro-29052009.jar:/srv/gump/public/workspace/jakarta-regexp/build/jakarta-regexp-29052009.jar:jaxen-gump-27052009.jar:/srv/gump/public/workspace/jdom/build/jdom.jar:/srv/gump/public/workspace/jmock/build/dist/jmock-core-29052009.jar:/srv/gump/public/workspace/jmock/build/dist/jmock-cglib-29052009.jar:/srv/gump/packages/jtidy-04aug2000r7-dev/build/Tidy.jar:/srv/gump/public/workspace/logging-log4j-12/dist/lib/log4j-29052009.jar:/srv/gump/packages/nekohtml-0.9.5/nekohtml.jar:js-gump-27052009.jar:/srv/gump/public/workspace/velocity-engine/bin/velocity-29052009.jar:/srv/gump/public/workspace/velocity-engine/bin/velocity-29052009-dep.jar:/srv/gump/public/workspace/xml-commons/java/external/build/xml-apis-ext.jar:/srv/gump/public/workspace/xml-commons/java/external/build/xml-apis.jar:/srv/gump/public/workspace/xml-batik/batik-29052009/lib/batik-util.jar:/srv/gump/public/workspace/xml-batik/batik-29052009/lib/batik-swing.jar:/srv/gump/public/workspace/
 xml-batik/batik-29052009/lib/batik-css.jar:/srv/gump/public/workspace/xml-batik/batik-29052009/lib/batik-bridge.jar:/srv/gump/public/workspace/xml-batik/batik-29052009/lib/batik-xml.jar:/srv/gump/public/workspace/xml-batik/batik-29052009/lib/batik-svg-dom.jar:/srv/gump/public/workspace/xml-batik/batik-29052009/lib/batik-awt-util.jar:/srv/gump/public/workspace/xml-batik/batik-29052009/lib/batik-transcoder.jar:/srv/gump/public/workspace/xml-batik/batik-29052009/lib/batik-gui-util.jar:/srv/gump/public/workspace/xml-batik/batik-29052009/lib/batik-dom.jar:/srv/gump/public/workspace/xml-batik/batik-29052009/lib/batik-ext.jar:/srv/gump/public/workspace/xml-batik/batik-29052009/lib/batik-script.jar:/srv/gump/public/workspace/xml-batik/batik-29052009/lib/batik-svggen.jar:/srv/gump/public/workspace/xml-batik/batik-29052009/lib/batik-parser.jar:/srv/gump/public/workspace/xml-batik/batik-29052009/lib/batik-extension.jar:/srv/gump/public/workspace/xml-batik/batik-29052009/lib/batik-gvt.j
 ar:fop-gump-27052009.jar:/srv/gump/public/workspace/xml-commons/java/build/resolver.jar:/srv/gump/public/workspace/xml-xerces2/build/xercesImpl.jar:xmlunit-sumo-gump-27052009.jar:xmlunit-legacy-gump-27052009.jar:xmlunit-core-gump-27052009.jar:/srv/gump/public/workspace/xom/build/xom-29052009.jar
---------------------------------------------
Downloading: http://localhost:8192/maven2/org/apache/maven/maven-repository-metadata/2.0.1/maven-repository-metadata-2.0.1.jar
19K downloaded
Downloading: http://people.apache.org/~gkossakowski/maven2/repository/org/apache/maven/wagon/wagon-provider-api/1.0-alpha-5/wagon-provider-api-1.0-alpha-5.jar
Downloading: http://localhost:8192/maven2/org/apache/maven/wagon/wagon-provider-api/1.0-alpha-5/wagon-provider-api-1.0-alpha-5.jar
50K downloaded
Downloading: http://localhost:8192/maven2/org/apache/maven/plugins/maven-war-plugin/2.0.2/maven-war-plugin-2.0.2.jar
27K downloaded
Downloading: http://people.apache.org/~gkossakowski/maven2/repository/org/apache/maven/maven-archiver/2.2/maven-archiver-2.2.jar
Downloading: http://localhost:8192/maven2/org/apache/maven/maven-archiver/2.2/maven-archiver-2.2.jar
9K downloaded
Downloading: http://localhost:8192/maven2/javax/servlet/servlet-api/2.4/servlet-api-2.4.jar
95K downloaded
[INFO] [plugin:descriptor]
[WARNING] 

Goal prefix is specified as: 'cocoon'. Maven currently expects it to be 'cocoon'.

[INFO] Using 2 extractors.
[INFO] Applying extractor for language: java
[INFO] Extractor for language: java found 4 mojo descriptors.
[INFO] Applying extractor for language: bsh
[INFO] Extractor for language: bsh found 0 mojo descriptors.
[INFO] [resources:resources]
[WARNING] Using platform encoding (UTF-8 actually) to copy filtered resources, i.e. build is platform dependent!
[INFO] Copying 7 resources
[INFO] Copying 2 resources to META-INF
[INFO] [compiler:compile]
[INFO] Compiling 24 source files to /srv/gump/public/workspace/cocoon/tools/cocoon-maven-plugin/target/classes
[INFO] ------------------------------------------------------------------------
[ERROR] BUILD FAILURE
[INFO] ------------------------------------------------------------------------
[INFO] Compilation failure
/srv/gump/public/workspace/cocoon/tools/cocoon-maven-plugin/src/main/java/org/apache/cocoon/maven/rcl/PrepareWebappMojo.java:[285,8] cannot access org.apache.commons.lang.exception.NestableException
class file for org.apache.commons.lang.exception.NestableException not found
        try {



/srv/gump/public/workspace/cocoon/tools/cocoon-maven-plugin/src/main/java/org/apache/cocoon/maven/rcl/PrepareWebappMojo.java:[285,8] cannot access org.apache.commons.lang.exception.NestableException
class file for org.apache.commons.lang.exception.NestableException not found
        try {


[INFO] ------------------------------------------------------------------------
[INFO] For more information, run Maven with the -e switch
[INFO] ------------------------------------------------------------------------
[INFO] Total time: 3 minutes 9 seconds
[INFO] Finished at: Fri May 29 02:48:06 GMT-08:00 2009
[INFO] Final Memory: 49M/95M
[INFO] ------------------------------------------------------------------------
---------------------------------------------

To subscribe to this information via syndicated feeds:
- RSS: http://vmgump.apache.org/gump/public/cocoon/cocoon/rss.xml
- Atom: http://vmgump.apache.org/gump/public/cocoon/cocoon/atom.xml

============================== Gump Tracking Only ===
Produced by Gump version 2.3.
Gump Run 31000029052009, vmgump:vmgump-public:31000029052009
Gump E-mail Identifier (unique within run) #23.

*********************************************************** G U M P
[GUMP@vmgump]: Project kerberos-common (in module kerberos-shared) failed
To whom it may engage...
        
This is an automated request, but not an unsolicited one. For 
more information please visit http://gump.apache.org/nagged.html, 
and/or contact the folk at general@gump.apache.org.

Project kerberos-common has an issue affecting its community integration.
This issue affects 1 projects,
 and has been outstanding for 38 runs.
The current state of this project is 'Failed', with reason 'Build Failed'.
For reference only, the following projects are affected by this:
    - kerberos-common :  Apache Directory Project


Full details are available at:
    http://vmgump.apache.org/gump/public/kerberos-shared/kerberos-common/index.html

That said, some information snippets are provided here.

The following annotations (debug/informational/warning/error messages) were provided:
 -DEBUG- Sole output [kerberos-common-29052009.jar] identifier set to project name
 -DEBUG- (Gump generated) Maven2 Settings in: /srv/gump/public/workspace/kerberos-shared/gump_mvn_settings.xml
 -INFO- Failed with reason build failed
 -DEBUG- Maven POM in: /srv/gump/public/workspace/kerberos-shared/pom.xml
 -INFO- Project Reports in: /srv/gump/public/workspace/kerberos-shared/common/target/test-reports
 -WARNING- No directory [/srv/gump/public/workspace/kerberos-shared/common/target/test-reports]
 -INFO- Failed to extract fallback artifacts from Gump Repository



The following work was performed:
http://vmgump.apache.org/gump/public/kerberos-shared/kerberos-common/gump_work/build_kerberos-shared_kerberos-common.html
Work Name: build_kerberos-shared_kerberos-common (Type: Build)
Work ended in a state of : Failed
Elapsed: 1 sec
Command Line: mvn --batch-mode --settings /srv/gump/public/workspace/kerberos-shared/gump_mvn_settings.xml package 
[Working Directory: /srv/gump/public/workspace/kerberos-shared]
CLASSPATH: /usr/lib/jvm/java-6-sun/lib/tools.jar:/srv/gump/public/workspace/directory-shared/asn1/target/shared-asn1-0.9.15-SNAPSHOT.jar:/srv/gump/packages/bouncycastle-jdk14/bcprov-130.jar:/srv/gump/public/workspace/directory-shared/ldap/target/shared-ldap-0.9.15-SNAPSHOT.jar
---------------------------------------------
	at org.apache.maven.cli.MavenCli.main(MavenCli.java:301)
	at sun.reflect.NativeMethodAccessorImpl.invoke0(Native Method)
	at sun.reflect.NativeMethodAccessorImpl.invoke(NativeMethodAccessorImpl.java:39)
	at sun.reflect.DelegatingMethodAccessorImpl.invoke(DelegatingMethodAccessorImpl.java:25)
	at java.lang.reflect.Method.invoke(Method.java:597)
	at org.codehaus.classworlds.Launcher.launchEnhanced(Launcher.java:315)
	at org.codehaus.classworlds.Launcher.launch(Launcher.java:255)
	at org.codehaus.classworlds.Launcher.mainWithExitCode(Launcher.java:430)
	at org.codehaus.classworlds.Launcher.main(Launcher.java:375)
Caused by: org.apache.maven.project.ProjectBuildingException: Cannot find parent: org.apache.directory.server:apacheds-parent for project: null:apacheds-kerberos-shared:jar:null for project null:apacheds-kerberos-shared:jar:null
	at org.apache.maven.project.DefaultMavenProjectBuilder.assembleLineage(DefaultMavenProjectBuilder.java:1369)
	at org.apache.maven.project.DefaultMavenProjectBuilder.buildInternal(DefaultMavenProjectBuilder.java:820)
	at org.apache.maven.project.DefaultMavenProjectBuilder.buildFromSourceFileInternal(DefaultMavenProjectBuilder.java:505)
	at org.apache.maven.project.DefaultMavenProjectBuilder.build(DefaultMavenProjectBuilder.java:197)
	at org.apache.maven.DefaultMaven.getProject(DefaultMaven.java:583)
	at org.apache.maven.DefaultMaven.collectProjects(DefaultMaven.java:461)
	at org.apache.maven.DefaultMaven.getProjects(DefaultMaven.java:365)
	... 11 more
Caused by: org.apache.maven.project.ProjectBuildingException: POM 'org.apache.directory.server:apacheds-parent' not found in repository: Unable to download the artifact from any repository

  org.apache.directory.server:apacheds-parent:pom:1.5.5-SNAPSHOT

from the specified remote repositories:
  gump-central (http://localhost:8192/maven2)

 for project org.apache.directory.server:apacheds-parent
	at org.apache.maven.project.DefaultMavenProjectBuilder.findModelFromRepository(DefaultMavenProjectBuilder.java:602)
	at org.apache.maven.project.DefaultMavenProjectBuilder.assembleLineage(DefaultMavenProjectBuilder.java:1365)
	... 17 more
Caused by: org.apache.maven.artifact.resolver.ArtifactNotFoundException: Unable to download the artifact from any repository

  org.apache.directory.server:apacheds-parent:pom:1.5.5-SNAPSHOT

from the specified remote repositories:
  gump-central (http://localhost:8192/maven2)


	at org.apache.maven.artifact.resolver.DefaultArtifactResolver.resolve(DefaultArtifactResolver.java:212)
	at org.apache.maven.artifact.resolver.DefaultArtifactResolver.resolve(DefaultArtifactResolver.java:74)
	at org.apache.maven.project.DefaultMavenProjectBuilder.findModelFromRepository(DefaultMavenProjectBuilder.java:555)
	... 18 more
Caused by: org.apache.maven.wagon.ResourceDoesNotExistException: Unable to download the artifact from any repository
	at org.apache.maven.artifact.manager.DefaultWagonManager.getArtifact(DefaultWagonManager.java:332)
	at org.apache.maven.artifact.resolver.DefaultArtifactResolver.resolve(DefaultArtifactResolver.java:200)
	... 20 more
[INFO] ------------------------------------------------------------------------
[INFO] Total time: < 1 second
[INFO] Finished at: Fri May 29 02:49:12 GMT-08:00 2009
[INFO] Final Memory: 1M/4M
[INFO] ------------------------------------------------------------------------
---------------------------------------------

To subscribe to this information via syndicated feeds:
- RSS: http://vmgump.apache.org/gump/public/kerberos-shared/kerberos-common/rss.xml
- Atom: http://vmgump.apache.org/gump/public/kerberos-shared/kerberos-common/atom.xml

============================== Gump Tracking Only ===
Produced by Gump version 2.3.
Gump Run 31000029052009, vmgump:vmgump-public:31000029052009
Gump E-mail Identifier (unique within run) #24.

*********************************************************** G U M P
[GUMP@vmgump]: Project tapestry (in module tapestry) failed
To whom it may engage...
        
This is an automated request, but not an unsolicited one. For 
more information please visit http://gump.apache.org/nagged.html, 
and/or contact the folk at general@gump.apache.org.

Project tapestry has an issue affecting its community integration.
This issue affects 1 projects,
 and has been outstanding for 957 runs.
The current state of this project is 'Failed', with reason 'Build Failed'.
For reference only, the following projects are affected by this:
    - tapestry :  Component-based web application framework organized around i...


Full details are available at:
    http://vmgump.apache.org/gump/public/tapestry/tapestry/index.html

That said, some information snippets are provided here.

The following annotations (debug/informational/warning/error messages) were provided:
 -DEBUG- Sole output [tapestry-29052009.jar] identifier set to project name
 -INFO- Optional dependency commons-codec prerequisite failed with reason build failed
 -INFO- Optional dependency commons-digester prerequisite failed with reason build failed
 -INFO- Optional dependency commons-digester prerequisite failed with reason build failed
 -INFO- Optional dependency commons-fileupload prerequisite failed with reason build failed
 -INFO- Optional dependency commons-beanutils prerequisite failed with reason build failed
 -INFO- Optional dependency commons-io prerequisite failed with reason build failed
 -DEBUG- (Gump generated) Maven2 Settings in: /srv/gump/public/workspace/tapestry/gump_mvn_settings.xml
 -INFO- Failed with reason build failed
 -DEBUG- Maven POM in: /srv/gump/public/workspace/tapestry/pom.xml
 -INFO- Failed to extract fallback artifacts from Gump Repository



The following work was performed:
http://vmgump.apache.org/gump/public/tapestry/tapestry/gump_work/build_tapestry_tapestry.html
Work Name: build_tapestry_tapestry (Type: Build)
Work ended in a state of : Failed
Elapsed: 2 mins 23 secs
Command Line: mvn --batch-mode --settings /srv/gump/public/workspace/tapestry/gump_mvn_settings.xml package 
[Working Directory: /srv/gump/public/workspace/tapestry]
CLASSPATH: /usr/lib/jvm/java-6-sun/lib/tools.jar:commons-beanutils-gump-27052009.jar:commons-codec-gump-27052009.jar:commons-digester-gump-27052009.jar:commons-fileupload-gump-27052009.jar:commons-io-gump-27052009.jar:/srv/gump/public/workspace/apache-commons/lang/target/commons-lang-3.0-SNAPSHOT.jar:/srv/gump/public/workspace/apache-commons/logging/target/commons-logging-29052009.jar:/srv/gump/public/workspace/apache-commons/logging/target/commons-logging-api-29052009.jar:/srv/gump/packages/easymock1.2_Java1.3/easymock.jar:/srv/gump/packages/easymockclassextension1.2/easymockclassextension.jar:/srv/gump/public/workspace/jakarta-oro/jakarta-oro-29052009.jar:/srv/gump/public/workspace/jakarta-servletapi-4/lib/servlet.jar:/srv/gump/public/workspace/javassist/javassist.jar:/srv/gump/public/workspace/jdom/build/jdom.jar:/srv/gump/public/workspace/logging-log4j-12/dist/lib/log4j-29052009.jar:/srv/gump/packages/ognl-2.6.7/ognl-2.6.7.jar:/srv/gump/public/workspace/xml-commons/java/e
 xternal/build/xml-apis-ext.jar:/srv/gump/packages/jCharts-0.7.5/jCharts-0.7.5.jar
---------------------------------------------
location: class org.apache.tapestry.services.impl.HiveMindExpressionCompiler

/srv/gump/public/workspace/tapestry/tapestry-framework/src/java/org/apache/tapestry/services/impl/HiveMindExpressionCompiler.java:[425,21] cannot find symbol
symbol  : method getRootExpression(ognl.Node,java.lang.Object,ognl.OgnlContext)
location: class org.apache.tapestry.services.impl.HiveMindExpressionCompiler

/srv/gump/public/workspace/tapestry/tapestry-framework/src/java/org/apache/tapestry/listener/ListenerMapPropertyAccessor.java:[81,20] cannot find symbol
symbol  : method getPropertyClass(ognl.OgnlContext,java.lang.Object,java.lang.Object)
location: class ognl.ObjectPropertyAccessor

/srv/gump/public/workspace/tapestry/tapestry-framework/src/java/org/apache/tapestry/listener/ListenerMapPropertyAccessor.java:[91,36] cannot find symbol
symbol  : method getCompiler()
location: class ognl.OgnlRuntime

/srv/gump/public/workspace/tapestry/tapestry-framework/src/java/org/apache/tapestry/listener/ListenerMapPropertyAccessor.java:[93,12] cannot find symbol
symbol  : variable ExpressionCompiler
location: class org.apache.tapestry.listener.ListenerMapPropertyAccessor

/srv/gump/public/workspace/tapestry/tapestry-framework/src/java/org/apache/tapestry/listener/ListenerMapPropertyAccessor.java:[95,19] cannot find symbol
symbol  : method setCurrentAccessor(java.lang.Class)
location: class ognl.OgnlContext

/srv/gump/public/workspace/tapestry/tapestry-framework/src/java/org/apache/tapestry/listener/ListenerMapPropertyAccessor.java:[96,19] cannot find symbol
symbol  : method setCurrentType(java.lang.Class)
location: class ognl.OgnlContext

/srv/gump/public/workspace/tapestry/tapestry-framework/src/java/org/apache/tapestry/listener/ListenerMapPropertyAccessor.java:[101,20] cannot find symbol
symbol  : method getSourceAccessor(ognl.OgnlContext,java.lang.Object,java.lang.Object)
location: class ognl.ObjectPropertyAccessor

/srv/gump/public/workspace/tapestry/tapestry-framework/src/java/org/apache/tapestry/listener/ListenerMapPropertyAccessor.java:[106,18] cannot find symbol
symbol  : class UnsupportedCompilationException
location: class org.apache.tapestry.listener.ListenerMapPropertyAccessor

/srv/gump/public/workspace/tapestry/tapestry-framework/src/java/org/apache/tapestry/binding/ExpressionBinding.java:[135,45] cannot find symbol
symbol  : method getAccessor()
location: interface ognl.Node

/srv/gump/public/workspace/tapestry/tapestry-framework/src/java/org/apache/tapestry/binding/ExpressionBinding.java:[210,53] cannot find symbol
symbol  : method getAccessor()
location: interface ognl.Node


[INFO] ------------------------------------------------------------------------
[INFO] For more information, run Maven with the -e switch
[INFO] ------------------------------------------------------------------------
[INFO] Total time: 2 minutes 22 seconds
[INFO] Finished at: Fri May 29 02:52:06 GMT-08:00 2009
[INFO] Final Memory: 12M/58M
[INFO] ------------------------------------------------------------------------
---------------------------------------------

To subscribe to this information via syndicated feeds:
- RSS: http://vmgump.apache.org/gump/public/tapestry/tapestry/rss.xml
- Atom: http://vmgump.apache.org/gump/public/tapestry/tapestry/atom.xml

============================== Gump Tracking Only ===
Produced by Gump version 2.3.
Gump Run 31000029052009, vmgump:vmgump-public:31000029052009
Gump E-mail Identifier (unique within run) #25.


--
Apache Gump
http://gump.apache.org/ [Instance: vmgump]

---------------------------------------------------------------------
To unsubscribe, e-mail: general-unsubscribe@gump.apache.org
For additional commands, e-mail: general-help@gump.apache.org


Mime
View raw message