gump-general mailing list archives

Site index · List index
Message view « Date » · « Thread »
Top « Date » · « Thread »
From g...@vmgump.apache.org
Subject BATCH: All dressed up, with nowhere to go...
Date Sat, 04 Apr 2009 00:07:05 GMT
Dear Gumpmeisters,
            
The following 3 notifys should have been sent

*********************************************************** G U M P
[GUMP@vmgump]: Project authx-script-test (in module authx) failed
[GUMP@vmgump]: Project naming-config-test (in module directory-naming) failed
[GUMP@vmgump]: Project httpcomponents-core-tests (in module httpcomponents) failed
*********************************************************** G U M P
[GUMP@vmgump]: Project authx-script-test (in module authx) failed
To whom it may engage...
        
This is an automated request, but not an unsolicited one. For 
more information please visit http://gump.apache.org/nagged.html, 
and/or contact the folk at general@gump.apache.org.

Project authx-script-test has an issue affecting its community integration.
This issue affects 1 projects.
The current state of this project is 'Failed', with reason 'Build Failed'.
For reference only, the following projects are affected by this:
    - authx-script-test :  Apache Authentication and Authorization Framework


Full details are available at:
    http://vmgump.apache.org/gump/public/authx/authx-script-test/index.html

That said, some information snippets are provided here.

The following annotations (debug/informational/warning/error messages) were provided:
 -DEBUG- Dependency on xml-xerces exists, no need to add for property maven.jar.xercesImpl.
 -DEBUG- Dependency on asm exists, no need to add for property maven.jar.asm-util.
 -DEBUG- Dependency on packaged-jmock exists, no need to add for property maven.jar.jmock.
 -WARNING- Overriding Maven properties: [/srv/gump/public/workspace/authx/script/build.properties]
 -DEBUG- (Gump generated) Maven Properties in: /srv/gump/public/workspace/authx/script/build.properties
 -INFO- Failed with reason build failed
 -DEBUG- Maven POM in: /srv/gump/public/workspace/authx/script/project.xml
 -DEBUG- Maven project properties in: /srv/gump/public/workspace/authx/script/project.properties
 -INFO- Project Reports in: /srv/gump/public/workspace/authx/script/target/test-reports



The following work was performed:
http://vmgump.apache.org/gump/public/authx/authx-script-test/gump_work/build_authx_authx-script-test.html
Work Name: build_authx_authx-script-test (Type: Build)
Work ended in a state of : Failed
Elapsed: 5 secs
Command Line: maven --offline test 
[Working Directory: /srv/gump/public/workspace/authx/script]
CLASSPATH: /usr/lib/jvm/java-6-sun/lib/tools.jar:/srv/gump/public/workspace/asm/output/dist/lib/asm-util-03042009.jar:/srv/gump/public/workspace/authx/core/target/authx-core-03042009.jar:/srv/gump/public/workspace/dom4j/build/dom4j.jar:/srv/gump/packages/groovy-1.0-jsr-03/groovy-1.0-jsr-03.jar:/srv/gump/packages/jmock/jmock-1.0.1.jar:/srv/gump/packages/picocontainer-1.1/picocontainer-1.1.jar:/srv/gump/public/workspace/xml-commons/java/external/build/xml-apis-ext.jar:/srv/gump/public/workspace/authx/script/target/authx-script-03042009.jar
---------------------------------------------
java:prepare-filesystem:

java:compile:
    [echo] Compiling to /srv/gump/public/workspace/authx/script/target/classes

java:jar-resources:

test:prepare-filesystem:

test:test-resources:
Copying 4 files to /srv/gump/public/workspace/authx/script/target/test-classes

test:compile:
    [javac] Compiling 17 source files to /srv/gump/public/workspace/authx/script/target/test-classes

test:test:
    [junit] Running org.apache.authx.script.groovy.GroovyRuleLoaderTest
    [junit] Tests run: 1, Failures: 0, Errors: 1, Time elapsed: 0.084 sec
    [junit] [ERROR] TEST org.apache.authx.script.groovy.GroovyRuleLoaderTest FAILED
    [junit] Running org.apache.authx.script.groovy.GroovyScriptClassLoaderTest
    [junit] Tests run: 2, Failures: 0, Errors: 2, Time elapsed: 0.04 sec
    [junit] [ERROR] TEST org.apache.authx.script.groovy.GroovyScriptClassLoaderTest FAILED
    [junit] Running org.apache.authx.script.xml.Dom4JGroupBuilderTest
    [junit] Tests run: 4, Failures: 0, Errors: 0, Time elapsed: 0.149 sec
    [junit] Running org.apache.authx.script.xml.Dom4JRealmBuilderTest
    [junit] Tests run: 2, Failures: 0, Errors: 0, Time elapsed: 0.118 sec
    [junit] Running org.apache.authx.script.xml.Dom4JRuleSetBuilderTest
    [junit] Tests run: 10, Failures: 0, Errors: 0, Time elapsed: 0.122 sec
    [junit] Running org.apache.authx.script.xml.Dom4JRoleBuilderTest
    [junit] Tests run: 3, Failures: 0, Errors: 0, Time elapsed: 0.114 sec
    [junit] Running org.apache.authx.script.common.PicoContainerFactoryTest
    [junit] Tests run: 2, Failures: 0, Errors: 0, Time elapsed: 0.052 sec
    [junit] Running org.apache.authx.script.common.DynamicRuleProxyTest
    [junit] Tests run: 1, Failures: 0, Errors: 1, Time elapsed: 0.03 sec
    [junit] [ERROR] TEST org.apache.authx.script.common.DynamicRuleProxyTest FAILED
    [junit] Running org.apache.authx.script.common.ScriptedRuleSetBuilderTest
    [junit] Tests run: 1, Failures: 0, Errors: 0, Time elapsed: 0.046 sec
    [junit] Running org.apache.authx.script.common.SmartCachingScriptClassLoaderTest
    [junit] Tests run: 2, Failures: 0, Errors: 2, Time elapsed: 0.041 sec
    [junit] [ERROR] TEST org.apache.authx.script.common.SmartCachingScriptClassLoaderTest
FAILED

BUILD FAILED
File...... /home/gump/.maven/cache/maven-test-plugin-1.6.2/plugin.jelly
Element... fail
Line...... 181
Column.... 54
There were test failures.
Total time: 5 seconds
Finished at: Fri Apr 03 18:22:51 GMT-08:00 2009

---------------------------------------------

To subscribe to this information via syndicated feeds:
- RSS: http://vmgump.apache.org/gump/public/authx/authx-script-test/rss.xml
- Atom: http://vmgump.apache.org/gump/public/authx/authx-script-test/atom.xml

============================== Gump Tracking Only ===
Produced by Gump version 2.3.
Gump Run 14001603042009, vmgump:vmgump-public:14001603042009
Gump E-mail Identifier (unique within run) #1.

*********************************************************** G U M P
[GUMP@vmgump]: Project naming-config-test (in module directory-naming) failed
To whom it may engage...
        
This is an automated request, but not an unsolicited one. For 
more information please visit http://gump.apache.org/nagged.html, 
and/or contact the folk at general@gump.apache.org.

Project naming-config-test has an issue affecting its community integration.
This issue affects 1 projects.
The current state of this project is 'Failed', with reason 'Build Failed'.
For reference only, the following projects are affected by this:
    - naming-config-test :  Apache Directory Naming Component


Full details are available at:
    http://vmgump.apache.org/gump/public/directory-naming/naming-config-test/index.html

That said, some information snippets are provided here.

The following annotations (debug/informational/warning/error messages) were provided:
 -WARNING- Overriding Maven properties: [/srv/gump/public/workspace/directory-naming/naming-config/build.properties]
 -DEBUG- (Gump generated) Maven Properties in: /srv/gump/public/workspace/directory-naming/naming-config/build.properties
 -INFO- Failed with reason build failed
 -DEBUG- Maven POM in: /srv/gump/public/workspace/directory-naming/naming-config/project.xml
 -DEBUG- Maven project properties in: /srv/gump/public/workspace/directory-naming/naming-config/project.properties
 -INFO- Project Reports in: /srv/gump/public/workspace/directory-naming/naming-config/target/test-reports



The following work was performed:
http://vmgump.apache.org/gump/public/directory-naming/naming-config-test/gump_work/build_directory-naming_naming-config-test.html
Work Name: build_directory-naming_naming-config-test (Type: Build)
Work ended in a state of : Failed
Elapsed: 6 secs
Command Line: maven --offline test 
[Working Directory: /srv/gump/public/workspace/directory-naming/naming-config]
CLASSPATH: /usr/lib/jvm/java-6-sun/lib/tools.jar:/srv/gump/public/workspace/apache-commons/beanutils/dist/commons-beanutils-03042009.jar:/srv/gump/public/workspace/apache-commons/collections/build/commons-collections-03042009.jar:/srv/gump/public/workspace/apache-commons/dbcp/dist/commons-dbcp.jar:/srv/gump/public/workspace/apache-commons/digester/dist/commons-digester.jar:/srv/gump/public/workspace/apache-commons/lang/target/commons-lang-3.0-SNAPSHOT.jar:/srv/gump/public/workspace/apache-commons/logging/target/commons-logging-03042009.jar:/srv/gump/public/workspace/apache-commons/logging/target/commons-logging-api-03042009.jar:/srv/gump/public/workspace/apache-commons/pool/dist/commons-pool.jar:/srv/gump/public/workspace/hsqldb/lib/hsqldb.jar:/srv/gump/public/workspace/junit/dist/junit-03042009.jar:/srv/gump/public/workspace/directory-naming/naming-config/target/naming-config-03042009.jar:/srv/gump/public/workspace/directory-naming/naming-core/target/naming-core-03042009.jar
 :/srv/gump/public/workspace/directory-naming/naming-factory/target/naming-factory-03042009.jar:/srv/gump/public/workspace/directory-naming/naming-java/target/naming-java-03042009.jar:/srv/gump/packages/maven-site-plugin/maven-site-plugin-1.6.1.jar
---------------------------------------------
 __  __
|  \/  |__ _Apache__ ___
| |\/| / _` \ V / -_) ' \  ~ intelligent projects ~
|_|  |_\__,_|\_/\___|_||_|  v. 1.0.2

You are working offline so the build will continue, but naming-core-0.9-SNAPSHOT.jar may be
out of date!
You are working offline so the build will continue, but naming-factory-0.9-SNAPSHOT.jar may
be out of date!
You are working offline so the build will continue, but naming-java-0.9-SNAPSHOT.jar may be
out of date!
build:start:

java:prepare-filesystem:

java:compile:
    [echo] Compiling to /srv/gump/public/workspace/directory-naming/naming-config/target/classes

java:jar-resources:

test:prepare-filesystem:

test:test-resources:
Copying 5 files to /srv/gump/public/workspace/directory-naming/naming-config/target/test-classes

test:compile:
    [javac] Compiling 1 source file to /srv/gump/public/workspace/directory-naming/naming-config/target/test-classes

test:test:
    [junit] Running org.apache.naming.config.XmlConfiguratorTest
    [junit] Tests run: 5, Failures: 0, Errors: 5, Time elapsed: 0.551 sec
    [junit] [ERROR] TEST org.apache.naming.config.XmlConfiguratorTest FAILED

BUILD FAILED
File...... /home/gump/.maven/cache/maven-test-plugin-1.6.2/plugin.jelly
Element... fail
Line...... 181
Column.... 54
There were test failures.
Total time: 5 seconds
Finished at: Fri Apr 03 19:04:42 GMT-08:00 2009

---------------------------------------------

To subscribe to this information via syndicated feeds:
- RSS: http://vmgump.apache.org/gump/public/directory-naming/naming-config-test/rss.xml
- Atom: http://vmgump.apache.org/gump/public/directory-naming/naming-config-test/atom.xml

============================== Gump Tracking Only ===
Produced by Gump version 2.3.
Gump Run 14001603042009, vmgump:vmgump-public:14001603042009
Gump E-mail Identifier (unique within run) #2.

*********************************************************** G U M P
[GUMP@vmgump]: Project httpcomponents-core-tests (in module httpcomponents) failed
To whom it may engage...
        
This is an automated request, but not an unsolicited one. For 
more information please visit http://gump.apache.org/nagged.html, 
and/or contact the folk at general@gump.apache.org.

Project httpcomponents-core-tests has an issue affecting its community integration.
This issue affects 1 projects.
The current state of this project is 'Failed', with reason 'Build Timed Out'.
For reference only, the following projects are affected by this:
    - httpcomponents-core-tests :  Unit Tests for HttpComponents Core


Full details are available at:
    http://vmgump.apache.org/gump/public/httpcomponents/httpcomponents-core-tests/index.html

That said, some information snippets are provided here.

The following annotations (debug/informational/warning/error messages) were provided:
 -WARNING- Overriding Maven2 settings: [/srv/gump/public/workspace/httpcomponents/httpcore/gump_mvn_settings.xml]
 -DEBUG- (Gump generated) Maven2 Settings in: /srv/gump/public/workspace/httpcomponents/httpcore/gump_mvn_settings.xml
 -INFO- Failed with reason build timed out
 -DEBUG- Maven POM in: /srv/gump/public/workspace/httpcomponents/httpcore/pom.xml
 -INFO- Project Reports in: /srv/gump/public/workspace/httpcomponents/httpcore/httpcore/target/surefire-reports



The following work was performed:
http://vmgump.apache.org/gump/public/httpcomponents/httpcomponents-core-tests/gump_work/build_httpcomponents_httpcomponents-core-tests.html
Work Name: build_httpcomponents_httpcomponents-core-tests (Type: Build)
Work ended in a state of : Failed
Elapsed: 60 mins
Command Line: mvn --batch-mode --settings /srv/gump/public/workspace/httpcomponents/httpcore/gump_mvn_settings.xml
test 
[Working Directory: /srv/gump/public/workspace/httpcomponents/httpcore]
CLASSPATH: /usr/lib/jvm/java-6-sun/lib/tools.jar:/srv/gump/public/workspace/httpcomponents/httpcore/httpcore-nio/target/httpcore-nio-4.1-SNAPSHOT.jar:/srv/gump/public/workspace/httpcomponents/httpcore/httpcore/target/httpcore-4.1-SNAPSHOT.jar:/srv/gump/public/workspace/junit/dist/junit-03042009.jar:/srv/gump/packages/jsse1.0.3/lib/jcert.jar:/srv/gump/packages/jsse1.0.3/lib/jnet.jar:/srv/gump/packages/jsse1.0.3/lib/jsse.jar
---------------------------------------------
Running org.apache.http.message.TestRequestLine
Tests run: 3, Failures: 0, Errors: 0, Skipped: 0, Time elapsed: 0.005 sec
Running org.apache.http.impl.entity.TestEntityDeserializer
Tests run: 13, Failures: 0, Errors: 0, Skipped: 0, Time elapsed: 0.008 sec
Running org.apache.http.message.TestBasicMessages
Tests run: 7, Failures: 0, Errors: 0, Skipped: 0, Time elapsed: 0.005 sec

Results :

Tests run: 416, Failures: 0, Errors: 0, Skipped: 0

[INFO] ------------------------------------------------------------------------
[INFO] Building HttpCore NIO
[INFO]    task-segment: [test]
[INFO] ------------------------------------------------------------------------
[INFO] [remote-resources:process {execution: default}]
[INFO] [resources:resources]
[INFO] Using 'UTF-8' encoding to copy filtered resources.
[INFO] Copying 0 resource
[INFO] Copying 1 resource
[INFO] Copying 3 resources
[INFO] [compiler:compile]
[INFO] Nothing to compile - all classes are up to date
[INFO] [resources:testResources]
[INFO] Using 'UTF-8' encoding to copy filtered resources.
[INFO] Copying 1 resource
[INFO] Copying 3 resources
[INFO] [compiler:testCompile]
[INFO] Compiling 33 source files to /srv/gump/public/workspace/httpcomponents/httpcore/httpcore-nio/target/test-classes
[INFO] [surefire:test]
[INFO] Surefire report directory: /srv/gump/public/workspace/httpcomponents/httpcore/httpcore-nio/target/surefire-reports

-------------------------------------------------------
 T E S T S
-------------------------------------------------------
Running org.apache.http.nio.protocol.TestNIOSSLHttp
Tests run: 5, Failures: 0, Errors: 0, Skipped: 0, Time elapsed: 4.85 sec
Running org.apache.http.impl.nio.reactor.TestDefaultListeningIOReactor
Tests run: 3, Failures: 0, Errors: 0, Skipped: 0, Time elapsed: 0.557 sec
Running org.apache.http.nio.protocol.TestJob
Tests run: 0, Failures: 0, Errors: 0, Skipped: 0, Time elapsed: 0.002 sec
Running org.apache.http.nio.protocol.TestBufferingNHttpHandlers
Tests run: 5, Failures: 0, Errors: 0, Skipped: 0, Time elapsed: 0.439 sec
Running org.apache.http.impl.nio.reactor.TestDefaultIOReactors
Tests run: 4, Failures: 0, Errors: 0, Skipped: 0, Time elapsed: 3.064 sec
Running org.apache.http.impl.nio.codecs.TestIdentityDecoder
Tests run: 8, Failures: 0, Errors: 0, Skipped: 0, Time elapsed: 0.017 sec
Running org.apache.http.impl.nio.codecs.TestLengthDelimitedEncoder
Tests run: 9, Failures: 0, Errors: 0, Skipped: 0, Time elapsed: 0.072 sec
Running org.apache.http.impl.nio.reactor.TestDefaultIOReactorsSSL
---------------------------------------------

To subscribe to this information via syndicated feeds:
- RSS: http://vmgump.apache.org/gump/public/httpcomponents/httpcomponents-core-tests/rss.xml
- Atom: http://vmgump.apache.org/gump/public/httpcomponents/httpcomponents-core-tests/atom.xml

============================== Gump Tracking Only ===
Produced by Gump version 2.3.
Gump Run 14001603042009, vmgump:vmgump-public:14001603042009
Gump E-mail Identifier (unique within run) #3.


--
Apache Gump
http://gump.apache.org/ [Instance: vmgump]

---------------------------------------------------------------------
To unsubscribe, e-mail: general-unsubscribe@gump.apache.org
For additional commands, e-mail: general-help@gump.apache.org


Mime
View raw message