gump-general mailing list archives

Site index · List index
Message view « Date » · « Thread »
Top « Date » · « Thread »
From g...@vmgump.apache.org
Subject BATCH: All dressed up, with nowhere to go...
Date Thu, 08 Jan 2009 03:49:37 GMT
Dear Gumpmeisters,
            
The following 62 notifys should have been sent

*********************************************************** G U M P
[GUMP@vmgump]: Project authx-core (in module authx) failed
[GUMP@vmgump]: Project naming-core (in module directory-naming) failed
[GUMP@vmgump]: Project naming-java (in module directory-naming) failed
[GUMP@vmgump]: Project apr-iconv-configure (in module apr-iconv) failed
[GUMP@vmgump]: Project naming-resources (in module directory-naming) failed
[GUMP@vmgump]: Project naming-factory (in module directory-naming) failed
[GUMP@vmgump]: Project logging-log4cxx-configure (in module logging-log4cxx) failed
[GUMP@vmgump]: Project struts-sslext (in module struts-sslext) failed
[GUMP@vmgump]: Project commons-jci (in module commons-sandbox) failed
[GUMP@vmgump]: Module jakarta-tomcat-5 success, but with warnings.
[GUMP@vmgump]: Module james-mailet success, but with warnings.
[GUMP@vmgump]: Project jmock2 (in module jmock2) failed
[GUMP@vmgump]: Project naming-config (in module directory-naming) failed
[GUMP@vmgump]: Project strutstestcase (in module strutstestcase) failed
[GUMP@vmgump]: Project ws-commons-xmlschema (in module ws-axis2-commons) failed
[GUMP@vmgump]: Project authx-jdbc (in module authx) failed
[GUMP@vmgump]: Project beepcore (in module beepcore) failed
[GUMP@vmgump]: Project dotnet-antlib-test (in module ant-antlibs) failed
[GUMP@vmgump]: Project nlog4j (in module nlog4j) failed
[GUMP@vmgump]: Module town failed
[GUMP@vmgump]: Project anakia (in module anakia) failed
[GUMP@vmgump]: Project castor (in module castor) failed
[GUMP@vmgump]: Project emma (in module emma) failed
[GUMP@vmgump]: Project jtidy-cvs (in module jtidy) failed
[GUMP@vmgump]: Project portals-pluto-api-1.0 (in module portals-pluto-1.0) failed
[GUMP@vmgump]: Project portals-pluto-descriptors-1.0 (in module portals-pluto-1.0) failed
[GUMP@vmgump]: Project xml-security-tests (in module xml-security) failed
[GUMP@vmgump]: Project apache-httpd-configure (in module apache-httpd) failed
[GUMP@vmgump]: Project portals-bridges-common (in module portals-bridges) failed
[GUMP@vmgump]: Project portals-bridges-struts (in module portals-bridges) failed
[GUMP@vmgump]: Project portals-pluto-container-1.0 (in module portals-pluto-1.0) failed
[GUMP@vmgump]: Project portals-pluto-portal-1.0 (in module portals-pluto-1.0) failed
[GUMP@vmgump]: Module jakarta-bsf success, but with warnings.
[GUMP@vmgump]: Project apacheds-shared (in module apacheds) failed
[GUMP@vmgump]: Module jakarta-tomcat success, but with warnings.
[GUMP@vmgump]: Project hivemind (in module hivemind) failed
[GUMP@vmgump]: Project naming-management (in module directory-naming) failed
[GUMP@vmgump]: Project tapestry (in module tapestry) failed
[GUMP@vmgump]: Project slide-webdavlib (in module jakarta-slide) failed
[GUMP@vmgump]: Project derby (in module db-derby) failed
[GUMP@vmgump]: Project lucene-java (in module lucene-java) failed
[GUMP@vmgump]: Project kerberos-common (in module kerberos-shared) failed
[GUMP@vmgump]: Project JacORB-idllib (in module JacORB) failed
[GUMP@vmgump]: Project jetty (in module jetty) failed
[GUMP@vmgump]: Project eyebrowse (in module eyebrowse) failed
[GUMP@vmgump]: Module smartfrog success, but with warnings.
[GUMP@vmgump]: Project xstream (in module xstream) failed
[GUMP@vmgump]: Project ws-commons-axiom (in module ws-axis2-commons) failed
[GUMP@vmgump]: Module groovy success, but with warnings.
[GUMP@vmgump]: Project groovy (in module groovy) failed
[GUMP@vmgump]: Project ws-commons-policy (in module ws-axis2-commons) failed
[GUMP@vmgump]: Project htmlunit (in module htmlunit) failed
[GUMP@vmgump]: Project mina (in module mina) failed
[GUMP@vmgump]: Project invicta (in module invicta) failed
[GUMP@vmgump]: Project portals-bridges-frameworks (in module portals-bridges) failed
[GUMP@vmgump]: Project cocoon (in module cocoon) failed
[GUMP@vmgump]: Project maven-bootstrap (in module maven) failed
[GUMP@vmgump]: Project JacORB (in module JacORB) failed
[GUMP@vmgump]: Project lenya (in module lenya) failed
[GUMP@vmgump]: Project maven (in module maven) failed
[GUMP@vmgump]: Project apacheds-core (in module apacheds) failed
[GUMP@vmgump]: Project apacheds-main (in module apacheds) failed
*********************************************************** G U M P
[GUMP@vmgump]: Project authx-core (in module authx) failed
To whom it may engage...
        
This is an automated request, but not an unsolicited one. For 
more information please visit http://gump.apache.org/nagged.html, 
and/or contact the folk at general@gump.apache.org.

Project authx-core has an issue affecting its community integration.
This issue affects 1 projects,
 and has been outstanding for 339 runs.
The current state of this project is 'Failed', with reason 'Configuration Failed'.
For reference only, the following projects are affected by this:
    - authx-core :  Apache Authentication and Authorization Framework


Full details are available at:
    http://vmgump.apache.org/gump/public/authx/authx-core/index.html

That said, some information snippets are provided here.

The following annotations (debug/informational/warning/error messages) were provided:
 -DEBUG- Sole output [authx-core-08012009.jar] identifier set to project name
 -DEBUG- Dependency on packaged-jmock exists, no need to add for property maven.jar.jmock.
 -INFO- Failed with reason configuration failed
 -ERROR- Bad Dependency. Project: commons-collections : unknown to *this* workspace 
 -DEBUG- Extracted fallback artifacts from Gump Repository

To subscribe to this information via syndicated feeds:
- RSS: http://vmgump.apache.org/gump/public/authx/authx-core/rss.xml
- Atom: http://vmgump.apache.org/gump/public/authx/authx-core/atom.xml

============================== Gump Tracking Only ===
Produced by Gump version 2.3.
Gump Run 15000008012009, vmgump:vmgump-public:15000008012009
Gump E-mail Identifier (unique within run) #4.

*********************************************************** G U M P
[GUMP@vmgump]: Project naming-core (in module directory-naming) failed
To whom it may engage...
        
This is an automated request, but not an unsolicited one. For 
more information please visit http://gump.apache.org/nagged.html, 
and/or contact the folk at general@gump.apache.org.

Project naming-core has an issue affecting its community integration.
This issue affects 1 projects,
 and has been outstanding for 196 runs.
The current state of this project is 'Failed', with reason 'Configuration Failed'.
For reference only, the following projects are affected by this:
    - naming-core :  Apache Directory Naming Component


Full details are available at:
    http://vmgump.apache.org/gump/public/directory-naming/naming-core/index.html

That said, some information snippets are provided here.

The following annotations (debug/informational/warning/error messages) were provided:
 -DEBUG- Sole output [naming-core-08012009.jar] identifier set to project name
 -INFO- Failed with reason configuration failed
 -ERROR- Bad Dependency. Project: commons-logging : unknown to *this* workspace 
 -DEBUG- Extracted fallback artifacts from Gump Repository

To subscribe to this information via syndicated feeds:
- RSS: http://vmgump.apache.org/gump/public/directory-naming/naming-core/rss.xml
- Atom: http://vmgump.apache.org/gump/public/directory-naming/naming-core/atom.xml

============================== Gump Tracking Only ===
Produced by Gump version 2.3.
Gump Run 15000008012009, vmgump:vmgump-public:15000008012009
Gump E-mail Identifier (unique within run) #6.

*********************************************************** G U M P
[GUMP@vmgump]: Project naming-java (in module directory-naming) failed
To whom it may engage...
        
This is an automated request, but not an unsolicited one. For 
more information please visit http://gump.apache.org/nagged.html, 
and/or contact the folk at general@gump.apache.org.

Project naming-java has an issue affecting its community integration.
This issue affects 1 projects,
 and has been outstanding for 196 runs.
The current state of this project is 'Failed', with reason 'Configuration Failed'.
For reference only, the following projects are affected by this:
    - naming-java :  Apache Directory Naming Component


Full details are available at:
    http://vmgump.apache.org/gump/public/directory-naming/naming-java/index.html

That said, some information snippets are provided here.

The following annotations (debug/informational/warning/error messages) were provided:
 -DEBUG- Sole output [naming-java-08012009.jar] identifier set to project name
 -INFO- Failed with reason configuration failed
 -ERROR- Bad Dependency. Project: commons-logging : unknown to *this* workspace 
 -DEBUG- Extracted fallback artifacts from Gump Repository

To subscribe to this information via syndicated feeds:
- RSS: http://vmgump.apache.org/gump/public/directory-naming/naming-java/rss.xml
- Atom: http://vmgump.apache.org/gump/public/directory-naming/naming-java/atom.xml

============================== Gump Tracking Only ===
Produced by Gump version 2.3.
Gump Run 15000008012009, vmgump:vmgump-public:15000008012009
Gump E-mail Identifier (unique within run) #7.

*********************************************************** G U M P
[GUMP@vmgump]: Project apr-iconv-configure (in module apr-iconv) failed
To whom it may engage...
        
This is an automated request, but not an unsolicited one. For 
more information please visit http://gump.apache.org/nagged.html, 
and/or contact the folk at general@gump.apache.org.

Project apr-iconv-configure has an issue affecting its community integration.
This issue affects 2 projects,
 and has been outstanding for 13 runs.
The current state of this project is 'Failed', with reason 'Build Failed'.
For reference only, the following projects are affected by this:
    - apr-iconv-configure :  Apache Portable Runtime
    - apr-iconv-make :  Apache Portable Runtime


Full details are available at:
    http://vmgump.apache.org/gump/public/apr-iconv/apr-iconv-configure/index.html

That said, some information snippets are provided here.

The following annotations (debug/informational/warning/error messages) were provided:
 -INFO- Failed with reason build failed



The following work was performed:
http://vmgump.apache.org/gump/public/apr-iconv/apr-iconv-configure/gump_work/buildscript_apr-iconv_apr-iconv-configure.html
Work Name: buildscript_apr-iconv_apr-iconv-configure (Type: Build)
Work ended in a state of : Failed
Elapsed: 1 sec
Command Line: /srv/gump/public/workspace/apr-iconv/configure --with-apr=/srv/gump/public/workspace/apr/dest-08012009 --prefix=/srv/gump/public/workspace/apr-iconv/dest-08012009 
[Working Directory: /srv/gump/public/workspace/apr-iconv]
---------------------------------------------
checking for gawk... no
checking for mawk... mawk
checking for a BSD-compatible install... /usr/bin/install -c
checking for APR... configure: error: the --with-apr parameter is incorrect. It must specify an install prefix, a build directory, or an apr-config file.
---------------------------------------------

To subscribe to this information via syndicated feeds:
- RSS: http://vmgump.apache.org/gump/public/apr-iconv/apr-iconv-configure/rss.xml
- Atom: http://vmgump.apache.org/gump/public/apr-iconv/apr-iconv-configure/atom.xml

============================== Gump Tracking Only ===
Produced by Gump version 2.3.
Gump Run 15000008012009, vmgump:vmgump-public:15000008012009
Gump E-mail Identifier (unique within run) #8.

*********************************************************** G U M P
[GUMP@vmgump]: Project naming-resources (in module directory-naming) failed
To whom it may engage...
        
This is an automated request, but not an unsolicited one. For 
more information please visit http://gump.apache.org/nagged.html, 
and/or contact the folk at general@gump.apache.org.

Project naming-resources has an issue affecting its community integration.
This issue affects 1 projects,
 and has been outstanding for 196 runs.
The current state of this project is 'Failed', with reason 'Configuration Failed'.
For reference only, the following projects are affected by this:
    - naming-resources :  Apache Directory Naming Component


Full details are available at:
    http://vmgump.apache.org/gump/public/directory-naming/naming-resources/index.html

That said, some information snippets are provided here.

The following annotations (debug/informational/warning/error messages) were provided:
 -DEBUG- Sole output [naming-resources-08012009.jar] identifier set to project name
 -INFO- Failed with reason configuration failed
 -ERROR- Bad Dependency. Project: commons-logging : unknown to *this* workspace 
 -DEBUG- Extracted fallback artifacts from Gump Repository

To subscribe to this information via syndicated feeds:
- RSS: http://vmgump.apache.org/gump/public/directory-naming/naming-resources/rss.xml
- Atom: http://vmgump.apache.org/gump/public/directory-naming/naming-resources/atom.xml

============================== Gump Tracking Only ===
Produced by Gump version 2.3.
Gump Run 15000008012009, vmgump:vmgump-public:15000008012009
Gump E-mail Identifier (unique within run) #9.

*********************************************************** G U M P
[GUMP@vmgump]: Project naming-factory (in module directory-naming) failed
To whom it may engage...
        
This is an automated request, but not an unsolicited one. For 
more information please visit http://gump.apache.org/nagged.html, 
and/or contact the folk at general@gump.apache.org.

Project naming-factory has an issue affecting its community integration.
This issue affects 1 projects,
 and has been outstanding for 196 runs.
The current state of this project is 'Failed', with reason 'Configuration Failed'.
For reference only, the following projects are affected by this:
    - naming-factory :  Apache Directory Naming Component


Full details are available at:
    http://vmgump.apache.org/gump/public/directory-naming/naming-factory/index.html

That said, some information snippets are provided here.

The following annotations (debug/informational/warning/error messages) were provided:
 -DEBUG- Sole output [naming-factory-08012009.jar] identifier set to project name
 -DEBUG- Dependency on javamail exists, no need to add for property maven.jar.geronimo-spec-javamail.
 -INFO- Failed with reason configuration failed
 -ERROR- Bad Dependency. Project: commons-logging : unknown to *this* workspace 
 -DEBUG- Extracted fallback artifacts from Gump Repository

To subscribe to this information via syndicated feeds:
- RSS: http://vmgump.apache.org/gump/public/directory-naming/naming-factory/rss.xml
- Atom: http://vmgump.apache.org/gump/public/directory-naming/naming-factory/atom.xml

============================== Gump Tracking Only ===
Produced by Gump version 2.3.
Gump Run 15000008012009, vmgump:vmgump-public:15000008012009
Gump E-mail Identifier (unique within run) #10.

*********************************************************** G U M P
[GUMP@vmgump]: Project logging-log4cxx-configure (in module logging-log4cxx) failed
To whom it may engage...
        
This is an automated request, but not an unsolicited one. For 
more information please visit http://gump.apache.org/nagged.html, 
and/or contact the folk at general@gump.apache.org.

Project logging-log4cxx-configure has an issue affecting its community integration.
This issue affects 3 projects,
 and has been outstanding for 13 runs.
The current state of this project is 'Failed', with reason 'Build Failed'.
For reference only, the following projects are affected by this:
    - logging-log4cxx-configure :  Apache log4cxx
    - logging-log4cxx-make :  Apache log4cxx
    - logging-log4cxx-make-install :  Apache log4cxx


Full details are available at:
    http://vmgump.apache.org/gump/public/logging-log4cxx/logging-log4cxx-configure/index.html

That said, some information snippets are provided here.

The following annotations (debug/informational/warning/error messages) were provided:
 -DEBUG- Dependency on apr-make-install exists, no need to add for property --with-apr.
 -DEBUG- Dependency on apr-util-make-install exists, no need to add for property --with-apr-util.
 -INFO- Failed with reason build failed



The following work was performed:
http://vmgump.apache.org/gump/public/logging-log4cxx/logging-log4cxx-configure/gump_work/buildscript_logging-log4cxx_logging-log4cxx-configure.html
Work Name: buildscript_logging-log4cxx_logging-log4cxx-configure (Type: Build)
Work ended in a state of : Failed
Elapsed: 32 secs
Command Line: /srv/gump/public/workspace/logging-log4cxx/configure --with-apr-util=/srv/gump/public/workspace/apr-util --with-apr=/srv/gump/public/workspace/apr --prefix=/srv/gump/public/workspace/logging-log4cxx/dest-08012009 
[Working Directory: /srv/gump/public/workspace/logging-log4cxx]
---------------------------------------------
checking for ifort... no
checking for ifc... no
checking for efc... no
checking for pgf95... no
checking for lf95... no
checking for ftn... no
checking whether we are using the GNU Fortran 77 compiler... no
checking whether  accepts -g... no
checking the maximum length of command line arguments... 32768
checking command to parse /usr/bin/nm -B output from ccache gcc object... ok
checking for objdir... .libs
checking for ar... ar
checking for ranlib... ranlib
checking for strip... strip
checking if ccache gcc supports -fno-rtti -fno-exceptions... no
checking for ccache gcc option to produce PIC... -fPIC
checking if ccache gcc PIC flag -fPIC works... yes
checking if ccache gcc static flag -static works... yes
checking if ccache gcc supports -c -o file.o... yes
checking whether the ccache gcc linker (/usr/bin/ld) supports shared libraries... yes
checking whether -lc should be explicitly linked in... no
checking dynamic linker characteristics... cat: /etc/ld.so.conf.d/*.conf: No such file or directory
GNU/Linux ld.so
checking how to hardcode library paths into programs... immediate
checking whether stripping libraries is possible... yes
checking if libtool supports shared libraries... yes
checking whether to build shared libraries... yes
checking whether to build static libraries... yes
configure: creating libtool
appending configuration tag "CXX" to libtool
checking for ld used by ccache g++... /usr/bin/ld
checking if the linker (/usr/bin/ld) is GNU ld... yes
checking whether the ccache g++ linker (/usr/bin/ld) supports shared libraries... yes
checking for ccache g++ option to produce PIC... -fPIC
checking if ccache g++ PIC flag -fPIC works... yes
checking if ccache g++ static flag -static works... yes
checking if ccache g++ supports -c -o file.o... yes
checking whether the ccache g++ linker (/usr/bin/ld) supports shared libraries... yes
checking dynamic linker characteristics... cat: /etc/ld.so.conf.d/*.conf: No such file or directory
GNU/Linux ld.so
checking how to hardcode library paths into programs... immediate
appending configuration tag "F77" to libtool
checking for a BSD-compatible install... /usr/bin/install -c
checking whether make sets $(MAKE)... (cached) yes
checking whether we are using the GNU C++ compiler... (cached) yes
checking whether ccache g++ accepts -g... (cached) yes
checking dependency style of ccache g++... (cached) gcc3
checking how to run the C++ preprocessor... ccache g++ -E
checking for doxygen... no
checking for APR... configure: error: the --with-apr parameter is incorrect. It must specify an install prefix, a build directory, or an apr-config file.
---------------------------------------------

To subscribe to this information via syndicated feeds:
- RSS: http://vmgump.apache.org/gump/public/logging-log4cxx/logging-log4cxx-configure/rss.xml
- Atom: http://vmgump.apache.org/gump/public/logging-log4cxx/logging-log4cxx-configure/atom.xml

============================== Gump Tracking Only ===
Produced by Gump version 2.3.
Gump Run 15000008012009, vmgump:vmgump-public:15000008012009
Gump E-mail Identifier (unique within run) #11.

*********************************************************** G U M P
[GUMP@vmgump]: Project struts-sslext (in module struts-sslext) failed
To whom it may engage...
        
This is an automated request, but not an unsolicited one. For 
more information please visit http://gump.apache.org/nagged.html, 
and/or contact the folk at general@gump.apache.org.

Project struts-sslext has an issue affecting its community integration.
This issue affects 1 projects,
 and has been outstanding for 41 runs.
The current state of this project is 'Failed', with reason 'Configuration Failed'.
For reference only, the following projects are affected by this:
    - struts-sslext :  The Struts SSL Extension for HTTP/HTTPS switching


Full details are available at:
    http://vmgump.apache.org/gump/public/struts-sslext/struts-sslext/index.html

That said, some information snippets are provided here.

The following annotations (debug/informational/warning/error messages) were provided:
 -DEBUG- Sole output [sslext.jar] identifier set to project name
 -INFO- Failed with reason configuration failed
 -ERROR- Bad Dependency. Project: commons-digester : unknown to *this* workspace 
 -ERROR- Bad Dependency. Project: commons-logging : unknown to *this* workspace 
 -INFO- Failed to extract fallback artifacts from Gump Repository

To subscribe to this information via syndicated feeds:
- RSS: http://vmgump.apache.org/gump/public/struts-sslext/struts-sslext/rss.xml
- Atom: http://vmgump.apache.org/gump/public/struts-sslext/struts-sslext/atom.xml

============================== Gump Tracking Only ===
Produced by Gump version 2.3.
Gump Run 15000008012009, vmgump:vmgump-public:15000008012009
Gump E-mail Identifier (unique within run) #16.

*********************************************************** G U M P
[GUMP@vmgump]: Project commons-jci (in module commons-sandbox) failed
To whom it may engage...
        
This is an automated request, but not an unsolicited one. For 
more information please visit http://gump.apache.org/nagged.html, 
and/or contact the folk at general@gump.apache.org.

Project commons-jci has an issue affecting its community integration.
This issue affects 1 projects,
 and has been outstanding for 624 runs.
The current state of this project is 'Failed', with reason 'Build Failed'.
For reference only, the following projects are affected by this:
    - commons-jci :  Commons JCI


Full details are available at:
    http://vmgump.apache.org/gump/public/commons-sandbox/commons-jci/index.html

That said, some information snippets are provided here.

The following annotations (debug/informational/warning/error messages) were provided:
 -DEBUG- Sole output [commons-jci-08012009.jar] identifier set to project name
 -WARNING- Bad *Optional* Dependency. Project: commons-collections : unknown to *this* workspace
 -WARNING- Bad *Optional* Dependency. Project: commons-io : unknown to *this* workspace
 -WARNING- Bad *Optional* Dependency. Project: commons-lang : unknown to *this* workspace
 -WARNING- Bad *Optional* Dependency. Project: commons-logging : unknown to *this* workspace
 -INFO- Making directory for Maven2 settings: [/srv/gump/public/workspace/commons-sandbox/jci]
 -DEBUG- (Gump generated) Maven2 Settings in: /srv/gump/public/workspace/commons-sandbox/jci/gump_mvn_settings.xml
 -INFO- Failed with reason build failed
 -INFO- Failed to extract fallback artifacts from Gump Repository



The following work was performed:
http://vmgump.apache.org/gump/public/commons-sandbox/commons-jci/gump_work/build_commons-sandbox_commons-jci.html
Work Name: build_commons-sandbox_commons-jci (Type: Build)
Work ended in a state of : Failed
Elapsed: 3 secs
Command Line: mvn --batch-mode --settings /srv/gump/public/workspace/commons-sandbox/jci/gump_mvn_settings.xml package 
[Working Directory: /srv/gump/public/workspace/commons-sandbox/jci]
CLASSPATH: /usr/lib/jvm/java-1.5.0-sun/lib/tools.jar:/srv/gump/public/workspace/jakarta-bcel/target/bcel-5.3-SNAPSHOT.jar:/srv/gump/packages/eclipse-3.1M6/plugins/org.eclipse.jdt.core_3.1.0/jdtcore.jar:/srv/gump/packages/janino-2.3.8/lib/janino.jar:/srv/gump/packages/jarjar/jarjar-0.6.jar:/srv/gump/public/workspace/asm/output/dist/lib/asm-analysis-08012009.jar:/srv/gump/public/workspace/asm/output/dist/lib/asm-util-08012009.jar:/srv/gump/public/workspace/asm/output/dist/lib/asm-xml-08012009.jar:/srv/gump/public/workspace/asm/output/dist/lib/asm-commons-08012009.jar:/srv/gump/public/workspace/asm/output/dist/lib/asm-08012009.jar:/srv/gump/public/workspace/asm/output/dist/lib/asm-tree-08012009.jar:/srv/gump/packages/antlr-2.7.6/antlr.jar:/srv/gump/packages/groovy-1.0-jsr-03/groovy-1.0-jsr-03.jar:/srv/gump/packages/maven-cobertura-plugin/maven-cobertura-plugin-1.1.jar
---------------------------------------------
[INFO] Scanning for projects...
[INFO] ------------------------------------------------------------------------
[INFO] Building Maven Default Project
[INFO]    task-segment: [package]
[INFO] ------------------------------------------------------------------------
[INFO] ------------------------------------------------------------------------
[ERROR] BUILD ERROR
[INFO] ------------------------------------------------------------------------
[INFO] Cannot execute mojo: resources. It requires a project with an existing pom.xml, but the build is not using one.
[INFO] ------------------------------------------------------------------------
[INFO] For more information, run Maven with the -e switch
[INFO] ------------------------------------------------------------------------
[INFO] Total time: 1 second
[INFO] Finished at: Thu Jan 08 01:22:16 GMT-08:00 2009
[INFO] Final Memory: 3M/5M
[INFO] ------------------------------------------------------------------------
---------------------------------------------

To subscribe to this information via syndicated feeds:
- RSS: http://vmgump.apache.org/gump/public/commons-sandbox/commons-jci/rss.xml
- Atom: http://vmgump.apache.org/gump/public/commons-sandbox/commons-jci/atom.xml

============================== Gump Tracking Only ===
Produced by Gump version 2.3.
Gump Run 15000008012009, vmgump:vmgump-public:15000008012009
Gump E-mail Identifier (unique within run) #19.

*********************************************************** G U M P
[GUMP@vmgump]: Module jakarta-tomcat-5 success, but with warnings.
To whom it may engage...
        
This is an automated request, but not an unsolicited one. For 
more information please visit http://gump.apache.org/nagged.html, 
and/or contact the folk at general@gump.apache.org.

Module jakarta-tomcat-5 contains errors.
The current state of this module is 'Success'.

Full details are available at:
    http://vmgump.apache.org/gump/public/jakarta-tomcat-5/index.html

That said, some information snippets are provided here.

The following annotations (debug/informational/warning/error messages) were provided:
 -ERROR- *** Failed to update from source control. Stale contents ***



The following work was performed:
http://vmgump.apache.org/gump/public/jakarta-tomcat-5/gump_work/update_jakarta-tomcat-5.html
Work Name: update_jakarta-tomcat-5 (Type: Update)
Work ended in a state of : Failed
Elapsed: 
Command Line: svn --quiet update --non-interactive jakarta-tomcat-5 
[Working Directory: /srv/gump/public/workspace/cvs]
---------------------------------------------
svn: Working copy 'jakarta-tomcat-5' locked
svn: run 'svn cleanup' to remove locks (type 'svn help cleanup' for details)
---------------------------------------------

To subscribe to this information via syndicated feeds:
- RSS: http://vmgump.apache.org/gump/public/jakarta-tomcat-5/rss.xml
- Atom: http://vmgump.apache.org/gump/public/jakarta-tomcat-5/atom.xml

============================== Gump Tracking Only ===
Produced by Gump version 2.3.
Gump Run 15000008012009, vmgump:vmgump-public:15000008012009
Gump E-mail Identifier (unique within run) #25.

*********************************************************** G U M P
[GUMP@vmgump]: Module james-mailet success, but with warnings.
To whom it may engage...
        
This is an automated request, but not an unsolicited one. For 
more information please visit http://gump.apache.org/nagged.html, 
and/or contact the folk at general@gump.apache.org.

Module james-mailet contains errors.
The current state of this module is 'Success'.

Full details are available at:
    http://vmgump.apache.org/gump/public/james-mailet/index.html

That said, some information snippets are provided here.

The following annotations (debug/informational/warning/error messages) were provided:
 -ERROR- *** Failed to update from source control. Stale contents ***



The following work was performed:
http://vmgump.apache.org/gump/public/james-mailet/gump_work/update_james-mailet.html
Work Name: update_james-mailet (Type: Update)
Work ended in a state of : Failed
Elapsed: 2 secs
Command Line: svn --quiet update --non-interactive james-mailet 
[Working Directory: /srv/gump/public/workspace/cvs]
---------------------------------------------
svn: REPORT request failed on '/repos/asf/!svn/vcc/default'
svn: Target path does not exist
---------------------------------------------

To subscribe to this information via syndicated feeds:
- RSS: http://vmgump.apache.org/gump/public/james-mailet/rss.xml
- Atom: http://vmgump.apache.org/gump/public/james-mailet/atom.xml

============================== Gump Tracking Only ===
Produced by Gump version 2.3.
Gump Run 15000008012009, vmgump:vmgump-public:15000008012009
Gump E-mail Identifier (unique within run) #27.

*********************************************************** G U M P
[GUMP@vmgump]: Project jmock2 (in module jmock2) failed
To whom it may engage...
        
This is an automated request, but not an unsolicited one. For 
more information please visit http://gump.apache.org/nagged.html, 
and/or contact the folk at general@gump.apache.org.

Project jmock2 has an issue affecting its community integration.
This issue affects 1 projects,
 and has been outstanding for 196 runs.
The current state of this project is 'Failed', with reason 'Build Failed'.
For reference only, the following projects are affected by this:
    - jmock2 :  jMock is a library for testing Java code using mock objects.


Full details are available at:
    http://vmgump.apache.org/gump/public/jmock2/jmock2/index.html

That said, some information snippets are provided here.

The following annotations (debug/informational/warning/error messages) were provided:
 -INFO- Failed with reason build failed
 -INFO- Failed to extract fallback artifacts from Gump Repository



The following work was performed:
http://vmgump.apache.org/gump/public/jmock2/jmock2/gump_work/build_jmock2_jmock2.html
Work Name: build_jmock2_jmock2 (Type: Build)
Work ended in a state of : Failed
Elapsed: 8 secs
Command Line: /usr/lib/jvm/java-1.5.0-sun/bin/java -Djava.awt.headless=true -Xbootclasspath/p:/srv/gump/public/workspace/xml-xerces2/build/xercesImpl.jar:/srv/gump/public/workspace/xml-commons/java/external/build/xml-apis.jar org.apache.tools.ant.Main -Dgump.merge=/srv/gump/public/gump/work/merge.xml -Dbuild.sysclasspath=only -Dversion=08012009 
[Working Directory: /srv/gump/public/workspace/jmock2]
CLASSPATH: /usr/lib/jvm/java-1.5.0-sun/lib/tools.jar:/srv/gump/public/workspace/jmock2/build/classes:/srv/gump/public/workspace/jmock2/lib/objenesis-1.0.jar:/srv/gump/public/workspace/ant/dist/lib/ant-jmf.jar:/srv/gump/public/workspace/ant/dist/lib/ant-swing.jar:/srv/gump/public/workspace/ant/dist/lib/ant-apache-resolver.jar:/srv/gump/public/workspace/ant/dist/lib/ant-apache-xalan2.jar:/srv/gump/public/workspace/ant/dist/lib/ant-trax.jar:/srv/gump/public/workspace/ant/dist/lib/ant-junit.jar:/srv/gump/public/workspace/ant/dist/lib/ant-launcher.jar:/srv/gump/public/workspace/ant/dist/lib/ant-nodeps.jar:/srv/gump/public/workspace/ant/dist/lib/ant.jar:/srv/gump/packages/bsh-2.0b4/bsh-commands-2.0b4.jar:/srv/gump/packages/bsh-2.0b4/bsh-classpath-2.0b4.jar:/srv/gump/packages/bsh-2.0b4/bsh-core-2.0b4.jar:/srv/gump/packages/bsh-2.0b4/bsh-bsf-2.0b4.jar:/srv/gump/packages/bsh-2.0b4/bsh-2.0b4.jar:/srv/gump/packages/bsh-2.0b4/bsh-reflect-2.0b4.jar:/srv/gump/packages/bsh-2.0b4/bsh-util-2.
 0b4.jar:/srv/gump/packages/cglib/cglib-nodep-2.1_3.jar:/srv/gump/public/workspace/hamcrest/hamcrest-java/build/hamcrest-core-08012009.jar:/srv/gump/public/workspace/hamcrest/hamcrest-java/build/hamcrest-library-08012009.jar:/srv/gump/public/workspace/junit/dist/junit-08012009.jar:/srv/gump/packages/junit3.8.1/junit.jar:/srv/gump/public/workspace/xml-commons/java/external/build/xml-apis-ext.jar
---------------------------------------------
    [javac] location: class org.jmock.test.unit.lib.CurrentStateMatcherTest
    [javac]         assertTrue("should match", isNotCurrently("S").matches(stateMachine));
    [javac]         ^
    [javac] /srv/gump/public/workspace/jmock2/test/org/jmock/test/unit/lib/CurrentStateMatcherTest.java:38: cannot find symbol
    [javac] symbol  : method assertTrue(java.lang.String,boolean)
    [javac] location: class org.jmock.test.unit.lib.CurrentStateMatcherTest
    [javac]         assertTrue("should not match", !isCurrentlyS.matches(null));
    [javac]         ^
    [javac] /srv/gump/public/workspace/jmock2/test/org/jmock/test/unit/lib/CurrentStateMatcherTest.java:42: cannot find symbol
    [javac] symbol  : method assertTrue(java.lang.String,boolean)
    [javac] location: class org.jmock.test.unit.lib.CurrentStateMatcherTest
    [javac]         assertTrue("should not match", !isCurrentlyS.matches("something else"));
    [javac]         ^
    [javac] /srv/gump/public/workspace/jmock2/test/org/jmock/test/unit/lib/CurrentStateMatcherTest.java:46: cannot find symbol
    [javac] symbol  : method assertEquals(java.lang.String,java.lang.String)
    [javac] location: class org.jmock.test.unit.lib.CurrentStateMatcherTest
    [javac]         assertEquals("a state machine that is S", asString(isCurrently("S")));
    [javac]         ^
    [javac] /srv/gump/public/workspace/jmock2/test/org/jmock/test/unit/lib/CurrentStateMatcherTest.java:47: cannot find symbol
    [javac] symbol  : method assertEquals(java.lang.String,java.lang.String)
    [javac] location: class org.jmock.test.unit.lib.CurrentStateMatcherTest
    [javac]         assertEquals("a state machine that is not S", asString(isNotCurrently("S")));
    [javac]         ^
    [javac] /srv/gump/public/workspace/jmock2/test/org/jmock/test/unit/lib/CurrentStateMatcherTest.java:53: cannot find symbol
    [javac] symbol  : method assertMismatchDescription(java.lang.String,org.hamcrest.Matcher<org.jmock.States>,org.jmock.States)
    [javac] location: class org.jmock.test.unit.lib.CurrentStateMatcherTest
    [javac]         assertMismatchDescription("was not S", isCurrently("S"), stateMachine);
    [javac]         ^
    [javac] /srv/gump/public/workspace/jmock2/test/org/jmock/test/unit/lib/CurrentStateMatcherTest.java:56: method does not override a method from its superclass
    [javac]     @Override
    [javac]      ^
    [javac] /srv/gump/public/workspace/jmock2/test/org/jmock/test/unit/support/SyntheticEmptyInterfaceClassLoader.java:35: cannot find symbol
    [javac] symbol  : variable COMPUTE_MAXS
    [javac] location: class net.sf.cglib.asm.ClassWriter
    [javac]         ClassWriter writer = new ClassWriter(ClassWriter.COMPUTE_MAXS);
    [javac]                                                         ^
    [javac] /srv/gump/public/workspace/jmock2/test/org/jmock/test/unit/support/SyntheticEmptyInterfaceClassLoader.java:35: internal error; cannot instantiate ClassWriter(boolean) at net.sf.cglib.asm.ClassWriter to ()
    [javac]         ClassWriter writer = new ClassWriter(ClassWriter.COMPUTE_MAXS);
    [javac]                              ^
    [javac] /srv/gump/public/workspace/jmock2/test/org/jmock/test/unit/support/SyntheticEmptyInterfaceClassLoader.java:36: visit(int,int,java.lang.String,java.lang.String,java.lang.String[],java.lang.String) in net.sf.cglib.asm.ClassWriter cannot be applied to (int,int,java.lang.String,<nulltype>,java.lang.String,<nulltype>)
    [javac]                 writer.visit(CLASS_FORMAT_VERSION,
    [javac]                       ^
    [javac] Note: Some input files use or override a deprecated API.
    [javac] Note: Recompile with -Xlint:deprecation for details.
    [javac] 21 errors

BUILD FAILED
/srv/gump/public/workspace/jmock2/build.xml:61: Compile failed; see the compiler error output for details.

Total time: 8 seconds
---------------------------------------------

To subscribe to this information via syndicated feeds:
- RSS: http://vmgump.apache.org/gump/public/jmock2/jmock2/rss.xml
- Atom: http://vmgump.apache.org/gump/public/jmock2/jmock2/atom.xml

============================== Gump Tracking Only ===
Produced by Gump version 2.3.
Gump Run 15000008012009, vmgump:vmgump-public:15000008012009
Gump E-mail Identifier (unique within run) #28.

*********************************************************** G U M P
[GUMP@vmgump]: Project naming-config (in module directory-naming) failed
To whom it may engage...
        
This is an automated request, but not an unsolicited one. For 
more information please visit http://gump.apache.org/nagged.html, 
and/or contact the folk at general@gump.apache.org.

Project naming-config has an issue affecting its community integration.
This issue affects 1 projects,
 and has been outstanding for 41 runs.
The current state of this project is 'Failed', with reason 'Configuration Failed'.
For reference only, the following projects are affected by this:
    - naming-config :  Apache Directory Naming Component


Full details are available at:
    http://vmgump.apache.org/gump/public/directory-naming/naming-config/index.html

That said, some information snippets are provided here.

The following annotations (debug/informational/warning/error messages) were provided:
 -DEBUG- Sole output [naming-config-08012009.jar] identifier set to project name
 -INFO- Failed with reason configuration failed
 -ERROR- Bad Dependency. Project: commons-beanutils : unknown to *this* workspace 
 -ERROR- Bad Dependency. Project: commons-collections : unknown to *this* workspace 
 -ERROR- Bad Dependency. Project: commons-dbcp : unknown to *this* workspace 
 -ERROR- Bad Dependency. Project: commons-digester : unknown to *this* workspace 
 -ERROR- Bad Dependency. Project: commons-lang : unknown to *this* workspace 
 -ERROR- Bad Dependency. Project: commons-logging : unknown to *this* workspace 
 -ERROR- Bad Dependency. Project: commons-pool : unknown to *this* workspace 
 -INFO- Failed to extract fallback artifacts from Gump Repository

To subscribe to this information via syndicated feeds:
- RSS: http://vmgump.apache.org/gump/public/directory-naming/naming-config/rss.xml
- Atom: http://vmgump.apache.org/gump/public/directory-naming/naming-config/atom.xml

============================== Gump Tracking Only ===
Produced by Gump version 2.3.
Gump Run 15000008012009, vmgump:vmgump-public:15000008012009
Gump E-mail Identifier (unique within run) #29.

*********************************************************** G U M P
[GUMP@vmgump]: Project strutstestcase (in module strutstestcase) failed
To whom it may engage...
        
This is an automated request, but not an unsolicited one. For 
more information please visit http://gump.apache.org/nagged.html, 
and/or contact the folk at general@gump.apache.org.

Project strutstestcase has an issue affecting its community integration.
This issue affects 1 projects,
 and has been outstanding for 492 runs.
The current state of this project is 'Failed', with reason 'Configuration Failed'.
For reference only, the following projects are affected by this:
    - strutstestcase :  An extension of the standard JUnit TestCase class that provi...


Full details are available at:
    http://vmgump.apache.org/gump/public/strutstestcase/strutstestcase/index.html

That said, some information snippets are provided here.

The following annotations (debug/informational/warning/error messages) were provided:
 -DEBUG- Sole output [strutstestcase-08012009.jar] identifier set to project name
 -INFO- Failed with reason configuration failed
 -ERROR- Bad Dependency. Project: commons-beanutils : unknown to *this* workspace 
 -ERROR- Bad Dependency. Project: commons-collections : unknown to *this* workspace 
 -ERROR- Bad Dependency. Project: commons-digester : unknown to *this* workspace 
 -ERROR- Bad Dependency. Project: commons-logging : unknown to *this* workspace 
 -INFO- Failed to extract fallback artifacts from Gump Repository

To subscribe to this information via syndicated feeds:
- RSS: http://vmgump.apache.org/gump/public/strutstestcase/strutstestcase/rss.xml
- Atom: http://vmgump.apache.org/gump/public/strutstestcase/strutstestcase/atom.xml

============================== Gump Tracking Only ===
Produced by Gump version 2.3.
Gump Run 15000008012009, vmgump:vmgump-public:15000008012009
Gump E-mail Identifier (unique within run) #30.

*********************************************************** G U M P
[GUMP@vmgump]: Project ws-commons-xmlschema (in module ws-axis2-commons) failed
To whom it may engage...
        
This is an automated request, but not an unsolicited one. For 
more information please visit http://gump.apache.org/nagged.html, 
and/or contact the folk at general@gump.apache.org.

Project ws-commons-xmlschema has an issue affecting its community integration.
This issue affects 2 projects,
 and has been outstanding for 166 runs.
The current state of this project is 'Failed', with reason 'Build Failed'.
For reference only, the following projects are affected by this:
    - ws-axis2 :  Apache Axis2 SOAP Stack
    - ws-commons-xmlschema :  Common stuff for the WS projects.


Full details are available at:
    http://vmgump.apache.org/gump/public/ws-axis2-commons/ws-commons-xmlschema/index.html

That said, some information snippets are provided here.

The following annotations (debug/informational/warning/error messages) were provided:
 -DEBUG- Sole output [ws-commons-xmlschema-08012009.jar] identifier set to project name
 -INFO- Failed with reason build failed
 -INFO- Failed to extract fallback artifacts from Gump Repository



The following work was performed:
http://vmgump.apache.org/gump/public/ws-axis2-commons/ws-commons-xmlschema/gump_work/build_ws-axis2-commons_ws-commons-xmlschema.html
Work Name: build_ws-axis2-commons_ws-commons-xmlschema (Type: Build)
Work ended in a state of : Failed
Elapsed: 
Command Line: /usr/lib/jvm/java-1.5.0-sun/bin/java -Djava.awt.headless=true -Xbootclasspath/p:/srv/gump/public/workspace/xml-commons/java/external/build/xml-apis.jar:/srv/gump/public/workspace/xml-xerces2/build/xercesImpl.jar:/srv/gump/public/workspace/xml-xalan/build/serializer.jar:/srv/gump/public/workspace/xml-xalan/build/xalan-unbundled.jar org.apache.tools.ant.Main -Dgump.merge=/srv/gump/public/gump/work/merge.xml -Dbuild.sysclasspath=only -Doutput.jar=ws-commons-xmlschema-08012009 -DdownloadLibs=false jar 
[Working Directory: /srv/gump/public/workspace/ws-axis2-commons/XmlSchema]
CLASSPATH: /usr/lib/jvm/java-1.5.0-sun/lib/tools.jar:/srv/gump/public/workspace/ws-axis2-commons/XmlSchema/build/classes:/srv/gump/public/workspace/ws-axis2-commons/XmlSchema/build/test-classes:/srv/gump/public/workspace/xml-commons/java/external/build/xml-apis-ext.jar:/srv/gump/public/workspace/xmlunit/build/lib/xmlunit-08012009.jar:/srv/gump/public/workspace/ant/dist/lib/ant-jmf.jar:/srv/gump/public/workspace/ant/dist/lib/ant-swing.jar:/srv/gump/public/workspace/ant/dist/lib/ant-apache-resolver.jar:/srv/gump/public/workspace/ant/dist/lib/ant-apache-xalan2.jar:/srv/gump/public/workspace/ant/dist/lib/ant-trax.jar:/srv/gump/public/workspace/ant/dist/lib/ant-junit.jar:/srv/gump/public/workspace/ant/dist/lib/ant-launcher.jar:/srv/gump/public/workspace/ant/dist/lib/ant-nodeps.jar:/srv/gump/public/workspace/ant/dist/lib/ant.jar:/srv/gump/packages/junit3.8.1/junit.jar:/srv/gump/public/workspace/xml-commons/java/build/resolver.jar:/srv/gump/packages/stax/jsr173_1.0_api.jar:/srv/gump
 /packages/stax/jsr173_1.0_ri.jar:/srv/gump/public/workspace/junit/dist/junit-08012009.jar
---------------------------------------------
Buildfile: build.xml does not exist!
Build failed
---------------------------------------------

To subscribe to this information via syndicated feeds:
- RSS: http://vmgump.apache.org/gump/public/ws-axis2-commons/ws-commons-xmlschema/rss.xml
- Atom: http://vmgump.apache.org/gump/public/ws-axis2-commons/ws-commons-xmlschema/atom.xml

============================== Gump Tracking Only ===
Produced by Gump version 2.3.
Gump Run 15000008012009, vmgump:vmgump-public:15000008012009
Gump E-mail Identifier (unique within run) #32.

*********************************************************** G U M P
[GUMP@vmgump]: Project authx-jdbc (in module authx) failed
To whom it may engage...
        
This is an automated request, but not an unsolicited one. For 
more information please visit http://gump.apache.org/nagged.html, 
and/or contact the folk at general@gump.apache.org.

Project authx-jdbc has an issue affecting its community integration.
This issue affects 1 projects,
 and has been outstanding for 339 runs.
The current state of this project is 'Failed', with reason 'Build Failed'.
For reference only, the following projects are affected by this:
    - authx-jdbc :  Apache Authentication and Authorization Framework


Full details are available at:
    http://vmgump.apache.org/gump/public/authx/authx-jdbc/index.html

That said, some information snippets are provided here.

The following annotations (debug/informational/warning/error messages) were provided:
 -DEBUG- Sole output [authx-jdbc-08012009.jar] identifier set to project name
 -DEBUG- Dependency on packaged-jmock exists, no need to add for property maven.jar.jmock.
 -DEBUG- (Gump generated) Maven Properties in: /srv/gump/public/workspace/authx/jdbc/build.properties
 -INFO- Failed with reason build failed
 -DEBUG- Maven POM in: /srv/gump/public/workspace/authx/jdbc/project.xml
 -DEBUG- Maven project properties in: /srv/gump/public/workspace/authx/jdbc/project.properties
 -INFO- Project Reports in: /srv/gump/public/workspace/authx/jdbc/target/test-reports
 -WARNING- No directory [/srv/gump/public/workspace/authx/jdbc/target/test-reports]
 -DEBUG- Extracted fallback artifacts from Gump Repository



The following work was performed:
http://vmgump.apache.org/gump/public/authx/authx-jdbc/gump_work/build_authx_authx-jdbc.html
Work Name: build_authx_authx-jdbc (Type: Build)
Work ended in a state of : Failed
Elapsed: 2 secs
Command Line: maven --offline jar 
[Working Directory: /srv/gump/public/workspace/authx/jdbc]
CLASSPATH: /usr/lib/jvm/java-1.5.0-sun/lib/tools.jar:authx-core-gump-07012009.jar:/srv/gump/public/workspace/hsqldb/lib/hsqldb.jar:/srv/gump/packages/jmock/jmock-1.0.1.jar:/srv/gump/packages/maven-site-plugin/maven-site-plugin-1.6.1.jar
---------------------------------------------
 __  __
|  \/  |__ _Apache__ ___
| |\/| / _` \ V / -_) ' \  ~ intelligent projects ~
|_|  |_\__,_|\_/\___|_||_|  v. 1.0.2

The build cannot continue because of the following unsatisfied dependency:

authx-core-0.4-SNAPSHOT.jar; path override doesn't exist: /srv/gump/public/workspace/authx/jdbc/authx-core-gump-07012009.jar

Total time: 2 seconds
Finished at: Thu Jan 08 01:40:30 GMT-08:00 2009

---------------------------------------------

To subscribe to this information via syndicated feeds:
- RSS: http://vmgump.apache.org/gump/public/authx/authx-jdbc/rss.xml
- Atom: http://vmgump.apache.org/gump/public/authx/authx-jdbc/atom.xml

============================== Gump Tracking Only ===
Produced by Gump version 2.3.
Gump Run 15000008012009, vmgump:vmgump-public:15000008012009
Gump E-mail Identifier (unique within run) #36.

*********************************************************** G U M P
[GUMP@vmgump]: Project beepcore (in module beepcore) failed
To whom it may engage...
        
This is an automated request, but not an unsolicited one. For 
more information please visit http://gump.apache.org/nagged.html, 
and/or contact the folk at general@gump.apache.org.

Project beepcore has an issue affecting its community integration.
This issue affects 1 projects,
 and has been outstanding for 492 runs.
The current state of this project is 'Failed', with reason 'Configuration Failed'.
For reference only, the following projects are affected by this:
    - beepcore :  BEEP is a new Internet standards-track protocol


Full details are available at:
    http://vmgump.apache.org/gump/public/beepcore/beepcore/index.html

That said, some information snippets are provided here.

The following annotations (debug/informational/warning/error messages) were provided:
 -DEBUG- Sole output [beepcore.jar] identifier set to project name
 -INFO- Failed with reason configuration failed
 -ERROR- Bad Dependency. Project: commons-logging : unknown to *this* workspace 
 -INFO- Failed to extract fallback artifacts from Gump Repository

To subscribe to this information via syndicated feeds:
- RSS: http://vmgump.apache.org/gump/public/beepcore/beepcore/rss.xml
- Atom: http://vmgump.apache.org/gump/public/beepcore/beepcore/atom.xml

============================== Gump Tracking Only ===
Produced by Gump version 2.3.
Gump Run 15000008012009, vmgump:vmgump-public:15000008012009
Gump E-mail Identifier (unique within run) #37.

*********************************************************** G U M P
[GUMP@vmgump]: Project dotnet-antlib-test (in module ant-antlibs) failed
To whom it may engage...
        
This is an automated request, but not an unsolicited one. For 
more information please visit http://gump.apache.org/nagged.html, 
and/or contact the folk at general@gump.apache.org.

Project dotnet-antlib-test has an issue affecting its community integration.
This issue affects 1 projects,
 and has been outstanding for 196 runs.
The current state of this project is 'Failed', with reason 'Build Failed'.
For reference only, the following projects are affected by this:
    - dotnet-antlib-test :  Task and Type Libraries for Apache Ant


Full details are available at:
    http://vmgump.apache.org/gump/public/ant-antlibs/dotnet-antlib-test/index.html

That said, some information snippets are provided here.

The following annotations (debug/informational/warning/error messages) were provided:
 -INFO- Failed with reason build failed



The following work was performed:
http://vmgump.apache.org/gump/public/ant-antlibs/dotnet-antlib-test/gump_work/build_ant-antlibs_dotnet-antlib-test.html
Work Name: build_ant-antlibs_dotnet-antlib-test (Type: Build)
Work ended in a state of : Failed
Elapsed: 19 secs
Command Line: /usr/lib/jvm/java-1.5.0-sun/bin/java -Djava.awt.headless=true -Xbootclasspath/p:/srv/gump/public/workspace/xml-xerces2/build/xercesImpl.jar:/srv/gump/public/workspace/xml-commons/java/external/build/xml-apis.jar org.apache.tools.ant.Main -Dgump.merge=/srv/gump/public/gump/work/merge.xml -Dbuild.sysclasspath=only -Dant-testutil.jar=/srv/gump/public/workspace/ant/build/lib/ant-testutil.jar test 
[Working Directory: /srv/gump/public/workspace/ant-antlibs/dotnet]
CLASSPATH: /usr/lib/jvm/java-1.5.0-sun/lib/tools.jar:/srv/gump/public/workspace/ant-antlibs/dotnet/build/test-classes:/srv/gump/public/workspace/ant/dist/lib/ant-jmf.jar:/srv/gump/public/workspace/ant/dist/lib/ant-swing.jar:/srv/gump/public/workspace/ant/dist/lib/ant-apache-resolver.jar:/srv/gump/public/workspace/ant/dist/lib/ant-apache-xalan2.jar:/srv/gump/public/workspace/ant/dist/lib/ant-trax.jar:/srv/gump/public/workspace/ant/dist/lib/ant-junit.jar:/srv/gump/public/workspace/ant/dist/lib/ant-launcher.jar:/srv/gump/public/workspace/ant/dist/lib/ant-nodeps.jar:/srv/gump/public/workspace/ant/dist/lib/ant.jar:/srv/gump/public/workspace/ant-antlibs/antunit/build/ant-antunit-08012009.jar:/srv/gump/public/workspace/ant-antlibs/dotnet/build/ant-dotnet-08012009.jar:/srv/gump/public/workspace/xml-commons/java/external/build/xml-apis-ext.jar
---------------------------------------------
[au:antunit] Target: test-passing took 0.153 sec
[au:antunit] Build File: /srv/gump/public/workspace/ant-antlibs/dotnet/src/tests/antunit/dir with spaces/wsdl-test.xml
[au:antunit] Tests run: 1, Failures: 0, Errors: 0, Time elapsed: 1.321 sec
[au:antunit] Target: testWSDL took 1.308 sec
[au:antunit] Build File: /srv/gump/public/workspace/ant-antlibs/dotnet/src/tests/antunit/dotnetexec-test.xml
[au:antunit] Tests run: 2, Failures: 0, Errors: 0, Time elapsed: 1.399 sec
[au:antunit] Target: testCSC took 0.759 sec
[au:antunit] Target: testCSCNoConfig took 0.573 sec
[au:antunit] Build File: /srv/gump/public/workspace/ant-antlibs/dotnet/src/tests/antunit/nunit/nunit-test.xml
[au:antunit] Tests run: 5, Failures: 0, Errors: 0, Time elapsed: 0.126 sec
[au:antunit] Target: test-passing took 0.005 sec
[au:antunit] Target: test-failing took 0.002 sec
[au:antunit] Target: test-failing-errorproperty took 0.005 sec
[au:antunit] Target: test-failing-with-fail took 0.005 sec
[au:antunit] Target: test-no-assembly took 0.012 sec
[au:antunit] Build File: /srv/gump/public/workspace/ant-antlibs/dotnet/src/tests/antunit/old-core-test.xml
[au:antunit] Tests run: 9, Failures: 0, Errors: 0, Time elapsed: 6.299 sec
[au:antunit] Target: testCSCintrinsicFileset took 0.805 sec
[au:antunit] Target: testCSCresponseFile took 1.498 sec
[au:antunit] Target: testILASM took 0.661 sec
[au:antunit] Target: testCSCdll took 0.633 sec
[au:antunit] Target: testILDASM took 0.778 sec
[au:antunit] Target: testILDASM_empty took 0.031 sec
[au:antunit] Target: testJsharp took 0.02 sec
[au:antunit] Target: testCSCResources took 0.754 sec
[au:antunit] Target: testCSC took 0.802 sec
[au:antunit] Build File: /srv/gump/public/workspace/ant-antlibs/dotnet/src/tests/antunit/wsdl2dotnet-test.xml
[au:antunit] Tests run: 15, Failures: 0, Errors: 0, Time elapsed: 3.433 sec
[au:antunit] Target: testSchemaMustBeSet took 0.037 sec
[au:antunit] Target: testLocalWsdlVB took 0.011 sec
[au:antunit] Target: testInvalidExtraOps took 0.008 sec
[au:antunit] Target: testSrcIsMissing took 0.022 sec
[au:antunit] Target: testNoParams took 0.016 sec
[au:antunit] Target: testBothSrc took 0.014 sec
[au:antunit] Target: testSchemaFileMustHaveOneOptionOnly took 0.032 sec
[au:antunit] Target: testLocalWsdl took 1.414 sec
[au:antunit] Target: testSrcIsDir took 0.027 sec
[au:antunit] Target: testLocalWsdlServerVB took 0.008 sec
[au:antunit] Target: testLocalWsdlServer took 1.528 sec
[au:antunit] Target: testNoSrc took 0.02 sec
[au:antunit] Target: testSchemaFileMustExist took 0.012 sec
[au:antunit] Target: testInvalidExtraOpsVB took 0.015 sec
[au:antunit] Target: testDestIsDir took 0.014 sec

test:

BUILD FAILED
/srv/gump/public/workspace/ant-antlibs/dotnet/common/build.xml:216: At least one AntUnit test has failed.

Total time: 19 seconds
---------------------------------------------

To subscribe to this information via syndicated feeds:
- RSS: http://vmgump.apache.org/gump/public/ant-antlibs/dotnet-antlib-test/rss.xml
- Atom: http://vmgump.apache.org/gump/public/ant-antlibs/dotnet-antlib-test/atom.xml

============================== Gump Tracking Only ===
Produced by Gump version 2.3.
Gump Run 15000008012009, vmgump:vmgump-public:15000008012009
Gump E-mail Identifier (unique within run) #41.

*********************************************************** G U M P
[GUMP@vmgump]: Project nlog4j (in module nlog4j) failed
To whom it may engage...
        
This is an automated request, but not an unsolicited one. For 
more information please visit http://gump.apache.org/nagged.html, 
and/or contact the folk at general@gump.apache.org.

Project nlog4j has an issue affecting its community integration.
This issue affects 1 projects.
The current state of this project is 'Failed', with reason 'Build Failed'.
For reference only, the following projects are affected by this:
    - nlog4j


Full details are available at:
    http://vmgump.apache.org/gump/public/nlog4j/nlog4j/index.html

That said, some information snippets are provided here.

The following annotations (debug/informational/warning/error messages) were provided:
 -DEBUG- Sole output [nlog4j-08012009.jar] identifier set to project name
 -INFO- Failed with reason build failed
 -INFO- Failed to extract fallback artifacts from Gump Repository



The following work was performed:
http://vmgump.apache.org/gump/public/nlog4j/nlog4j/gump_work/build_nlog4j_nlog4j.html
Work Name: build_nlog4j_nlog4j (Type: Build)
Work ended in a state of : Failed
Elapsed: 5 secs
Command Line: /usr/lib/jvm/java-1.5.0-sun/bin/java -Djava.awt.headless=true -Xbootclasspath/p:/srv/gump/public/workspace/xml-commons/java/external/build/xml-apis.jar:/srv/gump/public/workspace/xml-xerces2/build/xercesImpl.jar org.apache.tools.ant.Main -Dgump.merge=/srv/gump/public/gump/work/merge.xml -Dbuild.sysclasspath=only -Dversion=08012009 nlog4j.jar 
[Working Directory: /srv/gump/public/workspace/nlog4j]
CLASSPATH: /usr/lib/jvm/java-1.5.0-sun/lib/tools.jar:/srv/gump/public/workspace/ant/dist/lib/ant-jmf.jar:/srv/gump/public/workspace/ant/dist/lib/ant-swing.jar:/srv/gump/public/workspace/ant/dist/lib/ant-apache-resolver.jar:/srv/gump/public/workspace/ant/dist/lib/ant-apache-xalan2.jar:/srv/gump/public/workspace/ant/dist/lib/ant-trax.jar:/srv/gump/public/workspace/ant/dist/lib/ant-junit.jar:/srv/gump/public/workspace/ant/dist/lib/ant-launcher.jar:/srv/gump/public/workspace/ant/dist/lib/ant-nodeps.jar:/srv/gump/public/workspace/ant/dist/lib/ant.jar:/srv/gump/public/workspace/xml-commons/java/external/build/xml-apis-ext.jar:/srv/gump/packages/jaf-1.1ea/activation.jar:/srv/gump/packages/javamail-1.4/mail.jar:/srv/gump/packages/javamail-1.4/lib/mailapi.jar:/srv/gump/packages/jms1.1/lib/jms.jar:/srv/gump/packages/jmx-1_2_1-bin/lib/jmxri.jar:/srv/gump/packages/jmx-1_2_1-bin/lib/jmxtools.jar:/srv/gump/public/workspace/slf4j/log4j-over-slf4j/target/log4j-over-slf4j-1.5.6.jar:/srv/gump/
 public/workspace/slf4j/slf4j-ext/target/slf4j-ext-1.5.6.jar:/srv/gump/public/workspace/slf4j/slf4j-migrator/target/slf4j-migrator-1.5.6.jar:/srv/gump/public/workspace/slf4j/slf4j-nop/target/slf4j-nop-1.5.6.jar:/srv/gump/public/workspace/slf4j/jcl104-over-slf4j/target/jcl104-over-slf4j-1.5.6.jar:/srv/gump/public/workspace/slf4j/jcl-over-slf4j/target/jcl-over-slf4j-1.5.6.jar:/srv/gump/public/workspace/slf4j/slf4j-simple/target/slf4j-simple-1.5.6.jar:/srv/gump/public/workspace/slf4j/slf4j-jdk14/target/slf4j-jdk14-1.5.6.jar:/srv/gump/public/workspace/slf4j/slf4j-api/target/slf4j-api-1.5.6.jar:/srv/gump/public/workspace/slf4j/slf4j-log4j12/target/slf4j-log4j12-1.5.6.jar:/srv/gump/public/workspace/slf4j/jul-to-slf4j/target/jul-to-slf4j-1.5.6.jar:/srv/gump/public/workspace/slf4j/slf4j-jcl/target/slf4j-jcl-1.5.6.jar
---------------------------------------------
    [javac] /srv/gump/public/workspace/nlog4j/src/java/org/apache/log4j/test/PatternTest.java:59: warning: [deprecation] FATAL in org.apache.log4j.Priority has been deprecated
    [javac]     root.log(Priority.FATAL, "Message " + i);    
    [javac]                      ^
    [javac] /srv/gump/public/workspace/nlog4j/src/java/org/apache/log4j/test/PatternTest.java:74: warning: [deprecation] FATAL in org.apache.log4j.Priority has been deprecated
    [javac]     CAT.log(Priority.FATAL, "Message " + ++i, e);
    [javac]                     ^
    [javac] /srv/gump/public/workspace/nlog4j/src/java/org/apache/log4j/test/PatternTest.java:75: warning: [deprecation] FATAL in org.apache.log4j.Priority has been deprecated
    [javac]     root.log(Priority.FATAL, "Message " + i, e);    
    [javac]                      ^
    [javac] /srv/gump/public/workspace/nlog4j/src/java/org/apache/log4j/varia/FallbackErrorHandler.java:51: addElement(java.lang.Object) in java.util.Vector cannot be applied to (org.apache.log4j.Logger)
    [javac]     loggers.addElement(logger);
    [javac]            ^
    [javac] /srv/gump/public/workspace/nlog4j/src/java/org/apache/log4j/varia/FallbackErrorHandler.java:80: inconvertible types
    [javac] found   : java.lang.Object
    [javac] required: org.apache.log4j.Logger
    [javac]       Logger l = (Logger) loggers.elementAt(i);
    [javac]                                            ^
    [javac] /srv/gump/public/workspace/nlog4j/src/java/org/slf4j/LoggerFactory.java:181: warning: [deprecation] SINGLETON in org.slf4j.impl.StaticLoggerBinder has been deprecated
    [javac]       return StaticLoggerBinder.SINGLETON;
    [javac]                                ^
    [javac] /srv/gump/public/workspace/nlog4j/src/java/org/slf4j/LoggerFactory.java:194: warning: [deprecation] SINGLETON in org.slf4j.impl.StaticLoggerBinder has been deprecated
    [javac]       return StaticLoggerBinder.SINGLETON;
    [javac]                                ^
    [javac] /srv/gump/public/workspace/nlog4j/src/java/org/slf4j/helpers/BasicMarker.java:85: warning: [deprecation] hasChildren() in org.slf4j.Marker has been deprecated
    [javac]   public boolean hasChildren() {
    [javac]                  ^
    [javac] /srv/gump/public/workspace/nlog4j/src/java/org/slf4j/impl/NLOG4JLoggerFactory.java:43: incompatible types
    [javac] found   : org.apache.log4j.Logger
    [javac] required: org.slf4j.Logger
    [javac]     return LogManager.getLogger(name);  
    [javac]                                ^
    [javac] /srv/gump/public/workspace/nlog4j/src/java/org/apache/log4j/xml/DOMConfigurator.java:334: inconvertible types
    [javac] found   : java.lang.Object
    [javac] required: org.apache.log4j.Logger
    [javac] 	 cat = (Logger) getInstanceMethod.invoke(null, new Object[] {catName});
    [javac]                                                 ^
    [javac] /srv/gump/public/workspace/nlog4j/src/java/org/apache/log4j/xml/DOMConfigurator.java:413: cannot find symbol
    [javac] symbol  : constructor PropertySetter(org.apache.log4j.Logger)
    [javac] location: class org.apache.log4j.config.PropertySetter
    [javac]     PropertySetter propSetter = new PropertySetter(cat);
    [javac]                                 ^
    [javac] Note: Some input files use unchecked or unsafe operations.
    [javac] Note: Recompile with -Xlint:unchecked for details.
    [javac] 41 errors
    [javac] 19 warnings

BUILD FAILED
/srv/gump/public/workspace/nlog4j/build.xml:195: Compile failed; see the compiler error output for details.

Total time: 4 seconds
---------------------------------------------

To subscribe to this information via syndicated feeds:
- RSS: http://vmgump.apache.org/gump/public/nlog4j/nlog4j/rss.xml
- Atom: http://vmgump.apache.org/gump/public/nlog4j/nlog4j/atom.xml

============================== Gump Tracking Only ===
Produced by Gump version 2.3.
Gump Run 15000008012009, vmgump:vmgump-public:15000008012009
Gump E-mail Identifier (unique within run) #46.

*********************************************************** G U M P
[GUMP@vmgump]: Module town failed
To whom it may engage...
        
This is an automated request, but not an unsolicited one. For 
more information please visit http://gump.apache.org/nagged.html, 
and/or contact the folk at general@gump.apache.org.

Module town has an issue affecting its community integration,
 and has been outstanding for 1354 runs.
The current state of this module is 'Failed', with reason 'Update Failed'.

Full details are available at:
    http://vmgump.apache.org/gump/public/town/index.html

That said, some information snippets are provided here.

The following annotations (debug/informational/warning/error messages) were provided:
 -INFO- Failed with reason update failed



The following work was performed:
http://vmgump.apache.org/gump/public/town/gump_work/update_town.html
Work Name: update_town (Type: Update)
Work ended in a state of : Failed
Elapsed: 
Command Line: cvs -q -z3 -d :pserver:anoncvs@share.whichever.com:/home/cvspublic checkout -P -d town town 
[Working Directory: /srv/gump/public/workspace/cvs]
---------------------------------------------
Unknown host share.whichever.com.
---------------------------------------------

To subscribe to this information via syndicated feeds:
- RSS: http://vmgump.apache.org/gump/public/town/rss.xml
- Atom: http://vmgump.apache.org/gump/public/town/atom.xml

============================== Gump Tracking Only ===
Produced by Gump version 2.3.
Gump Run 15000008012009, vmgump:vmgump-public:15000008012009
Gump E-mail Identifier (unique within run) #48.

*********************************************************** G U M P
[GUMP@vmgump]: Project anakia (in module anakia) failed
To whom it may engage...
        
This is an automated request, but not an unsolicited one. For 
more information please visit http://gump.apache.org/nagged.html, 
and/or contact the folk at general@gump.apache.org.

Project anakia has an issue affecting its community integration.
This issue affects 1 projects,
 and has been outstanding for 106 runs.
The current state of this project is 'Failed', with reason 'Configuration Failed'.
For reference only, the following projects are affected by this:
    - anakia :  Essentially an XML transformation tool, Anakia uses JDOM and...


Full details are available at:
    http://vmgump.apache.org/gump/public/anakia/anakia/index.html

That said, some information snippets are provided here.

The following annotations (debug/informational/warning/error messages) were provided:
 -INFO- Failed with reason configuration failed
 -ERROR- Bad Dependency. Project: commons-collections : unknown to *this* workspace 
 -ERROR- Bad Dependency. Project: commons-lang : unknown to *this* workspace 

To subscribe to this information via syndicated feeds:
- RSS: http://vmgump.apache.org/gump/public/anakia/anakia/rss.xml
- Atom: http://vmgump.apache.org/gump/public/anakia/anakia/atom.xml

============================== Gump Tracking Only ===
Produced by Gump version 2.3.
Gump Run 15000008012009, vmgump:vmgump-public:15000008012009
Gump E-mail Identifier (unique within run) #52.

*********************************************************** G U M P
[GUMP@vmgump]: Project castor (in module castor) failed
To whom it may engage...
        
This is an automated request, but not an unsolicited one. For 
more information please visit http://gump.apache.org/nagged.html, 
and/or contact the folk at general@gump.apache.org.

Project castor has an issue affecting its community integration.
This issue affects 3 projects,
 and has been outstanding for 106 runs.
The current state of this project is 'Failed', with reason 'Build Failed'.
For reference only, the following projects are affected by this:
    - castor :  Java to XML, SQL, LDAP bindings
    - castor-test :  Java to XML, SQL, LDAP bindings
    - portals-pluto-deploy-1.0 :  JSR168 Container


Full details are available at:
    http://vmgump.apache.org/gump/public/castor/castor/index.html

That said, some information snippets are provided here.

The following annotations (debug/informational/warning/error messages) were provided:
 -DEBUG- Output [castor-core-1.3rc2-SNAPSHOT.jar] identifier set to output basename: [castor-core-1.3rc2-SNAPSHOT]
 -DEBUG- Output [castor-xml-1.3rc2-SNAPSHOT.jar] identifier set to output basename: [castor-xml-1.3rc2-SNAPSHOT]
 -WARNING- Bad *Optional* Dependency. Project: commons-logging : unknown to *this* workspace
 -DEBUG- (Gump generated) Maven2 Settings in: /srv/gump/public/workspace/castor/gump_mvn_settings.xml
 -INFO- Failed with reason build failed
 -DEBUG- Maven POM in: /srv/gump/public/workspace/castor/pom.xml
 -INFO- Failed to extract fallback artifacts from Gump Repository



The following work was performed:
http://vmgump.apache.org/gump/public/castor/castor/gump_work/build_castor_castor.html
Work Name: build_castor_castor (Type: Build)
Work ended in a state of : Failed
Elapsed: 3 mins 8 secs
Command Line: mvn --batch-mode -Dmaven.test.skip=true --settings /srv/gump/public/workspace/castor/gump_mvn_settings.xml package 
[Working Directory: /srv/gump/public/workspace/castor]
CLASSPATH: /usr/lib/jvm/java-1.5.0-sun/lib/tools.jar:/srv/gump/public/workspace/ant/dist/lib/ant-jmf.jar:/srv/gump/public/workspace/ant/dist/lib/ant-swing.jar:/srv/gump/public/workspace/ant/dist/lib/ant-apache-resolver.jar:/srv/gump/public/workspace/ant/dist/lib/ant-apache-xalan2.jar:/srv/gump/public/workspace/ant/dist/lib/ant-trax.jar:/srv/gump/public/workspace/ant/dist/lib/ant-junit.jar:/srv/gump/public/workspace/ant/dist/lib/ant-launcher.jar:/srv/gump/public/workspace/ant/dist/lib/ant-nodeps.jar:/srv/gump/public/workspace/ant/dist/lib/ant.jar:/srv/gump/packages/junit3.8.1/junit.jar:/srv/gump/public/workspace/xml-commons/java/build/resolver.jar:/srv/gump/public/workspace/castor/lib/ldapjdk_4.1.jar:/srv/gump/packages/jdbc2_0/jdbc2_0-stdext.jar:/srv/gump/packages/jta-spec1_0_1/jta-spec1_0_1.jar:/srv/gump/public/workspace/jakarta-regexp/build/jakarta-regexp-08012009.jar:/srv/gump/public/workspace/jakarta-oro/jakarta-oro-08012009.jar:/srv/gump/packages/cglib/cglib-nodep-2.1_3.j
 ar:/srv/gump/public/workspace/junit/dist/junit-08012009.jar:/srv/gump/public/workspace/logging-log4j-12/dist/lib/log4j-08012009.jar:velocity-gump-07012009.jar:velocity-dep-gump-07012009.jar
---------------------------------------------
[INFO] Building jar: /srv/gump/public/workspace/castor/ddlgen/target/castor-ddlgen-1.3rc2-SNAPSHOT-sources.jar
[INFO] ------------------------------------------------------------------------
[INFO] Building Castor - ant tasks
[INFO]    task-segment: [package]
[INFO] ------------------------------------------------------------------------
[INFO] [resources:resources]
[INFO] Using default encoding to copy filtered resources.
[INFO] [compiler:compile]
[INFO] Compiling 5 source files to /srv/gump/public/workspace/castor/anttask/target/classes
[INFO] [resources:testResources]
[INFO] Using default encoding to copy filtered resources.
[INFO] [compiler:testCompile]
[INFO] Not compiling test sources
[INFO] [surefire:test]
[INFO] Tests are skipped.
[INFO] [jar:jar]
[INFO] Building jar: /srv/gump/public/workspace/castor/anttask/target/castor-anttasks-1.3rc2-SNAPSHOT.jar
[INFO] Preparing source:jar
[WARNING] Removing: jar from forked lifecycle, to prevent recursive invocation.
[INFO] No goals needed for project - skipping
[INFO] [source:jar {execution: default}]
[INFO] Building jar: /srv/gump/public/workspace/castor/anttask/target/castor-anttasks-1.3rc2-SNAPSHOT-sources.jar
[INFO] ------------------------------------------------------------------------
[INFO] Building Castor XML - test suite framework code
[INFO]    task-segment: [package]
[INFO] ------------------------------------------------------------------------
[INFO] [castor:generate {execution: default}]
[INFO] Processing /srv/gump/public/workspace/castor/xmlctf-framework/src/main/resources/org/exolab/castor/tests/framework/TestDescriptor.xsd
[INFO] [resources:resources]
[INFO] Using default encoding to copy filtered resources.
[INFO] [compiler:compile]
[INFO] Compiling 88 source files to /srv/gump/public/workspace/castor/xmlctf-framework/target/classes
[INFO] ------------------------------------------------------------------------
[ERROR] BUILD FAILURE
[INFO] ------------------------------------------------------------------------
[INFO] Compilation failure
/srv/gump/public/workspace/castor/xmlctf-framework/src/main/java/org/castor/xmlctf/CastorTestSuiteRunner.java:[169,25] package junit.swingui does not exist



/srv/gump/public/workspace/castor/xmlctf-framework/src/main/java/org/castor/xmlctf/CastorTestSuiteRunner.java:[169,25] package junit.swingui does not exist


[INFO] ------------------------------------------------------------------------
[INFO] For more information, run Maven with the -e switch
[INFO] ------------------------------------------------------------------------
[INFO] Total time: 3 minutes 6 seconds
[INFO] Finished at: Thu Jan 08 01:53:39 GMT-08:00 2009
[INFO] Final Memory: 20M/52M
[INFO] ------------------------------------------------------------------------
---------------------------------------------

To subscribe to this information via syndicated feeds:
- RSS: http://vmgump.apache.org/gump/public/castor/castor/rss.xml
- Atom: http://vmgump.apache.org/gump/public/castor/castor/atom.xml

============================== Gump Tracking Only ===
Produced by Gump version 2.3.
Gump Run 15000008012009, vmgump:vmgump-public:15000008012009
Gump E-mail Identifier (unique within run) #54.

*********************************************************** G U M P
[GUMP@vmgump]: Project emma (in module emma) failed
To whom it may engage...
        
This is an automated request, but not an unsolicited one. For 
more information please visit http://gump.apache.org/nagged.html, 
and/or contact the folk at general@gump.apache.org.

Project emma has an issue affecting its community integration.
This issue affects 1 projects,
 and has been outstanding for 665 runs.
The current state of this project is 'Failed', with reason 'Build Failed'.
For reference only, the following projects are affected by this:
    - emma :  code coverage tool


Full details are available at:
    http://vmgump.apache.org/gump/public/emma/emma/index.html

That said, some information snippets are provided here.

The following annotations (debug/informational/warning/error messages) were provided:
 -INFO- Failed with reason build failed
 -INFO- Failed to extract fallback artifacts from Gump Repository



The following work was performed:
http://vmgump.apache.org/gump/public/emma/emma/gump_work/build_emma_emma.html
Work Name: build_emma_emma (Type: Build)
Work ended in a state of : Failed
Elapsed: 7 secs
Command Line: /usr/lib/jvm/java-1.5.0-sun/bin/java -Djava.awt.headless=true -Xbootclasspath/p:/srv/gump/public/workspace/xml-commons/java/external/build/xml-apis.jar:/srv/gump/public/workspace/xml-xerces2/build/xercesImpl.jar org.apache.tools.ant.Main -Dgump.merge=/srv/gump/public/gump/work/merge.xml -Dbuild.sysclasspath=only -Dapp.short.name=emma-08012009 
[Working Directory: /srv/gump/public/workspace/emma]
CLASSPATH: /usr/lib/jvm/java-1.5.0-sun/lib/tools.jar:/srv/gump/public/workspace/emma/out/core/classes:/srv/gump/public/workspace/emma/out/ant/classes:/srv/gump/public/workspace/emma/lib/internal/stamptool.jar:/srv/gump/public/workspace/ant/dist/lib/ant-jmf.jar:/srv/gump/public/workspace/ant/dist/lib/ant-swing.jar:/srv/gump/public/workspace/ant/dist/lib/ant-apache-resolver.jar:/srv/gump/public/workspace/ant/dist/lib/ant-apache-xalan2.jar:/srv/gump/public/workspace/ant/dist/lib/ant-trax.jar:/srv/gump/public/workspace/ant/dist/lib/ant-junit.jar:/srv/gump/public/workspace/ant/dist/lib/ant-launcher.jar:/srv/gump/public/workspace/ant/dist/lib/ant-nodeps.jar:/srv/gump/public/workspace/ant/dist/lib/ant.jar:/srv/gump/public/workspace/xml-commons/java/external/build/xml-apis-ext.jar
---------------------------------------------
     [copy] Copying 1 file to /srv/gump/public/workspace/emma/out/temp

timestamp:

-pre-compile:

core.bootstrap.compile:
    [javac] Compiling 2 source files to /srv/gump/public/workspace/emma/out/core/classes
    [javac] 
    [javac]           WARNING
    [javac] 
    [javac] The -source switch defaults to 1.5 in JDK 1.5 and 1.6.
    [javac] If you specify -target 1.2 you now must also specify -source 1.2.
    [javac] Ant will implicitly add -source 1.2 for you.  Please change your build file.

core.java14.compile:
    [javac] Compiling 1 source file to /srv/gump/public/workspace/emma/out/core/classes
    [javac] 
    [javac]           WARNING
    [javac] 
    [javac] The -source switch defaults to 1.5 in JDK 1.5 and 1.6.
    [javac] If you specify -target 1.2 you now must also specify -source 1.2.
    [javac] Ant will implicitly add -source 1.2 for you.  Please change your build file.

core.java13.compile:
    [javac] Compiling 1 source file to /srv/gump/public/workspace/emma/out/core/classes
    [javac] 
    [javac]           WARNING
    [javac] 
    [javac] The -source switch defaults to 1.5 in JDK 1.5 and 1.6.
    [javac] If you specify -target 1.2 you now must also specify -source 1.2.
    [javac] Ant will implicitly add -source 1.2 for you.  Please change your build file.

core.compile:
    [javac] Compiling 175 source files to /srv/gump/public/workspace/emma/out/core/classes
    [javac] 
    [javac]           WARNING
    [javac] 
    [javac] The -source switch defaults to 1.5 in JDK 1.5 and 1.6.
    [javac] If you specify -target 1.2 you now must also specify -source 1.2.
    [javac] Ant will implicitly add -source 1.2 for you.  Please change your build file.
    [javac] /srv/gump/public/workspace/emma/core/java12/com/vladium/emma/run/InstrClassLoader.java:346: reference to CodeSource is ambiguous, both method CodeSource(java.net.URL,java.security.cert.Certificate[]) in java.security.CodeSource and method CodeSource(java.net.URL,java.security.CodeSigner[]) in java.security.CodeSource match
    [javac]         final CodeSource csrc = new CodeSource (srcURL, null);
    [javac]                                 ^
    [javac] 1 error

BUILD FAILED
/srv/gump/public/workspace/emma/build.xml:297: Compile failed; see the compiler error output for details.

Total time: 6 seconds
---------------------------------------------

To subscribe to this information via syndicated feeds:
- RSS: http://vmgump.apache.org/gump/public/emma/emma/rss.xml
- Atom: http://vmgump.apache.org/gump/public/emma/emma/atom.xml

============================== Gump Tracking Only ===
Produced by Gump version 2.3.
Gump Run 15000008012009, vmgump:vmgump-public:15000008012009
Gump E-mail Identifier (unique within run) #63.

*********************************************************** G U M P
[GUMP@vmgump]: Project jtidy-cvs (in module jtidy) failed
To whom it may engage...
        
This is an automated request, but not an unsolicited one. For 
more information please visit http://gump.apache.org/nagged.html, 
and/or contact the folk at general@gump.apache.org.

Project jtidy-cvs has an issue affecting its community integration.
This issue affects 1 projects,
 and has been outstanding for 544 runs.
The current state of this project is 'Failed', with reason 'Configuration Failed'.
For reference only, the following projects are affected by this:
    - jtidy-cvs :  HTML Templates


Full details are available at:
    http://vmgump.apache.org/gump/public/jtidy/jtidy-cvs/index.html

That said, some information snippets are provided here.

The following annotations (debug/informational/warning/error messages) were provided:
 -DEBUG- Sole output [jtidy-08012009.jar] identifier set to project name
 -DEBUG- Dependency on xml-apis exists, no need to add for property maven.jar.dom3-xml-apis.
 -INFO- Failed with reason configuration failed
 -ERROR- Bad Dependency. Project: commons-logging : unknown to *this* workspace 
 -INFO- Failed to extract fallback artifacts from Gump Repository

To subscribe to this information via syndicated feeds:
- RSS: http://vmgump.apache.org/gump/public/jtidy/jtidy-cvs/rss.xml
- Atom: http://vmgump.apache.org/gump/public/jtidy/jtidy-cvs/atom.xml

============================== Gump Tracking Only ===
Produced by Gump version 2.3.
Gump Run 15000008012009, vmgump:vmgump-public:15000008012009
Gump E-mail Identifier (unique within run) #68.

*********************************************************** G U M P
[GUMP@vmgump]: Project portals-pluto-api-1.0 (in module portals-pluto-1.0) failed
To whom it may engage...
        
This is an automated request, but not an unsolicited one. For 
more information please visit http://gump.apache.org/nagged.html, 
and/or contact the folk at general@gump.apache.org.

Project portals-pluto-api-1.0 has an issue affecting its community integration.
This issue affects 1 projects,
 and has been outstanding for 470 runs.
The current state of this project is 'Failed', with reason 'Configuration Failed'.
For reference only, the following projects are affected by this:
    - portals-pluto-api-1.0 :  JSR168 Container


Full details are available at:
    http://vmgump.apache.org/gump/public/portals-pluto-1.0/portals-pluto-api-1.0/index.html

That said, some information snippets are provided here.

The following annotations (debug/informational/warning/error messages) were provided:
 -DEBUG- Dependency on ant exists, no need to add for property env.ANT_HOME.
 -INFO- Failed with reason configuration failed
 -ERROR- Bad Dependency. Project: commons-logging : unknown to *this* workspace 
 -INFO- Failed to extract fallback artifacts from Gump Repository

To subscribe to this information via syndicated feeds:
- RSS: http://vmgump.apache.org/gump/public/portals-pluto-1.0/portals-pluto-api-1.0/rss.xml
- Atom: http://vmgump.apache.org/gump/public/portals-pluto-1.0/portals-pluto-api-1.0/atom.xml

============================== Gump Tracking Only ===
Produced by Gump version 2.3.
Gump Run 15000008012009, vmgump:vmgump-public:15000008012009
Gump E-mail Identifier (unique within run) #70.

*********************************************************** G U M P
[GUMP@vmgump]: Project portals-pluto-descriptors-1.0 (in module portals-pluto-1.0) failed
To whom it may engage...
        
This is an automated request, but not an unsolicited one. For 
more information please visit http://gump.apache.org/nagged.html, 
and/or contact the folk at general@gump.apache.org.

Project portals-pluto-descriptors-1.0 has an issue affecting its community integration.
This issue affects 1 projects,
 and has been outstanding for 470 runs.
The current state of this project is 'Failed', with reason 'Configuration Failed'.
For reference only, the following projects are affected by this:
    - portals-pluto-descriptors-1.0 :  JSR168 Container


Full details are available at:
    http://vmgump.apache.org/gump/public/portals-pluto-1.0/portals-pluto-descriptors-1.0/index.html

That said, some information snippets are provided here.

The following annotations (debug/informational/warning/error messages) were provided:
 -DEBUG- Dependency on ant exists, no need to add for property env.ANT_HOME.
 -INFO- Failed with reason configuration failed
 -ERROR- Bad Dependency. Project: commons-logging : unknown to *this* workspace 
 -INFO- Failed to extract fallback artifacts from Gump Repository

To subscribe to this information via syndicated feeds:
- RSS: http://vmgump.apache.org/gump/public/portals-pluto-1.0/portals-pluto-descriptors-1.0/rss.xml
- Atom: http://vmgump.apache.org/gump/public/portals-pluto-1.0/portals-pluto-descriptors-1.0/atom.xml

============================== Gump Tracking Only ===
Produced by Gump version 2.3.
Gump Run 15000008012009, vmgump:vmgump-public:15000008012009
Gump E-mail Identifier (unique within run) #71.

*********************************************************** G U M P
[GUMP@vmgump]: Project xml-security-tests (in module xml-security) failed
To whom it may engage...
        
This is an automated request, but not an unsolicited one. For 
more information please visit http://gump.apache.org/nagged.html, 
and/or contact the folk at general@gump.apache.org.

Project xml-security-tests has an issue affecting its community integration.
This issue affects 1 projects,
 and has been outstanding for 166 runs.
The current state of this project is 'Failed', with reason 'Configuration Failed'.
For reference only, the following projects are affected by this:
    - xml-security-tests :  XML-Signature Syntax and Processing


Full details are available at:
    http://vmgump.apache.org/gump/public/xml-security/xml-security-tests/index.html

That said, some information snippets are provided here.

The following annotations (debug/informational/warning/error messages) were provided:
 -DEBUG- Dependency on jce exists, no need to add for property lib.jce.
 -INFO- Failed with reason configuration failed
 -ERROR- Bad Dependency. Project: commons-logging : unknown to *this* workspace 

To subscribe to this information via syndicated feeds:
- RSS: http://vmgump.apache.org/gump/public/xml-security/xml-security-tests/rss.xml
- Atom: http://vmgump.apache.org/gump/public/xml-security/xml-security-tests/atom.xml

============================== Gump Tracking Only ===
Produced by Gump version 2.3.
Gump Run 15000008012009, vmgump:vmgump-public:15000008012009
Gump E-mail Identifier (unique within run) #75.

*********************************************************** G U M P
[GUMP@vmgump]: Project apache-httpd-configure (in module apache-httpd) failed
To whom it may engage...
        
This is an automated request, but not an unsolicited one. For 
more information please visit http://gump.apache.org/nagged.html, 
and/or contact the folk at general@gump.apache.org.

Project apache-httpd-configure has an issue affecting its community integration.
This issue affects 6 projects,
 and has been outstanding for 13 runs.
The current state of this project is 'Failed', with reason 'Build Failed'.
For reference only, the following projects are affected by this:
    - apache-httpd-configure :  Apache HTTP Server
    - apache-httpd-make :  Apache HTTP Server
    - apache-httpd-make-install :  Apache HTTP Server
    - jakarta-tomcat-jk-native :  Connectors to various web servers
    - jakarta-tomcat-jk-native-buildconf :  Connectors to various web servers
    - jakarta-tomcat-jk-native-configure :  Connectors to various web servers


Full details are available at:
    http://vmgump.apache.org/gump/public/apache-httpd/apache-httpd-configure/index.html

That said, some information snippets are provided here.

The following annotations (debug/informational/warning/error messages) were provided:
 -INFO- Failed with reason build failed



The following work was performed:
http://vmgump.apache.org/gump/public/apache-httpd/apache-httpd-configure/gump_work/buildscript_apache-httpd_apache-httpd-configure.html
Work Name: buildscript_apache-httpd_apache-httpd-configure (Type: Build)
Work ended in a state of : Failed
Elapsed: 6 secs
Command Line: /srv/gump/public/workspace/apache-httpd/configure --with-apr-util=/srv/gump/public/workspace/apr-util/dest-08012009 --with-apr=/srv/gump/public/workspace/apr/dest-08012009 --prefix=/srv/gump/public/workspace/apache-httpd/dest-08012009 --with-pcre=/srv/gump/public/workspace/pcre/dest-08012009 
[Working Directory: /srv/gump/public/workspace/apache-httpd]
---------------------------------------------
checking for chosen layout... Apache
checking for working mkdir -p... yes
checking build system type... i686-pc-linux-gnu
checking host system type... i686-pc-linux-gnu
checking target system type... i686-pc-linux-gnu

Configuring Apache Portable Runtime library ...

checking for APR... configure: error: the --with-apr parameter is incorrect. It must specify an install prefix, a build directory, or an apr-config file.
---------------------------------------------

To subscribe to this information via syndicated feeds:
- RSS: http://vmgump.apache.org/gump/public/apache-httpd/apache-httpd-configure/rss.xml
- Atom: http://vmgump.apache.org/gump/public/apache-httpd/apache-httpd-configure/atom.xml

============================== Gump Tracking Only ===
Produced by Gump version 2.3.
Gump Run 15000008012009, vmgump:vmgump-public:15000008012009
Gump E-mail Identifier (unique within run) #77.

*********************************************************** G U M P
[GUMP@vmgump]: Project portals-bridges-common (in module portals-bridges) failed
To whom it may engage...
        
This is an automated request, but not an unsolicited one. For 
more information please visit http://gump.apache.org/nagged.html, 
and/or contact the folk at general@gump.apache.org.

Project portals-bridges-common has an issue affecting its community integration.
This issue affects 2 projects,
 and has been outstanding for 470 runs.
The current state of this project is 'Failed', with reason 'Build Failed'.
For reference only, the following projects are affected by this:
    - portals-bridges-common :  Support for JSR168 compliant Portlet development
    - portals-bridges-velocity :  Support for JSR168 compliant Portlet development


Full details are available at:
    http://vmgump.apache.org/gump/public/portals-bridges/portals-bridges-common/index.html

That said, some information snippets are provided here.

The following annotations (debug/informational/warning/error messages) were provided:
 -DEBUG- Sole output [portals-bridges-common-08012009.jar] identifier set to project name
 -DEBUG- Dependency on portals-pluto-api-1.0 exists, no need to add for property maven.jar.portlet-api.
 -DEBUG- Dependency on jakarta-servletapi-5-servlet exists, no need to add for property maven.jar.servletapi.
 -DEBUG- (Gump generated) Maven Properties in: /srv/gump/public/workspace/portals-bridges/common/build.properties
 -INFO- Failed with reason build failed
 -DEBUG- Maven POM in: /srv/gump/public/workspace/portals-bridges/common/project.xml
 -DEBUG- Maven project properties in: /srv/gump/public/workspace/portals-bridges/common/project.properties
 -INFO- Failed to extract fallback artifacts from Gump Repository



The following work was performed:
http://vmgump.apache.org/gump/public/portals-bridges/portals-bridges-common/gump_work/build_portals-bridges_portals-bridges-common.html
Work Name: build_portals-bridges_portals-bridges-common (Type: Build)
Work ended in a state of : Failed
Elapsed: 2 secs
Command Line: maven --offline jar 
[Working Directory: /srv/gump/public/workspace/portals-bridges/common]
CLASSPATH: /usr/lib/jvm/java-1.5.0-sun/lib/tools.jar:/srv/gump/public/workspace/jakarta-servletapi-5/jsr154/dist/lib/servlet-api.jar:/srv/gump/public/workspace/portals-pluto-1.0/api/target/portlet-api-1.0.jar
---------------------------------------------
 __  __
|  \/  |__ _Apache__ ___
| |\/| / _` \ V / -_) ' \  ~ intelligent projects ~
|_|  |_\__,_|\_/\___|_||_|  v. 1.0.2

The build cannot continue because of the following unsatisfied dependency:

portlet-api-1.0.jar; path override doesn't exist: /srv/gump/public/workspace/portals-pluto-1.0/api/target/portlet-api-1.0.jar

Total time: 2 seconds
Finished at: Thu Jan 08 02:05:14 GMT-08:00 2009

---------------------------------------------

To subscribe to this information via syndicated feeds:
- RSS: http://vmgump.apache.org/gump/public/portals-bridges/portals-bridges-common/rss.xml
- Atom: http://vmgump.apache.org/gump/public/portals-bridges/portals-bridges-common/atom.xml

============================== Gump Tracking Only ===
Produced by Gump version 2.3.
Gump Run 15000008012009, vmgump:vmgump-public:15000008012009
Gump E-mail Identifier (unique within run) #90.

*********************************************************** G U M P
[GUMP@vmgump]: Project portals-bridges-struts (in module portals-bridges) failed
To whom it may engage...
        
This is an automated request, but not an unsolicited one. For 
more information please visit http://gump.apache.org/nagged.html, 
and/or contact the folk at general@gump.apache.org.

Project portals-bridges-struts has an issue affecting its community integration.
This issue affects 1 projects,
 and has been outstanding for 470 runs.
The current state of this project is 'Failed', with reason 'Configuration Failed'.
For reference only, the following projects are affected by this:
    - portals-bridges-struts :  Support for JSR168 compliant Portlet development


Full details are available at:
    http://vmgump.apache.org/gump/public/portals-bridges/portals-bridges-struts/index.html

That said, some information snippets are provided here.

The following annotations (debug/informational/warning/error messages) were provided:
 -DEBUG- Sole output [portals-bridges-struts-08012009.jar] identifier set to project name
 -DEBUG- Dependency on portals-pluto-api-1.0 exists, no need to add for property maven.jar.portlet-api.
 -DEBUG- Dependency on jakarta-servletapi-4 exists, no need to add for property maven.jar.servletapi.
 -DEBUG- Dependency on packaged-struts12 exists, no need to add for property maven.jar.struts.
 -DEBUG- Dependency on packaged-struts-el12 exists, no need to add for property maven.jar.struts-el.
 -INFO- Failed with reason configuration failed
 -ERROR- Bad Dependency. Project: commons-beanutils : unknown to *this* workspace 
 -ERROR- Bad Dependency. Project: commons-digester : unknown to *this* workspace 
 -ERROR- Bad Dependency. Project: commons-logging : unknown to *this* workspace 
 -INFO- Failed to extract fallback artifacts from Gump Repository

To subscribe to this information via syndicated feeds:
- RSS: http://vmgump.apache.org/gump/public/portals-bridges/portals-bridges-struts/rss.xml
- Atom: http://vmgump.apache.org/gump/public/portals-bridges/portals-bridges-struts/atom.xml

============================== Gump Tracking Only ===
Produced by Gump version 2.3.
Gump Run 15000008012009, vmgump:vmgump-public:15000008012009
Gump E-mail Identifier (unique within run) #91.

*********************************************************** G U M P
[GUMP@vmgump]: Project portals-pluto-container-1.0 (in module portals-pluto-1.0) failed
To whom it may engage...
        
This is an automated request, but not an unsolicited one. For 
more information please visit http://gump.apache.org/nagged.html, 
and/or contact the folk at general@gump.apache.org.

Project portals-pluto-container-1.0 has an issue affecting its community integration.
This issue affects 1 projects,
 and has been outstanding for 470 runs.
The current state of this project is 'Failed', with reason 'Configuration Failed'.
For reference only, the following projects are affected by this:
    - portals-pluto-container-1.0 :  JSR168 Container


Full details are available at:
    http://vmgump.apache.org/gump/public/portals-pluto-1.0/portals-pluto-container-1.0/index.html

That said, some information snippets are provided here.

The following annotations (debug/informational/warning/error messages) were provided:
 -DEBUG- Dependency on ant exists, no need to add for property env.ANT_HOME.
 -INFO- Failed with reason configuration failed
 -ERROR- Bad Dependency. Project: commons-logging : unknown to *this* workspace 
 -INFO- Failed to extract fallback artifacts from Gump Repository

To subscribe to this information via syndicated feeds:
- RSS: http://vmgump.apache.org/gump/public/portals-pluto-1.0/portals-pluto-container-1.0/rss.xml
- Atom: http://vmgump.apache.org/gump/public/portals-pluto-1.0/portals-pluto-container-1.0/atom.xml

============================== Gump Tracking Only ===
Produced by Gump version 2.3.
Gump Run 15000008012009, vmgump:vmgump-public:15000008012009
Gump E-mail Identifier (unique within run) #92.

*********************************************************** G U M P
[GUMP@vmgump]: Project portals-pluto-portal-1.0 (in module portals-pluto-1.0) failed
To whom it may engage...
        
This is an automated request, but not an unsolicited one. For 
more information please visit http://gump.apache.org/nagged.html, 
and/or contact the folk at general@gump.apache.org.

Project portals-pluto-portal-1.0 has an issue affecting its community integration.
This issue affects 1 projects,
 and has been outstanding for 471 runs.
The current state of this project is 'Failed', with reason 'Configuration Failed'.
For reference only, the following projects are affected by this:
    - portals-pluto-portal-1.0 :  JSR168 Container


Full details are available at:
    http://vmgump.apache.org/gump/public/portals-pluto-1.0/portals-pluto-portal-1.0/index.html

That said, some information snippets are provided here.

The following annotations (debug/informational/warning/error messages) were provided:
 -DEBUG- Dependency on ant exists, no need to add for property env.ANT_HOME.
 -INFO- Failed with reason configuration failed
 -ERROR- Bad Dependency. Project: commons-fileupload : unknown to *this* workspace 
 -ERROR- Bad Dependency. Project: commons-logging : unknown to *this* workspace 
 -INFO- Failed to extract fallback artifacts from Gump Repository

To subscribe to this information via syndicated feeds:
- RSS: http://vmgump.apache.org/gump/public/portals-pluto-1.0/portals-pluto-portal-1.0/rss.xml
- Atom: http://vmgump.apache.org/gump/public/portals-pluto-1.0/portals-pluto-portal-1.0/atom.xml

============================== Gump Tracking Only ===
Produced by Gump version 2.3.
Gump Run 15000008012009, vmgump:vmgump-public:15000008012009
Gump E-mail Identifier (unique within run) #93.

*********************************************************** G U M P
[GUMP@vmgump]: Module jakarta-bsf success, but with warnings.
To whom it may engage...
        
This is an automated request, but not an unsolicited one. For 
more information please visit http://gump.apache.org/nagged.html, 
and/or contact the folk at general@gump.apache.org.

Module jakarta-bsf contains errors.
The current state of this module is 'Success'.

Full details are available at:
    http://vmgump.apache.org/gump/public/jakarta-bsf/index.html

That said, some information snippets are provided here.

The following annotations (debug/informational/warning/error messages) were provided:
 -ERROR- *** Failed to update from source control. Stale contents ***



The following work was performed:
http://vmgump.apache.org/gump/public/jakarta-bsf/gump_work/update_jakarta-bsf.html
Work Name: update_jakarta-bsf (Type: Update)
Work ended in a state of : Failed
Elapsed: 
Command Line: svn --quiet update --non-interactive jakarta-bsf 
[Working Directory: /srv/gump/public/workspace/cvs]
---------------------------------------------
svn: Working copy 'jakarta-bsf' locked
svn: run 'svn cleanup' to remove locks (type 'svn help cleanup' for details)
---------------------------------------------

To subscribe to this information via syndicated feeds:
- RSS: http://vmgump.apache.org/gump/public/jakarta-bsf/rss.xml
- Atom: http://vmgump.apache.org/gump/public/jakarta-bsf/atom.xml

============================== Gump Tracking Only ===
Produced by Gump version 2.3.
Gump Run 15000008012009, vmgump:vmgump-public:15000008012009
Gump E-mail Identifier (unique within run) #95.

*********************************************************** G U M P
[GUMP@vmgump]: Project apacheds-shared (in module apacheds) failed
To whom it may engage...
        
This is an automated request, but not an unsolicited one. For 
more information please visit http://gump.apache.org/nagged.html, 
and/or contact the folk at general@gump.apache.org.

Project apacheds-shared has an issue affecting its community integration.
This issue affects 2 projects,
 and has been outstanding for 64 runs.
The current state of this project is 'Failed', with reason 'Build Failed'.
For reference only, the following projects are affected by this:
    - apacheds-shared :  Apache Directory Server
    - maven-directory-plugin :  Apache Directory Server


Full details are available at:
    http://vmgump.apache.org/gump/public/apacheds/apacheds-shared/index.html

That said, some information snippets are provided here.

The following annotations (debug/informational/warning/error messages) were provided:
 -DEBUG- Sole output [apacheds-shared-08012009.jar] identifier set to project name
 -DEBUG- (Gump generated) Maven Properties in: /srv/gump/public/workspace/apacheds/shared/build.properties
 -INFO- Failed with reason build failed
 -INFO- Project Reports in: /srv/gump/public/workspace/apacheds/shared/target/test-reports
 -INFO- Failed to extract fallback artifacts from Gump Repository



The following work was performed:
http://vmgump.apache.org/gump/public/apacheds/apacheds-shared/gump_work/build_apacheds_apacheds-shared.html
Work Name: build_apacheds_apacheds-shared (Type: Build)
Work ended in a state of : Failed
Elapsed: 4 secs
Command Line: maven --offline jar 
[Working Directory: /srv/gump/public/workspace/apacheds/shared]
CLASSPATH: /usr/lib/jvm/java-1.5.0-sun/lib/tools.jar:/srv/gump/public/workspace/junit/dist/junit-08012009.jar:/srv/gump/public/workspace/directory-shared/ldap/target/shared-ldap-0.9.14-SNAPSHOT.jar
---------------------------------------------
 __  __
|  \/  |__ _Apache__ ___
| |\/| / _` \ V / -_) ' \  ~ intelligent projects ~
|_|  |_\__,_|\_/\___|_||_|  v. 1.0.2

build:start:

java:prepare-filesystem:
    [mkdir] Created dir: /srv/gump/public/workspace/apacheds/shared/target/classes

java:compile:
    [echo] Compiling to /srv/gump/public/workspace/apacheds/shared/target/classes
    [echo] No java source files to compile.
resources or todir was null

java:jar-resources:

test:prepare-filesystem:
    [mkdir] Created dir: /srv/gump/public/workspace/apacheds/shared/target/test-classes
    [mkdir] Created dir: /srv/gump/public/workspace/apacheds/shared/target/test-reports

test:test-resources:

test:compile:
    [echo] No test source files to compile.

test:test:
    [echo] No tests to run.

BUILD FAILED
File...... /home/gump/.maven/cache/maven-jar-plugin-1.6.1/plugin.jelly
Element... ant:fail
Line...... 53
Column.... 19
You must define currentVersion in your POM.
Total time: 3 seconds
Finished at: Thu Jan 08 02:07:12 GMT-08:00 2009

---------------------------------------------

To subscribe to this information via syndicated feeds:
- RSS: http://vmgump.apache.org/gump/public/apacheds/apacheds-shared/rss.xml
- Atom: http://vmgump.apache.org/gump/public/apacheds/apacheds-shared/atom.xml

============================== Gump Tracking Only ===
Produced by Gump version 2.3.
Gump Run 15000008012009, vmgump:vmgump-public:15000008012009
Gump E-mail Identifier (unique within run) #98.

*********************************************************** G U M P
[GUMP@vmgump]: Module jakarta-tomcat success, but with warnings.
To whom it may engage...
        
This is an automated request, but not an unsolicited one. For 
more information please visit http://gump.apache.org/nagged.html, 
and/or contact the folk at general@gump.apache.org.

Module jakarta-tomcat contains errors.
The current state of this module is 'Success'.

Full details are available at:
    http://vmgump.apache.org/gump/public/jakarta-tomcat/index.html

That said, some information snippets are provided here.

The following annotations (debug/informational/warning/error messages) were provided:
 -ERROR- *** Failed to update from source control. Stale contents ***



The following work was performed:
http://vmgump.apache.org/gump/public/jakarta-tomcat/gump_work/update_jakarta-tomcat.html
Work Name: update_jakarta-tomcat (Type: Update)
Work ended in a state of : Failed
Elapsed: 7 secs
Command Line: svn --quiet update --non-interactive jakarta-tomcat 
[Working Directory: /srv/gump/public/workspace/cvs]
---------------------------------------------
svn: REPORT request failed on '/repos/asf/!svn/vcc/default'
svn: Target path does not exist
---------------------------------------------

To subscribe to this information via syndicated feeds:
- RSS: http://vmgump.apache.org/gump/public/jakarta-tomcat/rss.xml
- Atom: http://vmgump.apache.org/gump/public/jakarta-tomcat/atom.xml

============================== Gump Tracking Only ===
Produced by Gump version 2.3.
Gump Run 15000008012009, vmgump:vmgump-public:15000008012009
Gump E-mail Identifier (unique within run) #103.

*********************************************************** G U M P
[GUMP@vmgump]: Project hivemind (in module hivemind) failed
To whom it may engage...
        
This is an automated request, but not an unsolicited one. For 
more information please visit http://gump.apache.org/nagged.html, 
and/or contact the folk at general@gump.apache.org.

Project hivemind has an issue affecting its community integration.
This issue affects 2 projects,
 and has been outstanding for 549 runs.
The current state of this project is 'Failed', with reason 'Build Failed'.
For reference only, the following projects are affected by this:
    - hivemind :  HiveMind is a services and configuration
    microkernel
    - hivemind-test :  HiveMind is a services and configuration
    microkernel


Full details are available at:
    http://vmgump.apache.org/gump/public/hivemind/hivemind/index.html

That said, some information snippets are provided here.

The following annotations (debug/informational/warning/error messages) were provided:
 -WARNING- Bad *Optional* Dependency. Project: commons-dbcp : unknown to *this* workspace
 -WARNING- Bad *Optional* Dependency. Project: commons-fileupload : unknown to *this* workspace
 -WARNING- Bad *Optional* Dependency. Project: commons-logging : unknown to *this* workspace
 -WARNING- Bad *Optional* Dependency. Project: commons-net : unknown to *this* workspace
 -WARNING- Bad *Optional* Dependency. Project: commons-pool : unknown to *this* workspace
 -INFO- Optional dependency mx4j-tools failed with reason build failed
 -DEBUG- (Gump generated) Maven2 Settings in: /srv/gump/public/workspace/hivemind/gump_mvn_settings.xml
 -INFO- Failed with reason build failed
 -DEBUG- Maven POM in: /srv/gump/public/workspace/hivemind/pom.xml
 -INFO- Failed to extract fallback artifacts from Gump Repository



The following work was performed:
http://vmgump.apache.org/gump/public/hivemind/hivemind/gump_work/build_hivemind_hivemind.html
Work Name: build_hivemind_hivemind (Type: Build)
Work ended in a state of : Failed
Elapsed: 25 secs
Command Line: mvn --batch-mode -Dmaven.test.skip=true --settings /srv/gump/public/workspace/hivemind/gump_mvn_settings.xml package 
[Working Directory: /srv/gump/public/workspace/hivemind]
CLASSPATH: /usr/lib/jvm/java-1.5.0-sun/lib/tools.jar:/srv/gump/public/workspace/aopalliance/build/aopalliance.jar:/srv/gump/public/workspace/asm/output/dist/lib/asm-analysis-08012009.jar:/srv/gump/public/workspace/asm/output/dist/lib/asm-util-08012009.jar:/srv/gump/public/workspace/asm/output/dist/lib/asm-xml-08012009.jar:/srv/gump/public/workspace/asm/output/dist/lib/asm-commons-08012009.jar:/srv/gump/public/workspace/asm/output/dist/lib/asm-08012009.jar:/srv/gump/public/workspace/asm/output/dist/lib/asm-tree-08012009.jar:/srv/gump/packages/cglib/cglib-nodep-2.1_3.jar:/srv/gump/packages/easymock1.2_Java1.3/easymock.jar:/srv/gump/packages/easymockclassextension1.2/easymockclassextension.jar:/srv/gump/packages/ejb-2_0-fr/ejb.jar:/srv/gump/public/workspace/jakarta-oro/jakarta-oro-08012009.jar:/srv/gump/public/workspace/jakarta-servletapi-4/lib/servlet.jar:/srv/gump/public/workspace/javassist/javassist.jar:/srv/gump/public/workspace/junit/dist/junit-08012009.jar:/srv/gump/public
 /workspace/logging-log4j-12/dist/lib/log4j-08012009.jar:mx4j-impl-gump-07012009.jar:mx4j-jmx-gump-07012009.jar:mx4j-gump-07012009.jar:mx4j-rjmx-gump-07012009.jar:mx4j-remote-gump-07012009.jar:mx4j-rimpl-gump-07012009.jar:mx4j-tools-gump-07012009.jar:/srv/gump/packages/groovy-1.0-jsr-03/groovy-1.0-jsr-03.jar:/srv/gump/packages/spring-framework-1.2.6/dist/spring-beans.jar:/srv/gump/packages/spring-framework-1.2.6/dist/spring-core.jar:/srv/gump/public/workspace/xml-commons/java/external/build/xml-apis-ext.jar
---------------------------------------------
Downloading: http://localhost:8192/maven2/groovy/groovy-all/1.0-jsr-03/groovy-all-1.0-jsr-03.pom
155b downloaded
Downloading: http://localhost:8192/maven2/jboss/jboss-j2ee/3.2.1/jboss-j2ee-3.2.1.pom
149b downloaded
Downloading: http://localhost:8192/maven2/org/springframework/spring-full/1.0.1/spring-full-1.0.1.pom
164b downloaded
Downloading: http://localhost:8192/maven2/groovy/groovy-all/1.0-jsr-03/groovy-all-1.0-jsr-03.jar
1064K downloaded
Downloading: http://localhost:8192/maven2/jboss/jboss-j2ee/3.2.1/jboss-j2ee-3.2.1.jar
68K downloaded
Downloading: http://localhost:8192/maven2/org/springframework/spring-full/1.0.1/spring-full-1.0.1.jar
959K downloaded
[INFO] ------------------------------------------------------------------------
[ERROR] BUILD ERROR
[INFO] ------------------------------------------------------------------------
[INFO] Failed to resolve artifact.

Missing:
----------
1) org.apache.hivemind:hivemind:jar:tests:1.2-SNAPSHOT

  Try downloading the file manually from the project website.

  Then, install it using the command: 
      mvn install:install-file -DgroupId=org.apache.hivemind -DartifactId=hivemind -Dversion=1.2-SNAPSHOT -Dclassifier=tests -Dpackaging=jar -Dfile=/path/to/file

  Alternatively, if you host your own repository you can deploy the file there: 
      mvn deploy:deploy-file -DgroupId=org.apache.hivemind -DartifactId=hivemind -Dversion=1.2-SNAPSHOT -Dclassifier=tests -Dpackaging=jar -Dfile=/path/to/file -Durl=[url] -DrepositoryId=[id]

  Path to dependency: 
  	1) org.apache.hivemind:hivemind-lib:jar:1.2-SNAPSHOT
  	2) org.apache.hivemind:hivemind:jar:tests:1.2-SNAPSHOT

----------
1 required artifact is missing.

for artifact: 
  org.apache.hivemind:hivemind-lib:jar:1.2-SNAPSHOT

from the specified remote repositories:
  Gump (http://localhost:8192/maven2)


[INFO] ------------------------------------------------------------------------
[INFO] For more information, run Maven with the -e switch
[INFO] ------------------------------------------------------------------------
[INFO] Total time: 24 seconds
[INFO] Finished at: Thu Jan 08 02:09:06 GMT-08:00 2009
[INFO] Final Memory: 10M/30M
[INFO] ------------------------------------------------------------------------
---------------------------------------------

To subscribe to this information via syndicated feeds:
- RSS: http://vmgump.apache.org/gump/public/hivemind/hivemind/rss.xml
- Atom: http://vmgump.apache.org/gump/public/hivemind/hivemind/atom.xml

============================== Gump Tracking Only ===
Produced by Gump version 2.3.
Gump Run 15000008012009, vmgump:vmgump-public:15000008012009
Gump E-mail Identifier (unique within run) #107.

*********************************************************** G U M P
[GUMP@vmgump]: Project naming-management (in module directory-naming) failed
To whom it may engage...
        
This is an automated request, but not an unsolicited one. For 
more information please visit http://gump.apache.org/nagged.html, 
and/or contact the folk at general@gump.apache.org.

Project naming-management has an issue affecting its community integration.
This issue affects 1 projects,
 and has been outstanding for 137 runs.
The current state of this project is 'Failed', with reason 'Build Failed'.
For reference only, the following projects are affected by this:
    - naming-management :  Apache Directory Naming Component


Full details are available at:
    http://vmgump.apache.org/gump/public/directory-naming/naming-management/index.html

That said, some information snippets are provided here.

The following annotations (debug/informational/warning/error messages) were provided:
 -DEBUG- Sole output [naming-management-08012009.jar] identifier set to project name
 -DEBUG- Dependency on mx4j exists, no need to add for property maven.jar.mx4j-jmx.
 -DEBUG- (Gump generated) Maven Properties in: /srv/gump/public/workspace/directory-naming/naming-management/build.properties
 -INFO- Failed with reason build failed
 -DEBUG- Maven POM in: /srv/gump/public/workspace/directory-naming/naming-management/project.xml
 -DEBUG- Maven project properties in: /srv/gump/public/workspace/directory-naming/naming-management/project.properties
 -INFO- Project Reports in: /srv/gump/public/workspace/directory-naming/naming-management/target/test-reports
 -WARNING- No directory [/srv/gump/public/workspace/directory-naming/naming-management/target/test-reports]
 -DEBUG- Extracted fallback artifacts from Gump Repository



The following work was performed:
http://vmgump.apache.org/gump/public/directory-naming/naming-management/gump_work/build_directory-naming_naming-management.html
Work Name: build_directory-naming_naming-management (Type: Build)
Work ended in a state of : Failed
Elapsed: 3 secs
Command Line: maven --offline jar 
[Working Directory: /srv/gump/public/workspace/directory-naming/naming-management]
CLASSPATH: /usr/lib/jvm/java-1.5.0-sun/lib/tools.jar:/srv/gump/public/workspace/junit/dist/junit-08012009.jar:mx4j-jmx-gump-07012009.jar:naming-core-gump-07012009.jar:naming-java-gump-07012009.jar:/srv/gump/packages/maven-site-plugin/maven-site-plugin-1.6.1.jar
---------------------------------------------
 __  __
|  \/  |__ _Apache__ ___
| |\/| / _` \ V / -_) ' \  ~ intelligent projects ~
|_|  |_\__,_|\_/\___|_||_|  v. 1.0.2

The build cannot continue because of the following unsatisfied dependencies:

naming-core-0.9-SNAPSHOT.jar; path override doesn't exist: /srv/gump/public/workspace/directory-naming/naming-management/naming-core-gump-07012009.jar
mx4j-jmx-1.1.1.jar; path override doesn't exist: /srv/gump/public/workspace/directory-naming/naming-management/mx4j-jmx-gump-07012009.jar
naming-java-0.9-SNAPSHOT.jar; path override doesn't exist: /srv/gump/public/workspace/directory-naming/naming-management/naming-java-gump-07012009.jar

Total time: 2 seconds
Finished at: Thu Jan 08 02:09:29 GMT-08:00 2009

---------------------------------------------

To subscribe to this information via syndicated feeds:
- RSS: http://vmgump.apache.org/gump/public/directory-naming/naming-management/rss.xml
- Atom: http://vmgump.apache.org/gump/public/directory-naming/naming-management/atom.xml

============================== Gump Tracking Only ===
Produced by Gump version 2.3.
Gump Run 15000008012009, vmgump:vmgump-public:15000008012009
Gump E-mail Identifier (unique within run) #108.

*********************************************************** G U M P
[GUMP@vmgump]: Project tapestry (in module tapestry) failed
To whom it may engage...
        
This is an automated request, but not an unsolicited one. For 
more information please visit http://gump.apache.org/nagged.html, 
and/or contact the folk at general@gump.apache.org.

Project tapestry has an issue affecting its community integration.
This issue affects 1 projects,
 and has been outstanding for 604 runs.
The current state of this project is 'Failed', with reason 'Build Failed'.
For reference only, the following projects are affected by this:
    - tapestry :  Component-based web application framework organized around i...


Full details are available at:
    http://vmgump.apache.org/gump/public/tapestry/tapestry/index.html

That said, some information snippets are provided here.

The following annotations (debug/informational/warning/error messages) were provided:
 -DEBUG- Sole output [tapestry-08012009.jar] identifier set to project name
 -WARNING- Bad *Optional* Dependency. Project: commons-beanutils : unknown to *this* workspace
 -WARNING- Bad *Optional* Dependency. Project: commons-codec : unknown to *this* workspace
 -WARNING- Bad *Optional* Dependency. Project: commons-digester : unknown to *this* workspace
 -WARNING- Bad *Optional* Dependency. Project: commons-digester : unknown to *this* workspace
 -WARNING- Bad *Optional* Dependency. Project: commons-fileupload : unknown to *this* workspace
 -WARNING- Bad *Optional* Dependency. Project: commons-io : unknown to *this* workspace
 -WARNING- Bad *Optional* Dependency. Project: commons-lang : unknown to *this* workspace
 -WARNING- Bad *Optional* Dependency. Project: commons-logging : unknown to *this* workspace
 -INFO- Optional dependency hivemind failed with reason build failed
 -DEBUG- (Gump generated) Maven2 Settings in: /srv/gump/public/workspace/tapestry/gump_mvn_settings.xml
 -INFO- Failed with reason build failed
 -DEBUG- Maven POM in: /srv/gump/public/workspace/tapestry/pom.xml
 -INFO- Failed to extract fallback artifacts from Gump Repository



The following work was performed:
http://vmgump.apache.org/gump/public/tapestry/tapestry/gump_work/build_tapestry_tapestry.html
Work Name: build_tapestry_tapestry (Type: Build)
Work ended in a state of : Failed
Elapsed: 1 min 23 secs
Command Line: mvn --batch-mode --settings /srv/gump/public/workspace/tapestry/gump_mvn_settings.xml package 
[Working Directory: /srv/gump/public/workspace/tapestry]
CLASSPATH: /usr/lib/jvm/java-1.5.0-sun/lib/tools.jar:/srv/gump/packages/easymock1.2_Java1.3/easymock.jar:/srv/gump/packages/easymockclassextension1.2/easymockclassextension.jar:/srv/gump/public/workspace/hivemind/framework/target/hivemind-1.2.1.jar:/srv/gump/public/workspace/hivemind/library/target/hivemind-lib-1.2.1.jar:/srv/gump/public/workspace/jakarta-oro/jakarta-oro-08012009.jar:/srv/gump/public/workspace/jakarta-servletapi-4/lib/servlet.jar:/srv/gump/public/workspace/javassist/javassist.jar:/srv/gump/public/workspace/jdom/build/jdom.jar:/srv/gump/public/workspace/logging-log4j-12/dist/lib/log4j-08012009.jar:/srv/gump/packages/ognl-2.6.7/ognl-2.6.7.jar:/srv/gump/public/workspace/xml-commons/java/external/build/xml-apis-ext.jar:/srv/gump/packages/jCharts-0.7.5/jCharts-0.7.5.jar
---------------------------------------------
location: class ognl.ObjectPropertyAccessor

/srv/gump/public/workspace/tapestry/tapestry-framework/src/java/org/apache/tapestry/listener/ListenerMapPropertyAccessor.java:[91,36] cannot find symbol
symbol  : method getCompiler()
location: class ognl.OgnlRuntime

/srv/gump/public/workspace/tapestry/tapestry-framework/src/java/org/apache/tapestry/listener/ListenerMapPropertyAccessor.java:[93,12] cannot find symbol
symbol  : variable ExpressionCompiler
location: class org.apache.tapestry.listener.ListenerMapPropertyAccessor

/srv/gump/public/workspace/tapestry/tapestry-framework/src/java/org/apache/tapestry/listener/ListenerMapPropertyAccessor.java:[95,19] cannot find symbol
symbol  : method setCurrentAccessor(java.lang.Class)
location: class ognl.OgnlContext

/srv/gump/public/workspace/tapestry/tapestry-framework/src/java/org/apache/tapestry/listener/ListenerMapPropertyAccessor.java:[96,19] cannot find symbol
symbol  : method setCurrentType(java.lang.Class)
location: class ognl.OgnlContext

/srv/gump/public/workspace/tapestry/tapestry-framework/src/java/org/apache/tapestry/listener/ListenerMapPropertyAccessor.java:[101,20] cannot find symbol
symbol  : method getSourceAccessor(ognl.OgnlContext,java.lang.Object,java.lang.Object)
location: class ognl.ObjectPropertyAccessor

/srv/gump/public/workspace/tapestry/tapestry-framework/src/java/org/apache/tapestry/listener/ListenerMapPropertyAccessor.java:[106,18] cannot find symbol
symbol  : class UnsupportedCompilationException
location: class org.apache.tapestry.listener.ListenerMapPropertyAccessor

/srv/gump/public/workspace/tapestry/tapestry-framework/src/java/org/apache/tapestry/services/impl/ExpressionEvaluatorImpl.java:[95,19] cannot find symbol
symbol  : method setCompiler(org.apache.tapestry.services.impl.HiveMindExpressionCompiler)
location: class ognl.OgnlRuntime

/srv/gump/public/workspace/tapestry/tapestry-framework/src/java/org/apache/tapestry/services/impl/ExpressionEvaluatorImpl.java:[109,16] cannot find symbol
symbol  : method getAccessor()
location: interface ognl.Node

/srv/gump/public/workspace/tapestry/tapestry-framework/src/java/org/apache/tapestry/services/impl/ExpressionEvaluatorImpl.java:[110,36] cannot find symbol
symbol  : method getAccessor()
location: interface ognl.Node

/srv/gump/public/workspace/tapestry/tapestry-framework/src/java/org/apache/tapestry/services/impl/ExpressionEvaluatorImpl.java:[246,23] cannot find symbol
symbol  : method clearCache()
location: class ognl.OgnlRuntime


[INFO] ------------------------------------------------------------------------
[INFO] For more information, run Maven with the -e switch
[INFO] ------------------------------------------------------------------------
[INFO] Total time: 1 minute 21 seconds
[INFO] Finished at: Thu Jan 08 02:11:39 GMT-08:00 2009
[INFO] Final Memory: 9M/47M
[INFO] ------------------------------------------------------------------------
---------------------------------------------

To subscribe to this information via syndicated feeds:
- RSS: http://vmgump.apache.org/gump/public/tapestry/tapestry/rss.xml
- Atom: http://vmgump.apache.org/gump/public/tapestry/tapestry/atom.xml

============================== Gump Tracking Only ===
Produced by Gump version 2.3.
Gump Run 15000008012009, vmgump:vmgump-public:15000008012009
Gump E-mail Identifier (unique within run) #109.

*********************************************************** G U M P
[GUMP@vmgump]: Project slide-webdavlib (in module jakarta-slide) failed
To whom it may engage...
        
This is an automated request, but not an unsolicited one. For 
more information please visit http://gump.apache.org/nagged.html, 
and/or contact the folk at general@gump.apache.org.

Project slide-webdavlib has an issue affecting its community integration.
This issue affects 1 projects,
 and has been outstanding for 34 runs.
The current state of this project is 'Failed', with reason 'Missing Build Outputs'.
For reference only, the following projects are affected by this:
    - slide-webdavlib :  Content Management System based on WebDAV technology


Full details are available at:
    http://vmgump.apache.org/gump/public/jakarta-slide/slide-webdavlib/index.html

That said, some information snippets are provided here.

The following annotations (debug/informational/warning/error messages) were provided:
 -DEBUG- Sole output [jakarta-slide-webdavlib-08012009.jar] identifier set to project name
 -INFO- Failed with reason missing build outputs
 -ERROR- Missing Output: /srv/gump/public/workspace/jakarta-slide/webdavclient/dist/lib/jakarta-slide-webdavlib-08012009.jar
 -ERROR- No such directory (where output is expected) : /srv/gump/public/workspace/jakarta-slide/webdavclient/dist/lib
 -DEBUG- Extracted fallback artifacts from Gump Repository

To subscribe to this information via syndicated feeds:
- RSS: http://vmgump.apache.org/gump/public/jakarta-slide/slide-webdavlib/rss.xml
- Atom: http://vmgump.apache.org/gump/public/jakarta-slide/slide-webdavlib/atom.xml

============================== Gump Tracking Only ===
Produced by Gump version 2.3.
Gump Run 15000008012009, vmgump:vmgump-public:15000008012009
Gump E-mail Identifier (unique within run) #113.

*********************************************************** G U M P
[GUMP@vmgump]: Project derby (in module db-derby) failed
To whom it may engage...
        
This is an automated request, but not an unsolicited one. For 
more information please visit http://gump.apache.org/nagged.html, 
and/or contact the folk at general@gump.apache.org.

Project derby has an issue affecting its community integration.
This issue affects 1 projects,
 and has been outstanding for 166 runs.
The current state of this project is 'Failed', with reason 'Build Failed'.
For reference only, the following projects are affected by this:
    - derby :  Apache Derby, 100% Java relational database.


Full details are available at:
    http://vmgump.apache.org/gump/public/db-derby/derby/index.html

That said, some information snippets are provided here.

The following annotations (debug/informational/warning/error messages) were provided:
 -INFO- Failed with reason build failed
 -INFO- Failed to extract fallback artifacts from Gump Repository



The following work was performed:
http://vmgump.apache.org/gump/public/db-derby/derby/gump_work/build_db-derby_derby.html
Work Name: build_db-derby_derby (Type: Build)
Work ended in a state of : Failed
Elapsed: 45 secs
Command Line: /usr/lib/jvm/java-1.5.0-sun/bin/java -Djava.awt.headless=true -Xbootclasspath/p:/srv/gump/public/workspace/xml-commons/java/external/build/xml-apis.jar:/srv/gump/public/workspace/xml-xerces2/build/xercesImpl.jar:/srv/gump/public/workspace/xml-xalan/build/serializer.jar:/srv/gump/public/workspace/xml-xalan/build/xalan-unbundled.jar org.apache.tools.ant.Main -Dgump.merge=/srv/gump/public/gump/work/merge.xml -Dbuild.sysclasspath=only -Dsane=false gump_all 
[Working Directory: /srv/gump/public/workspace/db-derby]
CLASSPATH: /usr/lib/jvm/java-1.5.0-sun/lib/tools.jar:/srv/gump/public/workspace/db-derby/classes:/srv/gump/public/workspace/ant/dist/lib/ant-jmf.jar:/srv/gump/public/workspace/ant/dist/lib/ant-swing.jar:/srv/gump/public/workspace/ant/dist/lib/ant-apache-resolver.jar:/srv/gump/public/workspace/ant/dist/lib/ant-apache-xalan2.jar:/srv/gump/public/workspace/ant/dist/lib/ant-trax.jar:/srv/gump/public/workspace/ant/dist/lib/ant-junit.jar:/srv/gump/public/workspace/ant/dist/lib/ant-launcher.jar:/srv/gump/public/workspace/ant/dist/lib/ant-nodeps.jar:/srv/gump/public/workspace/ant/dist/lib/ant.jar:/srv/gump/public/workspace/xml-commons/java/external/build/xml-apis-ext.jar:/srv/gump/public/workspace/jakarta-servletapi-5/jsr154/dist/lib/servlet-api.jar:/srv/gump/public/workspace/jakarta-oro/jakarta-oro-08012009.jar:/srv/gump/packages/javacc-3.1/bin/lib/javacc.jar:/srv/gump/public/workspace/junit/dist/junit-08012009.jar
---------------------------------------------
    [javac] /srv/gump/public/workspace/db-derby/java/engine/org/apache/derby/iapi/jdbc/BrokeredConnection40.java:210: cannot find symbol
    [javac] symbol  : class SQLClientInfoException
    [javac] location: class org.apache.derby.iapi.jdbc.BrokeredConnection40
    [javac]             throw new SQLClientInfoException
    [javac]                       ^
    [javac] /srv/gump/public/workspace/db-derby/java/engine/org/apache/derby/iapi/jdbc/BrokeredConnection40.java:227: cannot find symbol
    [javac] symbol  : method getClientInfo(java.lang.String)
    [javac] location: interface org.apache.derby.iapi.jdbc.EngineConnection
    [javac]             return getRealConnection().getClientInfo(name);
    [javac]                                     ^
    [javac] /srv/gump/public/workspace/db-derby/java/engine/org/apache/derby/iapi/jdbc/BrokeredConnection40.java:244: cannot find symbol
    [javac] symbol  : method getClientInfo()
    [javac] location: interface org.apache.derby.iapi.jdbc.EngineConnection
    [javac]             return getRealConnection().getClientInfo();
    [javac]                                     ^
    [javac] /srv/gump/public/workspace/db-derby/java/engine/org/apache/derby/iapi/jdbc/BrokeredPreparedStatement40.java:44: cannot find symbol
    [javac] symbol  : method setNString(int,java.lang.String)
    [javac] location: interface java.sql.PreparedStatement
    [javac]         getPreparedStatement().setNString (index, value);
    [javac]                             ^
    [javac] /srv/gump/public/workspace/db-derby/java/engine/org/apache/derby/iapi/jdbc/BrokeredPreparedStatement40.java:49: cannot find symbol
    [javac] symbol  : method setNCharacterStream(int,java.io.Reader)
    [javac] location: interface java.sql.PreparedStatement
    [javac]         getPreparedStatement().setNCharacterStream(parameterIndex, value);
    [javac]                             ^
    [javac] /srv/gump/public/workspace/db-derby/java/engine/org/apache/derby/iapi/jdbc/BrokeredPreparedStatement40.java:53: cannot find symbol
    [javac] symbol  : method setNCharacterStream(int,java.io.Reader,long)
    [javac] location: interface java.sql.PreparedStatement
    [javac]         getPreparedStatement().setNCharacterStream (index, value, length);
    [javac]                             ^
    [javac] /srv/gump/public/workspace/db-derby/java/engine/org/apache/derby/iapi/jdbc/BrokeredPreparedStatement40.java:62: setClob(int,java.sql.Clob) in java.sql.PreparedStatement cannot be applied to (int,java.io.Reader,long)
    [javac]         getPreparedStatement().setClob (parameterIndex, reader, length);
    [javac]                             ^
    [javac] /srv/gump/public/workspace/db-derby/java/engine/org/apache/derby/iapi/jdbc/BrokeredPreparedStatement40.java:67: setBlob(int,java.sql.Blob) in java.sql.PreparedStatement cannot be applied to (int,java.io.InputStream,long)
    [javac]         getPreparedStatement().setBlob (parameterIndex, inputStream, length);
    [javac]                             ^
    [javac] /srv/gump/public/workspace/db-derby/java/engine/org/apache/derby/iapi/jdbc/BrokeredPreparedStatement40.java:72: cannot find symbol
    [javac] symbol  : method setNClob(int,java.io.Reader)
    [javac] location: interface java.sql.PreparedStatement
    [javac]         getPreparedStatement().setNClob(parameterIndex, reader);
    [javac]                             ^
    [javac] 100 errors

BUILD FAILED
/srv/gump/public/workspace/db-derby/build.xml:438: The following error occurred while executing this line:
/srv/gump/public/workspace/db-derby/java/engine/build.xml:58: The following error occurred while executing this line:
/srv/gump/public/workspace/db-derby/java/engine/org/apache/derby/iapi/build.xml:76: The following error occurred while executing this line:
/srv/gump/public/workspace/db-derby/java/engine/org/apache/derby/iapi/jdbc/build.xml:158: Compile failed; see the compiler error output for details.

Total time: 44 seconds
---------------------------------------------

To subscribe to this information via syndicated feeds:
- RSS: http://vmgump.apache.org/gump/public/db-derby/derby/rss.xml
- Atom: http://vmgump.apache.org/gump/public/db-derby/derby/atom.xml

============================== Gump Tracking Only ===
Produced by Gump version 2.3.
Gump Run 15000008012009, vmgump:vmgump-public:15000008012009
Gump E-mail Identifier (unique within run) #116.

*********************************************************** G U M P
[GUMP@vmgump]: Project lucene-java (in module lucene-java) failed
To whom it may engage...
        
This is an automated request, but not an unsolicited one. For 
more information please visit http://gump.apache.org/nagged.html, 
and/or contact the folk at general@gump.apache.org.

Project lucene-java has an issue affecting its community integration.
This issue affects 1 projects,
 and has been outstanding for 492 runs.
The current state of this project is 'Failed', with reason 'Configuration Failed'.
For reference only, the following projects are affected by this:
    - lucene-java :  Java Based Search Engine


Full details are available at:
    http://vmgump.apache.org/gump/public/lucene-java/lucene-java/index.html

That said, some information snippets are provided here.

The following annotations (debug/informational/warning/error messages) were provided:
 -DEBUG- Sole output [lucene-core-08012009.jar] identifier set to project name
 -DEBUG- Dependency on javacc exists, no need to add for property javacc.home.
 -INFO- Failed with reason configuration failed
 -ERROR- Bad Dependency. Project: commons-digester : unknown to *this* workspace 
 -ERROR- Bad Dependency. Project: commons-logging : unknown to *this* workspace 
 -INFO- Failed to extract fallback artifacts from Gump Repository

To subscribe to this information via syndicated feeds:
- RSS: http://vmgump.apache.org/gump/public/lucene-java/lucene-java/rss.xml
- Atom: http://vmgump.apache.org/gump/public/lucene-java/lucene-java/atom.xml

============================== Gump Tracking Only ===
Produced by Gump version 2.3.
Gump Run 15000008012009, vmgump:vmgump-public:15000008012009
Gump E-mail Identifier (unique within run) #118.

*********************************************************** G U M P
[GUMP@vmgump]: Project kerberos-common (in module kerberos-shared) failed
To whom it may engage...
        
This is an automated request, but not an unsolicited one. For 
more information please visit http://gump.apache.org/nagged.html, 
and/or contact the folk at general@gump.apache.org.

Project kerberos-common has an issue affecting its community integration.
This issue affects 2 projects,
 and has been outstanding for 64 runs.
The current state of this project is 'Failed', with reason 'Build Failed'.
For reference only, the following projects are affected by this:
    - kerberos-common :  Apache Directory Project
    - kerberos-protocol :  Apache Kerberos Server


Full details are available at:
    http://vmgump.apache.org/gump/public/kerberos-shared/kerberos-common/index.html

That said, some information snippets are provided here.

The following annotations (debug/informational/warning/error messages) were provided:
 -DEBUG- Sole output [kerberos-common-08012009.jar] identifier set to project name
 -DEBUG- Dependency on bcprov exists, no need to add for property maven.jar.bcprov-jdk14.
 -INFO- Making directory for Maven properties: [/srv/gump/public/workspace/kerberos-shared/common]
 -DEBUG- (Gump generated) Maven Properties in: /srv/gump/public/workspace/kerberos-shared/common/build.properties
 -INFO- Failed with reason build failed
 -INFO- Project Reports in: /srv/gump/public/workspace/kerberos-shared/common/target/test-reports
 -INFO- Failed to extract fallback artifacts from Gump Repository



The following work was performed:
http://vmgump.apache.org/gump/public/kerberos-shared/kerberos-common/gump_work/build_kerberos-shared_kerberos-common.html
Work Name: build_kerberos-shared_kerberos-common (Type: Build)
Work ended in a state of : Failed
Elapsed: 3 secs
Command Line: maven --offline jar 
[Working Directory: /srv/gump/public/workspace/kerberos-shared/common]
CLASSPATH: /usr/lib/jvm/java-1.5.0-sun/lib/tools.jar:/srv/gump/public/workspace/directory-shared/asn1/target/shared-asn1-0.9.14-SNAPSHOT.jar:/srv/gump/packages/bouncycastle-jdk14/bcprov-130.jar:/srv/gump/public/workspace/directory-shared/ldap/target/shared-ldap-0.9.14-SNAPSHOT.jar
---------------------------------------------
 __  __
|  \/  |__ _Apache__ ___
| |\/| / _` \ V / -_) ' \  ~ intelligent projects ~
|_|  |_\__,_|\_/\___|_||_|  v. 1.0.2

build:start:

java:prepare-filesystem:
    [mkdir] Created dir: /srv/gump/public/workspace/kerberos-shared/common/target/classes

java:compile:
    [echo] Compiling to /srv/gump/public/workspace/kerberos-shared/common/target/classes
    [echo] No java source files to compile.
resources or todir was null

java:jar-resources:

test:prepare-filesystem:
    [mkdir] Created dir: /srv/gump/public/workspace/kerberos-shared/common/target/test-classes
    [mkdir] Created dir: /srv/gump/public/workspace/kerberos-shared/common/target/test-reports

test:test-resources:

test:compile:
    [echo] No test source files to compile.

test:test:
    [echo] No tests to run.

BUILD FAILED
File...... /home/gump/.maven/cache/maven-jar-plugin-1.6.1/plugin.jelly
Element... ant:fail
Line...... 53
Column.... 19
You must define currentVersion in your POM.
Total time: 3 seconds
Finished at: Thu Jan 08 02:20:44 GMT-08:00 2009

---------------------------------------------

To subscribe to this information via syndicated feeds:
- RSS: http://vmgump.apache.org/gump/public/kerberos-shared/kerberos-common/rss.xml
- Atom: http://vmgump.apache.org/gump/public/kerberos-shared/kerberos-common/atom.xml

============================== Gump Tracking Only ===
Produced by Gump version 2.3.
Gump Run 15000008012009, vmgump:vmgump-public:15000008012009
Gump E-mail Identifier (unique within run) #119.

*********************************************************** G U M P
[GUMP@vmgump]: Project JacORB-idllib (in module JacORB) failed
To whom it may engage...
        
This is an automated request, but not an unsolicited one. For 
more information please visit http://gump.apache.org/nagged.html, 
and/or contact the folk at general@gump.apache.org.

Project JacORB-idllib has an issue affecting its community integration.
This issue affects 1 projects,
 and has been outstanding for 491 runs.
The current state of this project is 'Failed', with reason 'Build Failed'.
For reference only, the following projects are affected by this:
    - JacORB-idllib :  The free Java implementation of the OMG's CORBA standard.


Full details are available at:
    http://vmgump.apache.org/gump/public/JacORB/JacORB-idllib/index.html

That said, some information snippets are provided here.

The following annotations (debug/informational/warning/error messages) were provided:
 -DEBUG- Sole output [idl.jar] identifier set to project name
 -INFO- Failed with reason build failed
 -INFO- Failed to extract fallback artifacts from Gump Repository



The following work was performed:
http://vmgump.apache.org/gump/public/JacORB/JacORB-idllib/gump_work/build_JacORB_JacORB-idllib.html
Work Name: build_JacORB_JacORB-idllib (Type: Build)
Work ended in a state of : Failed
Elapsed: 6 secs
Command Line: /usr/lib/jvm/java-1.5.0-sun/bin/java -Djava.awt.headless=true -Xbootclasspath/p:/srv/gump/public/workspace/xml-commons/java/external/build/xml-apis.jar:/srv/gump/public/workspace/xml-xerces2/build/xercesImpl.jar org.apache.tools.ant.Main -Dgump.merge=/srv/gump/public/gump/work/merge.xml -Dbuild.sysclasspath=only init idllib 
[Working Directory: /srv/gump/public/workspace/JacORB]
CLASSPATH: /usr/lib/jvm/java-1.5.0-sun/lib/tools.jar:/srv/gump/public/workspace/ant/build/lib/ant-stylebook.jar:/srv/gump/public/workspace/ant/build/lib/ant-swing.jar:/srv/gump/public/workspace/ant/build/lib/ant-apache-resolver.jar:/srv/gump/public/workspace/ant/build/lib/ant-nodeps.jar:/srv/gump/public/workspace/ant/build/lib/ant-apache-xalan2.jar:/srv/gump/public/workspace/ant/build/lib/ant-apache-regexp.jar:/srv/gump/public/workspace/ant/build/lib/ant-commons-net.jar:/srv/gump/public/workspace/ant/build/lib/ant-apache-log4j.jar:/srv/gump/public/workspace/ant/build/lib/ant-commons-logging.jar:/srv/gump/public/workspace/ant/build/lib/ant-jai.jar:/srv/gump/public/workspace/ant/build/lib/ant-jmf.jar:/srv/gump/public/workspace/ant/build/lib/ant-launcher.jar:/srv/gump/public/workspace/ant/build/lib/ant-jdepend.jar:/srv/gump/public/workspace/ant/build/lib/ant-apache-bsf.jar:/srv/gump/public/workspace/ant/build/lib/ant-apache-oro.jar:/srv/gump/public/workspace/ant/build/lib/ant-ap
 ache-bcel.jar:/srv/gump/public/workspace/ant/build/lib/ant-trax.jar:/srv/gump/public/workspace/ant/build/lib/ant-antlr.jar:/srv/gump/public/workspace/ant/build/lib/ant-junit.jar:/srv/gump/public/workspace/ant/build/lib/ant-jsch.jar:/srv/gump/public/workspace/ant/build/lib/ant-javamail.jar:/srv/gump/public/workspace/ant/build/lib/ant.jar:/srv/gump/public/workspace/xml-commons/java/external/build/xml-apis-ext.jar:/srv/gump/packages/antlr-2.7.6/antlr.jar:/srv/gump/public/workspace/excalibur/framework/api/target/excalibur-framework-api-08012009.jar:/srv/gump/packages/dougLea/concurrent.jar:/srv/gump/packages/avalon-logkit/avalon-logkit-2.1.jar:/srv/gump/public/workspace/xml-xalan/tools/java_cup.jar:/srv/gump/public/workspace/xml-xalan/lib/runtime.jar
---------------------------------------------
    [javac] /srv/gump/public/workspace/JacORB/src/org/jacorb/idl/parser.java:2029: cannot find symbol
    [javac] symbol  : class Symbol
    [javac] location: package org.jacorb.idl.runtime
    [javac]               CUP$parser$result = new org.jacorb.idl.runtime.Symbol(91/*parameter_dcls*/, ((org.jacorb.idl.runtime.Symbol)CUP$parser$stack.elementAt(CUP$parser$top-1)).left, ((org.jacorb.idl.runtime.Symbol)CUP$parser$stack.elementAt(CUP$parser$top-0)).right, RESULT);
    [javac]                                                             ^
    [javac] /srv/gump/public/workspace/JacORB/src/org/jacorb/idl/parser.java:2029: cannot find symbol
    [javac] symbol  : class Symbol
    [javac] location: package org.jacorb.idl.runtime
    [javac]               CUP$parser$result = new org.jacorb.idl.runtime.Symbol(91/*parameter_dcls*/, ((org.jacorb.idl.runtime.Symbol)CUP$parser$stack.elementAt(CUP$parser$top-1)).left, ((org.jacorb.idl.runtime.Symbol)CUP$parser$stack.elementAt(CUP$parser$top-0)).right, RESULT);
    [javac]                                                                                                                   ^
    [javac] /srv/gump/public/workspace/JacORB/src/org/jacorb/idl/parser.java:2029: cannot find symbol
    [javac] symbol  : class Symbol
    [javac] location: package org.jacorb.idl.runtime
    [javac]               CUP$parser$result = new org.jacorb.idl.runtime.Symbol(91/*parameter_dcls*/, ((org.jacorb.idl.runtime.Symbol)CUP$parser$stack.elementAt(CUP$parser$top-1)).left, ((org.jacorb.idl.runtime.Symbol)CUP$parser$stack.elementAt(CUP$parser$top-0)).right, RESULT);
    [javac]                                                                                                                                                                                                       ^
    [javac] /srv/gump/public/workspace/JacORB/src/org/jacorb/idl/parser.java:2037: cannot find symbol
    [javac] symbol  : class Symbol
    [javac] location: package org.jacorb.idl.runtime
    [javac] 		int pdsleft = ((org.jacorb.idl.runtime.Symbol)CUP$parser$stack.elementAt(CUP$parser$top-1)).left;
    [javac]                                                       ^
    [javac] /srv/gump/public/workspace/JacORB/src/org/jacorb/idl/parser.java:2038: cannot find symbol
    [javac] symbol  : class Symbol
    [javac] location: package org.jacorb.idl.runtime
    [javac] 		int pdsright = ((org.jacorb.idl.runtime.Symbol)CUP$parser$stack.elementAt(CUP$parser$top-1)).right;
    [javac]                                                        ^
    [javac] /srv/gump/public/workspace/JacORB/src/org/jacorb/idl/parser.java:2039: cannot find symbol
    [javac] symbol  : class Symbol
    [javac] location: package org.jacorb.idl.runtime
    [javac] 		SymbolList pds = (SymbolList)((org.jacorb.idl.runtime.Symbol) CUP$parser$stack.elementAt(CUP$parser$top-1)).value;
    [javac]                                                                      ^
    [javac] /srv/gump/public/workspace/JacORB/src/org/jacorb/idl/parser.java:2043: cannot find symbol
    [javac] symbol  : class Symbol
    [javac] location: package org.jacorb.idl.runtime
    [javac]               CUP$parser$result = new org.jacorb.idl.runtime.Symbol(91/*parameter_dcls*/, ((org.jacorb.idl.runtime.Symbol)CUP$parser$stack.elementAt(CUP$parser$top-2)).left, ((org.jacorb.idl.runtime.Symbol)CUP$parser$stack.elementAt(CUP$parser$top-0)).right, RESULT);
    [javac]                                                             ^
    [javac] /srv/gump/public/workspace/JacORB/src/org/jacorb/idl/parser.java:2043: cannot find symbol
    [javac] symbol  : class Symbol
    [javac] location: package org.jacorb.idl.runtime
    [javac]               CUP$parser$result = new org.jacorb.idl.runtime.Symbol(91/*parameter_dcls*/, ((org.jacorb.idl.runtime.Symbol)CUP$parser$stack.elementAt(CUP$parser$top-2)).left, ((org.jacorb.idl.runtime.Symbol)CUP$parser$stack.elementAt(CUP$parser$top-0)).right, RESULT);
    [javac]                                                                                                                   ^
    [javac] Note: Some input files use or override a deprecated API.
    [javac] Note: Recompile with -Xlint:deprecation for details.
    [javac] 100 errors

BUILD FAILED
/srv/gump/public/workspace/JacORB/build.xml:68: The following error occurred while executing this line:
/srv/gump/public/workspace/JacORB/src/org/jacorb/idl/build.xml:18: The following error occurred while executing this line:
/srv/gump/public/workspace/JacORB/etc/common.xml:90: Compile failed; see the compiler error output for details.

Total time: 5 seconds
---------------------------------------------

To subscribe to this information via syndicated feeds:
- RSS: http://vmgump.apache.org/gump/public/JacORB/JacORB-idllib/rss.xml
- Atom: http://vmgump.apache.org/gump/public/JacORB/JacORB-idllib/atom.xml

============================== Gump Tracking Only ===
Produced by Gump version 2.3.
Gump Run 15000008012009, vmgump:vmgump-public:15000008012009
Gump E-mail Identifier (unique within run) #120.

*********************************************************** G U M P
[GUMP@vmgump]: Project jetty (in module jetty) failed
To whom it may engage...
        
This is an automated request, but not an unsolicited one. For 
more information please visit http://gump.apache.org/nagged.html, 
and/or contact the folk at general@gump.apache.org.

Project jetty has an issue affecting its community integration.
This issue affects 2 projects,
 and has been outstanding for 619 runs.
The current state of this project is 'Failed', with reason 'Missing Build Outputs'.
For reference only, the following projects are affected by this:
    - jetty :  Java HTTP Servlet Server
    - jetty-test :  Java HTTP Servlet Server


Full details are available at:
    http://vmgump.apache.org/gump/public/jetty/jetty/index.html

That said, some information snippets are provided here.

The following annotations (debug/informational/warning/error messages) were provided:
 -WARNING- Bad *Optional* Dependency. Project: commons-beanutils : unknown to *this* workspace
 -WARNING- Bad *Optional* Dependency. Project: commons-digester : unknown to *this* workspace
 -INFO- Optional dependency mx4j-tools failed with reason build failed
 -INFO- Optional dependency slide-webdavlib failed with reason missing build outputs
 -DEBUG- (Gump generated) Maven2 Settings in: /srv/gump/public/workspace/jetty/gump_mvn_settings.xml
 -DEBUG- Maven POM in: /srv/gump/public/workspace/jetty/pom.xml
 -INFO- Failed with reason missing build outputs
 -ERROR- Missing Output: /srv/gump/public/workspace/jetty/extra/jetty-rewrite/target/jetty-rewrite-7.0-SNAPSHOT.jar
 -ERROR- Missing Output: /srv/gump/public/workspace/jetty/plus/jetty-annotations/target/jetty-annotations-7.0-SNAPSHOT.jar
 -ERROR- Missing Output: /srv/gump/public/workspace/jetty/server/jetty-util/target/jetty-util-7.0-SNAPSHOT.jar
 -ERROR- Missing Output: /srv/gump/public/workspace/jetty/plus/jetty-jndi/target/jetty-jndi-7.0-SNAPSHOT.jar
 -ERROR- Missing Output: /srv/gump/public/workspace/jetty/extra/jetty-servlet/target/jetty-servlet-7.0-SNAPSHOT.jar
 -ERROR- Missing Output: /srv/gump/public/workspace/jetty/server/jetty-start/target/jetty-start-7.0-SNAPSHOT.jar
 -ERROR- Missing Output: /srv/gump/public/workspace/jetty/extra/jetty-threadpool/target/jetty-threadpool-7.0-SNAPSHOT.jar
 -ERROR- Missing Output: /srv/gump/public/workspace/jetty/extra/jetty-ajp/target/jetty-ajp-7.0-SNAPSHOT.jar
 -ERROR- Missing Output: /srv/gump/public/workspace/jetty/extra/jetty-html/target/jetty-html-7.0-SNAPSHOT.jar
 -ERROR- Missing Output: /srv/gump/public/workspace/jetty/plus/jetty-plus/target/jetty-plus-7.0-SNAPSHOT.jar
 -ERROR- Missing Output: /srv/gump/public/workspace/jetty/extra/jetty-client/target/jetty-client-7.0-SNAPSHOT.jar
 -ERROR- Missing Output: /srv/gump/public/workspace/jetty/plus/jetty-jmx/target/jetty-jmx-7.0-SNAPSHOT.jar
 -ERROR- Missing Output: /srv/gump/public/workspace/jetty/server/jetty-ssl/target/jetty-ssl-7.0-SNAPSHOT.jar
 -ERROR- Missing Output: /srv/gump/public/workspace/jetty/server/jetty/target/jetty-7.0-SNAPSHOT.jar
 -ERROR- No such directory (where output is expected) : /srv/gump/public/workspace/jetty/extra/jetty-rewrite/target
 -ERROR- No such directory (where output is expected) : /srv/gump/public/workspace/jetty/plus/jetty-annotations/target
 -ERROR- No such directory (where output is expected) : /srv/gump/public/workspace/jetty/server/jetty-util/target
 -ERROR- No such directory (where output is expected) : /srv/gump/public/workspace/jetty/plus/jetty-jndi/target
 -ERROR- No such directory (where output is expected) : /srv/gump/public/workspace/jetty/extra/jetty-servlet/target
 -ERROR- No such directory (where output is expected) : /srv/gump/public/workspace/jetty/server/jetty-start/target
 -ERROR- No such directory (where output is expected) : /srv/gump/public/workspace/jetty/extra/jetty-threadpool/target
 -ERROR- No such directory (where output is expected) : /srv/gump/public/workspace/jetty/extra/jetty-ajp/target
 -ERROR- No such directory (where output is expected) : /srv/gump/public/workspace/jetty/extra/jetty-html/target
 -ERROR- No such directory (where output is expected) : /srv/gump/public/workspace/jetty/plus/jetty-plus/target
 -ERROR- No such directory (where output is expected) : /srv/gump/public/workspace/jetty/extra/jetty-client/target
 -ERROR- No such directory (where output is expected) : /srv/gump/public/workspace/jetty/plus/jetty-jmx/target
 -ERROR- No such directory (where output is expected) : /srv/gump/public/workspace/jetty/server/jetty-ssl/target
 -ERROR- No such directory (where output is expected) : /srv/gump/public/workspace/jetty/server/jetty/target
 -INFO- Failed to extract fallback artifacts from Gump Repository



The following work was performed:
http://vmgump.apache.org/gump/public/jetty/jetty/gump_work/build_jetty_jetty.html
Work Name: build_jetty_jetty (Type: Build)
Work ended in a state of : Success
Elapsed: 5 mins 3 secs
Command Line: mvn --batch-mode -Dmaven.test.skip=true --settings /srv/gump/public/workspace/jetty/gump_mvn_settings.xml package 
[Working Directory: /srv/gump/public/workspace/jetty]
CLASSPATH: /usr/lib/jvm/java-1.5.0-sun/lib/tools.jar:/srv/gump/public/workspace/jetty/modules:/srv/gump/public/workspace/ant/dist/lib/ant-jmf.jar:/srv/gump/public/workspace/ant/dist/lib/ant-swing.jar:/srv/gump/public/workspace/ant/dist/lib/ant-apache-resolver.jar:/srv/gump/public/workspace/ant/dist/lib/ant-apache-xalan2.jar:/srv/gump/public/workspace/ant/dist/lib/ant-trax.jar:/srv/gump/public/workspace/ant/dist/lib/ant-junit.jar:/srv/gump/public/workspace/ant/dist/lib/ant-launcher.jar:/srv/gump/public/workspace/ant/dist/lib/ant-nodeps.jar:/srv/gump/public/workspace/ant/dist/lib/ant.jar:/srv/gump/packages/bsh-2.0b4/bsh-commands-2.0b4.jar:/srv/gump/packages/bsh-2.0b4/bsh-classpath-2.0b4.jar:/srv/gump/packages/bsh-2.0b4/bsh-core-2.0b4.jar:/srv/gump/packages/bsh-2.0b4/bsh-bsf-2.0b4.jar:/srv/gump/packages/bsh-2.0b4/bsh-2.0b4.jar:/srv/gump/packages/bsh-2.0b4/bsh-reflect-2.0b4.jar:/srv/gump/packages/bsh-2.0b4/bsh-util-2.0b4.jar:/srv/gump/packages/commons-el-1.0/commons-el.jar:common
 s-httpclient-gump-07012009.jar:/srv/gump/packages/jaf-1.1ea/activation.jar:/srv/gump/public/workspace/jakarta-servletapi-5/jsr154/dist/lib/servlet-api.jar:/srv/gump/packages/javamail-1.4/mail.jar:/srv/gump/packages/javamail-1.4/lib/mailapi.jar:/srv/gump/packages/jtidy-04aug2000r7-dev/build/Tidy.jar:/srv/gump/public/workspace/junit/dist/junit-08012009.jar:mx4j-impl-gump-07012009.jar:mx4j-jmx-gump-07012009.jar:mx4j-gump-07012009.jar:mx4j-tools-gump-07012009.jar:/srv/gump/public/workspace/slf4j/log4j-over-slf4j/target/log4j-over-slf4j-1.5.6.jar:/srv/gump/public/workspace/slf4j/slf4j-ext/target/slf4j-ext-1.5.6.jar:/srv/gump/public/workspace/slf4j/slf4j-migrator/target/slf4j-migrator-1.5.6.jar:/srv/gump/public/workspace/slf4j/slf4j-nop/target/slf4j-nop-1.5.6.jar:/srv/gump/public/workspace/slf4j/jcl104-over-slf4j/target/jcl104-over-slf4j-1.5.6.jar:/srv/gump/public/workspace/slf4j/jcl-over-slf4j/target/jcl-over-slf4j-1.5.6.jar:/srv/gump/public/workspace/slf4j/slf4j-simple/target/sl
 f4j-simple-1.5.6.jar:/srv/gump/public/workspace/slf4j/slf4j-jdk14/target/slf4j-jdk14-1.5.6.jar:/srv/gump/public/workspace/slf4j/slf4j-api/target/slf4j-api-1.5.6.jar:/srv/gump/public/workspace/slf4j/slf4j-log4j12/target/slf4j-log4j12-1.5.6.jar:/srv/gump/public/workspace/slf4j/jul-to-slf4j/target/jul-to-slf4j-1.5.6.jar:/srv/gump/public/workspace/slf4j/slf4j-jcl/target/slf4j-jcl-1.5.6.jar:slide-webdavlib-gump-07012009.jar:/srv/gump/public/workspace/xml-commons/java/external/build/xml-apis-ext.jar
---------------------------------------------
[INFO] ------------------------------------------------------------------------
[INFO] Jetty :: Project ...................................... SUCCESS [11.166s]
[INFO] Jetty :: Server Modules ............................... SUCCESS [0.015s]
[INFO] Jetty :: Utilities .................................... SUCCESS [9.781s]
[INFO] Jetty :: Server Core .................................. SUCCESS [21.462s]
[INFO] Jetty :: XML utilities ................................ SUCCESS [2.778s]
[INFO] Jetty :: Security ..................................... SUCCESS [2.573s]
[INFO] Jetty :: SSL Engine ................................... SUCCESS [3.853s]
[INFO] Jetty :: Webapp Application Support ................... SUCCESS [1.730s]
[INFO] Jetty :: Deployers .................................... SUCCESS [1.636s]
[INFO] Jetty :: Start ........................................ SUCCESS [0.946s]
[INFO] Jetty :: JSP Modules .................................. SUCCESS [0.012s]
[INFO] Glassfish :: Jasper JSP 2.1 ........................... SUCCESS [12.014s]
[INFO] Jetty Plus :: Plus Modules ............................ SUCCESS [0.018s]
[INFO] Jetty Plus :: JMX Management .......................... SUCCESS [1.319s]
[INFO] Jetty Plus :: JNDI Naming ............................. SUCCESS [3.939s]
[INFO] Jetty Plus :: Plus .................................... SUCCESS [56.758s]
[INFO] Jetty Plus :: Servlet Annotations ..................... SUCCESS [10.523s]
[INFO] Jetty Extra :: Extra Modules .......................... SUCCESS [0.011s]
[INFO] Jetty Extra :: Servlet Tester ......................... SUCCESS [1.295s]
[INFO] Jetty Extra :: Rewrite Handler ........................ SUCCESS [1.108s]
[INFO] Jetty Extra :: Asynchronous HTTP Client ............... SUCCESS [2.305s]
[INFO] Jetty Extra :: HTML ................................... SUCCESS [1.134s]
[INFO] Jetty Extra :: Utility Servlets and Filters ........... SUCCESS [1.952s]
[INFO] Jetty Extra :: AJP .................................... SUCCESS [1.410s]
[INFO] Jetty Extra :: Java5 Threadpool ....................... SUCCESS [1.177s]
[INFO] Jetty Extra :: Maven JSPC Plugin ...................... SUCCESS [45.436s]
[INFO] Jetty Extra :: Maven Plugin ........................... SUCCESS [7.381s]
[INFO] Jetty Extra :: Maven Jetty Plugin :: Stub ............. SUCCESS [0.023s]
[INFO] Cometd :: Jetty ....................................... SUCCESS [0.626s]
[INFO] Cometd :: Jetty :: Servlet ............................ SUCCESS [2.986s]
[INFO] Cometd :: Jetty :: Client ............................. SUCCESS [1.035s]
[INFO] Cometd :: Jetty :: Demo ............................... SUCCESS [27.022s]
[INFO] Cometd :: Jetty :: Install ............................ SUCCESS [0.017s]
[INFO] Jetty Example :: Parent ............................... SUCCESS [0.012s]
[INFO] Jetty Example :: Async Rest Webapp .................... SUCCESS [3.827s]
[INFO] Jetty Example :: JAAS Test Webapp ..................... SUCCESS [4.405s]
[INFO] Jetty Example :: Annotations Test Webapp .............. SUCCESS [5.598s]
[INFO] Jetty Example :: Embedded ............................. SUCCESS [1.360s]
[INFO] Jetty Example :: Webapp Example ....................... SUCCESS [3.628s]
[INFO] Jetty Example :: Extra Webapp tests ................... SUCCESS [0.544s]
[INFO] Jetty Example :: JNDI Test Webapp ..................... SUCCESS [1.385s]
[INFO] ------------------------------------------------------------------------
[INFO] ------------------------------------------------------------------------
[INFO] BUILD SUCCESSFUL
[INFO] ------------------------------------------------------------------------
[INFO] Total time: 5 minutes 1 second
[INFO] Finished at: Thu Jan 08 02:53:38 GMT-08:00 2009
[INFO] Final Memory: 47M/63M
[INFO] ------------------------------------------------------------------------
---------------------------------------------

To subscribe to this information via syndicated feeds:
- RSS: http://vmgump.apache.org/gump/public/jetty/jetty/rss.xml
- Atom: http://vmgump.apache.org/gump/public/jetty/jetty/atom.xml

============================== Gump Tracking Only ===
Produced by Gump version 2.3.
Gump Run 15000008012009, vmgump:vmgump-public:15000008012009
Gump E-mail Identifier (unique within run) #123.

*********************************************************** G U M P
[GUMP@vmgump]: Project eyebrowse (in module eyebrowse) failed
To whom it may engage...
        
This is an automated request, but not an unsolicited one. For 
more information please visit http://gump.apache.org/nagged.html, 
and/or contact the folk at general@gump.apache.org.

Project eyebrowse has an issue affecting its community integration.
This issue affects 1 projects,
 and has been outstanding for 492 runs.
The current state of this project is 'Failed', with reason 'Configuration Failed'.
For reference only, the following projects are affected by this:
    - eyebrowse :  Web-based mail archive browsing


Full details are available at:
    http://vmgump.apache.org/gump/public/eyebrowse/eyebrowse/index.html

That said, some information snippets are provided here.

The following annotations (debug/informational/warning/error messages) were provided:
 -DEBUG- Sole output [eyebrowse.jar] identifier set to project name
 -INFO- Failed with reason configuration failed
 -ERROR- Bad Dependency. Project: commons-collections : unknown to *this* workspace 
 -INFO- Failed to extract fallback artifacts from Gump Repository

To subscribe to this information via syndicated feeds:
- RSS: http://vmgump.apache.org/gump/public/eyebrowse/eyebrowse/rss.xml
- Atom: http://vmgump.apache.org/gump/public/eyebrowse/eyebrowse/atom.xml

============================== Gump Tracking Only ===
Produced by Gump version 2.3.
Gump Run 15000008012009, vmgump:vmgump-public:15000008012009
Gump E-mail Identifier (unique within run) #126.

*********************************************************** G U M P
[GUMP@vmgump]: Module smartfrog success, but with warnings.
To whom it may engage...
        
This is an automated request, but not an unsolicited one. For 
more information please visit http://gump.apache.org/nagged.html, 
and/or contact the folk at general@gump.apache.org.

Module smartfrog contains errors.
The current state of this module is 'Success'.

Full details are available at:
    http://vmgump.apache.org/gump/public/smartfrog/index.html

That said, some information snippets are provided here.

The following annotations (debug/informational/warning/error messages) were provided:
 -ERROR- *** Failed to update from source control. Stale contents ***



The following work was performed:
http://vmgump.apache.org/gump/public/smartfrog/gump_work/update_smartfrog.html
Work Name: update_smartfrog (Type: Update)
Work ended in a state of : Failed
Elapsed: 
Command Line: svn --quiet update --non-interactive smartfrog 
[Working Directory: /srv/gump/public/workspace/cvs]
---------------------------------------------
svn: Working copy 'smartfrog' locked
svn: run 'svn cleanup' to remove locks (type 'svn help cleanup' for details)
---------------------------------------------

To subscribe to this information via syndicated feeds:
- RSS: http://vmgump.apache.org/gump/public/smartfrog/rss.xml
- Atom: http://vmgump.apache.org/gump/public/smartfrog/atom.xml

============================== Gump Tracking Only ===
Produced by Gump version 2.3.
Gump Run 15000008012009, vmgump:vmgump-public:15000008012009
Gump E-mail Identifier (unique within run) #128.

*********************************************************** G U M P
[GUMP@vmgump]: Project xstream (in module xstream) failed
To whom it may engage...
        
This is an automated request, but not an unsolicited one. For 
more information please visit http://gump.apache.org/nagged.html, 
and/or contact the folk at general@gump.apache.org.

Project xstream has an issue affecting its community integration.
This issue affects 1 projects,
 and has been outstanding for 90 runs.
The current state of this project is 'Failed', with reason 'Configuration Failed'.
For reference only, the following projects are affected by this:
    - xstream :  simple library to serialize object to XML and back
    again


Full details are available at:
    http://vmgump.apache.org/gump/public/xstream/xstream/index.html

That said, some information snippets are provided here.

The following annotations (debug/informational/warning/error messages) were provided:
 -DEBUG- Sole output [xstream-08012009.jar] identifier set to project name
 -INFO- Failed with reason configuration failed
 -ERROR- Bad Dependency. Project: commons-lang : unknown to *this* workspace 
 -INFO- Failed to extract fallback artifacts from Gump Repository

To subscribe to this information via syndicated feeds:
- RSS: http://vmgump.apache.org/gump/public/xstream/xstream/rss.xml
- Atom: http://vmgump.apache.org/gump/public/xstream/xstream/atom.xml

============================== Gump Tracking Only ===
Produced by Gump version 2.3.
Gump Run 15000008012009, vmgump:vmgump-public:15000008012009
Gump E-mail Identifier (unique within run) #136.

*********************************************************** G U M P
[GUMP@vmgump]: Project ws-commons-axiom (in module ws-axis2-commons) failed
To whom it may engage...
        
This is an automated request, but not an unsolicited one. For 
more information please visit http://gump.apache.org/nagged.html, 
and/or contact the folk at general@gump.apache.org.

Project ws-commons-axiom has an issue affecting its community integration.
This issue affects 1 projects,
 and has been outstanding for 50 runs.
The current state of this project is 'Failed', with reason 'Build Failed'.
For reference only, the following projects are affected by this:
    - ws-commons-axiom :  Common stuff for the WS projects.


Full details are available at:
    http://vmgump.apache.org/gump/public/ws-axis2-commons/ws-commons-axiom/index.html

That said, some information snippets are provided here.

The following annotations (debug/informational/warning/error messages) were provided:
 -DEBUG- (Gump generated) Maven2 Settings in: /srv/gump/public/workspace/ws-axis2-commons/axiom/gump_mvn_settings.xml
 -INFO- Failed with reason build failed
 -DEBUG- Maven POM in: /srv/gump/public/workspace/ws-axis2-commons/axiom/pom.xml
 -INFO- Failed to extract fallback artifacts from Gump Repository



The following work was performed:
http://vmgump.apache.org/gump/public/ws-axis2-commons/ws-commons-axiom/gump_work/build_ws-axis2-commons_ws-commons-axiom.html
Work Name: build_ws-axis2-commons_ws-commons-axiom (Type: Build)
Work ended in a state of : Failed
Elapsed: 27 secs
Command Line: mvn --batch-mode --settings /srv/gump/public/workspace/ws-axis2-commons/axiom/gump_mvn_settings.xml package 
[Working Directory: /srv/gump/public/workspace/ws-axis2-commons/axiom]
CLASSPATH: /usr/lib/jvm/java-1.5.0-sun/lib/tools.jar:/srv/gump/public/workspace/logging-log4j-12/dist/lib/log4j-08012009.jar:/srv/gump/packages/jaf-1.1ea/activation.jar:/srv/gump/packages/javamail-1.4/mail.jar:/srv/gump/packages/javamail-1.4/lib/mailapi.jar:/srv/gump/public/workspace/jaxen/target/jaxen-08012009.jar:/srv/gump/packages/jsse1.0.3/lib/jcert.jar:/srv/gump/packages/jsse1.0.3/lib/jnet.jar:/srv/gump/packages/jsse1.0.3/lib/jsse.jar:/srv/gump/packages/jms1.1/lib/jms.jar:/srv/gump/public/workspace/xml-commons/java/external/build/xml-apis-ext.jar:xml-security-gump-07012009.jar:/srv/gump/public/workspace/xmlunit/build/lib/xmlunit-08012009.jar:/srv/gump/public/workspace/junit/dist/junit-08012009.jar
---------------------------------------------
[INFO] [source:jar {execution: default}]
[INFO] Building jar: /srv/gump/public/workspace/ws-axis2-commons/axiom/modules/axiom-api/target/axiom-api-SNAPSHOT-sources.jar
[INFO] [jar:test-jar {execution: default}]
[INFO] Building jar: /srv/gump/public/workspace/ws-axis2-commons/axiom/modules/axiom-api/target/axiom-api-SNAPSHOT-tests.jar
[INFO] ------------------------------------------------------------------------
[INFO] Building Axiom Impl
[INFO]    task-segment: [package]
[INFO] ------------------------------------------------------------------------
Downloading: http://localhost:8192/maven2/org/codehaus/woodstox/wstx-asl/3.2.4/wstx-asl-3.2.4.pom
1K downloaded
Downloading: http://localhost:8192/maven2/org/codehaus/woodstox/wstx-asl/3.2.4/wstx-asl-3.2.4.jar
507K downloaded
[INFO] ------------------------------------------------------------------------
[ERROR] BUILD ERROR
[INFO] ------------------------------------------------------------------------
[INFO] Failed to resolve artifact.

Missing:
----------
1) org.apache.ws.commons.axiom:axiom-api:jar:tests:SNAPSHOT

  Try downloading the file manually from the project website.

  Then, install it using the command: 
      mvn install:install-file -DgroupId=org.apache.ws.commons.axiom -DartifactId=axiom-api -Dversion=SNAPSHOT -Dclassifier=tests -Dpackaging=jar -Dfile=/path/to/file

  Alternatively, if you host your own repository you can deploy the file there: 
      mvn deploy:deploy-file -DgroupId=org.apache.ws.commons.axiom -DartifactId=axiom-api -Dversion=SNAPSHOT -Dclassifier=tests -Dpackaging=jar -Dfile=/path/to/file -Durl=[url] -DrepositoryId=[id]

  Path to dependency: 
  	1) org.apache.ws.commons.axiom:axiom-impl:jar:SNAPSHOT
  	2) org.apache.ws.commons.axiom:axiom-api:jar:tests:SNAPSHOT

----------
1 required artifact is missing.

for artifact: 
  org.apache.ws.commons.axiom:axiom-impl:jar:SNAPSHOT

from the specified remote repositories:
  Gump (http://localhost:8192/maven2)


[INFO] ------------------------------------------------------------------------
[INFO] For more information, run Maven with the -e switch
[INFO] ------------------------------------------------------------------------
[INFO] Total time: 25 seconds
[INFO] Finished at: Thu Jan 08 03:22:14 GMT-08:00 2009
[INFO] Final Memory: 12M/32M
[INFO] ------------------------------------------------------------------------
---------------------------------------------

To subscribe to this information via syndicated feeds:
- RSS: http://vmgump.apache.org/gump/public/ws-axis2-commons/ws-commons-axiom/rss.xml
- Atom: http://vmgump.apache.org/gump/public/ws-axis2-commons/ws-commons-axiom/atom.xml

============================== Gump Tracking Only ===
Produced by Gump version 2.3.
Gump Run 15000008012009, vmgump:vmgump-public:15000008012009
Gump E-mail Identifier (unique within run) #156.

*********************************************************** G U M P
[GUMP@vmgump]: Module groovy success, but with warnings.
To whom it may engage...
        
This is an automated request, but not an unsolicited one. For 
more information please visit http://gump.apache.org/nagged.html, 
and/or contact the folk at general@gump.apache.org.

Module groovy contains errors.
The current state of this module is 'Success'.

Full details are available at:
    http://vmgump.apache.org/gump/public/groovy/index.html

That said, some information snippets are provided here.

The following annotations (debug/informational/warning/error messages) were provided:
 -ERROR- *** Failed to update from source control. Stale contents ***



The following work was performed:
http://vmgump.apache.org/gump/public/groovy/gump_work/update_groovy.html
Work Name: update_groovy (Type: Update)
Work ended in a state of : Failed
Elapsed: 
Command Line: svn --quiet update --non-interactive groovy 
[Working Directory: /srv/gump/public/workspace/cvs]
---------------------------------------------
svn: Working copy 'groovy' locked
svn: run 'svn cleanup' to remove locks (type 'svn help cleanup' for details)
---------------------------------------------

To subscribe to this information via syndicated feeds:
- RSS: http://vmgump.apache.org/gump/public/groovy/rss.xml
- Atom: http://vmgump.apache.org/gump/public/groovy/atom.xml

============================== Gump Tracking Only ===
Produced by Gump version 2.3.
Gump Run 15000008012009, vmgump:vmgump-public:15000008012009
Gump E-mail Identifier (unique within run) #159.

*********************************************************** G U M P
[GUMP@vmgump]: Project groovy (in module groovy) failed
To whom it may engage...
        
This is an automated request, but not an unsolicited one. For 
more information please visit http://gump.apache.org/nagged.html, 
and/or contact the folk at general@gump.apache.org.

Project groovy has an issue affecting its community integration.
This issue affects 3 projects,
 and has been outstanding for 56 runs.
The current state of this project is 'Failed', with reason 'Missing Build Outputs'.
For reference only, the following projects are affected by this:
    - authx-example :  Apache Authentication and Authorization Framework
    - authx-script :  Apache Authentication and Authorization Framework
    - groovy :  New agile dynamic language using a Java-like syntax for the ...


Full details are available at:
    http://vmgump.apache.org/gump/public/groovy/groovy/index.html

That said, some information snippets are provided here.

The following annotations (debug/informational/warning/error messages) were provided:
 -DEBUG- Sole output [groovy-1.7-beta-1-SNAPSHOT.jar] identifier set to project name
 -WARNING- Bad *Optional* Dependency. Project: commons-collections : unknown to *this* workspace
 -WARNING- Bad *Optional* Dependency. Project: commons-logging : unknown to *this* workspace
 -WARNING- Bad *Optional* Dependency. Project: commons-primitives : unknown to *this* workspace
 -DEBUG- (Gump generated) Maven2 Settings in: /srv/gump/public/workspace/groovy/gump_mvn_settings.xml
 -DEBUG- Maven POM in: /srv/gump/public/workspace/groovy/pom.xml
 -INFO- Failed with reason missing build outputs
 -ERROR- Missing Output: /srv/gump/public/workspace/groovy/target/groovy-1.7-beta-1-SNAPSHOT.jar
 -ERROR- See Directory Listing Work for Missing Outputs
 -INFO- Failed to extract fallback artifacts from Gump Repository



The following work was performed:
http://vmgump.apache.org/gump/public/groovy/groovy/gump_work/build_groovy_groovy.html
Work Name: build_groovy_groovy (Type: Build)
Work ended in a state of : Success
Elapsed: 18 secs
Command Line: mvn --batch-mode --settings /srv/gump/public/workspace/groovy/gump_mvn_settings.xml package 
[Working Directory: /srv/gump/public/workspace/groovy]
CLASSPATH: /usr/lib/jvm/java-1.5.0-sun/lib/tools.jar:/srv/gump/public/workspace/ant/dist/lib/ant-jmf.jar:/srv/gump/public/workspace/ant/dist/lib/ant-swing.jar:/srv/gump/public/workspace/ant/dist/lib/ant-apache-resolver.jar:/srv/gump/public/workspace/ant/dist/lib/ant-apache-xalan2.jar:/srv/gump/public/workspace/ant/dist/lib/ant-trax.jar:/srv/gump/public/workspace/ant/dist/lib/ant-junit.jar:/srv/gump/public/workspace/ant/dist/lib/ant-launcher.jar:/srv/gump/public/workspace/ant/dist/lib/ant-nodeps.jar:/srv/gump/public/workspace/ant/dist/lib/ant.jar:/srv/gump/packages/antlr-2.7.6/antlr.jar:/srv/gump/public/workspace/asm/output/dist/lib/asm-analysis-08012009.jar:/srv/gump/public/workspace/asm/output/dist/lib/asm-util-08012009.jar:/srv/gump/public/workspace/asm/output/dist/lib/asm-xml-08012009.jar:/srv/gump/public/workspace/asm/output/dist/lib/asm-commons-08012009.jar:/srv/gump/public/workspace/asm/output/dist/lib/asm-08012009.jar:/srv/gump/public/workspace/asm/output/dist/lib/asm-
 tree-08012009.jar:/srv/gump/packages/axion-1.0-M2/axion-1.0-M2.jar:/srv/gump/packages/cglib/cglib-nodep-2.1_3.jar:/srv/gump/public/workspace/commons-cli-1.x/target/commons-cli-08012009.jar:commons-httpclient-gump-07012009.jar:/srv/gump/public/workspace/hsqldb/lib/hsqldb.jar:bsf-gump-07012009.jar:/srv/gump/public/workspace/jakarta-regexp/build/jakarta-regexp-08012009.jar:/srv/gump/public/workspace/jakarta-servletapi-5/jsr154/dist/lib/servlet-api.jar:/srv/gump/public/workspace/jakarta-servletapi-5/jsr152/dist/lib/jsp-api.jar:/srv/gump/packages/jarjar/jarjar-0.6.jar:/srv/gump/public/workspace/jmock/build/dist/jmock-core-08012009.jar:/srv/gump/public/workspace/jmock/build/dist/jmock-cglib-08012009.jar:/srv/gump/public/workspace/junit/dist/junit-08012009.jar:/srv/gump/packages/mockobjects-0.09/mockobjects-core-0.09.jar:/srv/gump/packages/mockobjects-0.09/mockobjects-jdk1.4-0.09.jar:/srv/gump/packages/mockobjects-0.09/mockobjects-alt-jdk1.4-0.09.jar:mx4j-impl-gump-07012009.jar:mx4
 j-jmx-gump-07012009.jar:mx4j-gump-07012009.jar:/srv/gump/packages/nekohtml-0.9.5/nekohtml.jar:/srv/gump/packages/openejb-0.9.2/dist/openejb_loader-0.9.2.jar:/srv/gump/packages/openejb-0.9.2/dist/openejb_ejb_tests-0.9.2.jar:/srv/gump/packages/openejb-0.9.2/dist/openejb_server-0.9.2.jar:/srv/gump/packages/openejb-0.9.2/dist/openejb_client-0.9.2.jar:/srv/gump/packages/openejb-0.9.2/dist/openejb-0.9.2.jar:/srv/gump/packages/qdox-1.6.3/qdox-1.6.3.jar:/srv/gump/packages/radeox-1.0-BETA-2/lib/radeox-api.jar:/srv/gump/packages/radeox-1.0-BETA-2/lib/radeox.jar:/srv/gump/public/workspace/xml-commons/java/external/build/xml-apis-ext.jar:/srv/gump/public/workspace/xmlunit/build/lib/xmlunit-08012009.jar:/srv/gump/public/workspace/xpp/build/xpp3-08012009.jar:/srv/gump/public/workspace/xstream/xstream/target/xstream-08012009.jar
---------------------------------------------
Downloading: http://localhost:8192/maven2/asm/asm-analysis/2.2.3/asm-analysis-2.2.3.jar
17K downloaded
Downloading: http://localhost:8192/maven2/bsf/bsf/2.4.0/bsf-2.4.0.jar
103K downloaded
Downloading: http://localhost:8192/maven2/com/thoughtworks/xstream/xstream/1.3/xstream-1.3.jar
401K downloaded
Downloading: http://localhost:8192/maven2/jline/jline/0.9.94/jline-0.9.94.jar
85K downloaded
[INFO] [compiler:compile]
[INFO] Nothing to compile - all classes are up to date
[INFO] [resources:testResources]
[INFO] Using default encoding to copy filtered resources.
Downloading: http://localhost:8192/maven2/org/apache/ant/ant-launcher/1.7.0/ant-launcher-1.7.0.jar
11K downloaded
Downloading: http://localhost:8192/maven2/org/apache/ant/ant-junit/1.7.0/ant-junit-1.7.0.jar
90K downloaded
Downloading: http://localhost:8192/maven2/jmock/jmock/1.2.0/jmock-1.2.0.jar
168K downloaded
Downloading: http://localhost:8192/maven2/jmock/jmock-cglib/1.2.0/jmock-cglib-1.2.0.jar
6K downloaded
Downloading: http://localhost:8192/maven2/asm/asm-attrs/2.2.3/asm-attrs-2.2.3.jar
6K downloaded
Downloading: http://localhost:8192/maven2/commons-logging/commons-logging/1.1/commons-logging-1.1.jar
51K downloaded
Downloading: http://localhost:8192/maven2/xmlunit/xmlunit/1.1/xmlunit-1.1.jar
94K downloaded
Downloading: http://localhost:8192/maven2/hsqldb/hsqldb/1.8.0.7/hsqldb-1.8.0.7.jar
686K downloaded
[INFO] [compiler:testCompile]
[INFO] Not compiling test sources
Downloading: http://localhost:8192/maven2/org/apache/maven/surefire/surefire-booter/2.3/surefire-booter-2.3.pom
1K downloaded
Downloading: http://localhost:8192/maven2/org/apache/maven/surefire/surefire-api/2.3/surefire-api-2.3.pom
887b downloaded
Downloading: http://localhost:8192/maven2/org/apache/maven/surefire/surefire-booter/2.3/surefire-booter-2.3.jar
28K downloaded
Downloading: http://localhost:8192/maven2/org/apache/maven/surefire/surefire-api/2.3/surefire-api-2.3.jar
49K downloaded
[INFO] [surefire:test]
[INFO] Tests are skipped.
[INFO] [jar:jar]
[WARNING] JAR will be empty - no content was marked for inclusion!
[INFO] Building jar: /srv/gump/public/workspace/groovy/target/groovy-1.6-beta-1-SNAPSHOT.jar
[INFO] ------------------------------------------------------------------------
[INFO] BUILD SUCCESSFUL
[INFO] ------------------------------------------------------------------------
[INFO] Total time: 17 seconds
[INFO] Finished at: Thu Jan 08 03:22:46 GMT-08:00 2009
[INFO] Final Memory: 7M/13M
[INFO] ------------------------------------------------------------------------
---------------------------------------------

To subscribe to this information via syndicated feeds:
- RSS: http://vmgump.apache.org/gump/public/groovy/groovy/rss.xml
- Atom: http://vmgump.apache.org/gump/public/groovy/groovy/atom.xml

============================== Gump Tracking Only ===
Produced by Gump version 2.3.
Gump Run 15000008012009, vmgump:vmgump-public:15000008012009
Gump E-mail Identifier (unique within run) #160.

*********************************************************** G U M P
[GUMP@vmgump]: Project ws-commons-policy (in module ws-axis2-commons) failed
To whom it may engage...
        
This is an automated request, but not an unsolicited one. For 
more information please visit http://gump.apache.org/nagged.html, 
and/or contact the folk at general@gump.apache.org.

Project ws-commons-policy has an issue affecting its community integration.
This issue affects 1 projects,
 and has been outstanding for 605 runs.
The current state of this project is 'Failed', with reason 'Build Failed'.
For reference only, the following projects are affected by this:
    - ws-commons-policy :  Common stuff for the WS projects.


Full details are available at:
    http://vmgump.apache.org/gump/public/ws-axis2-commons/ws-commons-policy/index.html

That said, some information snippets are provided here.

The following annotations (debug/informational/warning/error messages) were provided:
 -DEBUG- Sole output [ws-commons-policy-08012009.jar] identifier set to project name
 -WARNING- Bad *Optional* Dependency. Project: commons-logging : unknown to *this* workspace
 -INFO- Optional dependency ws-commons-axiom failed with reason build failed
 -DEBUG- (Gump generated) Maven2 Settings in: /srv/gump/public/workspace/ws-axis2-commons/neethi/gump_mvn_settings.xml
 -INFO- Failed with reason build failed
 -DEBUG- Maven POM in: /srv/gump/public/workspace/ws-axis2-commons/neethi/pom.xml
 -INFO- Failed to extract fallback artifacts from Gump Repository



The following work was performed:
http://vmgump.apache.org/gump/public/ws-axis2-commons/ws-commons-policy/gump_work/build_ws-axis2-commons_ws-commons-policy.html
Work Name: build_ws-axis2-commons_ws-commons-policy (Type: Build)
Work ended in a state of : Failed
Elapsed: 7 secs
Command Line: mvn --batch-mode --settings /srv/gump/public/workspace/ws-axis2-commons/neethi/gump_mvn_settings.xml package 
[Working Directory: /srv/gump/public/workspace/ws-axis2-commons/neethi]
CLASSPATH: /usr/lib/jvm/java-1.5.0-sun/lib/tools.jar:/srv/gump/public/workspace/ws-axis2-commons/axiom/modules/axiom-api/target/axiom-api-SNAPSHOT.jar:/srv/gump/public/workspace/ws-axis2-commons/axiom/modules/axiom-impl/target/axiom-impl-SNAPSHOT.jar:/srv/gump/public/workspace/ws-axis2-commons/axiom/modules/axiom-dom/target/axiom-dom-SNAPSHOT.jar:/srv/gump/public/workspace/wsdl4j/build/lib/qname.jar:/srv/gump/public/workspace/wsdl4j/build/lib/wsdl4j.jar
---------------------------------------------

Missing:
----------
1) org.apache.ws.commons.axiom:axiom-api:jar:SNAPSHOT

  Try downloading the file manually from the project website.

  Then, install it using the command: 
      mvn install:install-file -DgroupId=org.apache.ws.commons.axiom -DartifactId=axiom-api -Dversion=SNAPSHOT -Dpackaging=jar -Dfile=/path/to/file

  Alternatively, if you host your own repository you can deploy the file there: 
      mvn deploy:deploy-file -DgroupId=org.apache.ws.commons.axiom -DartifactId=axiom-api -Dversion=SNAPSHOT -Dpackaging=jar -Dfile=/path/to/file -Durl=[url] -DrepositoryId=[id]

  Path to dependency: 
  	1) org.apache.neethi:neethi:jar:SNAPSHOT
  	2) org.apache.ws.commons.axiom:axiom-api:jar:SNAPSHOT

2) org.apache.ws.commons.axiom:axiom-impl:jar:SNAPSHOT

  Try downloading the file manually from the project website.

  Then, install it using the command: 
      mvn install:install-file -DgroupId=org.apache.ws.commons.axiom -DartifactId=axiom-impl -Dversion=SNAPSHOT -Dpackaging=jar -Dfile=/path/to/file

  Alternatively, if you host your own repository you can deploy the file there: 
      mvn deploy:deploy-file -DgroupId=org.apache.ws.commons.axiom -DartifactId=axiom-impl -Dversion=SNAPSHOT -Dpackaging=jar -Dfile=/path/to/file -Durl=[url] -DrepositoryId=[id]

  Path to dependency: 
  	1) org.apache.neethi:neethi:jar:SNAPSHOT
  	2) org.apache.ws.commons.axiom:axiom-impl:jar:SNAPSHOT

----------
2 required artifacts are missing.

for artifact: 
  org.apache.neethi:neethi:jar:SNAPSHOT

from the specified remote repositories:
  apache-ws-snapshots2 (http://ws.zones.apache.org/repository2),
  maven-central (http://repo1.maven.org/maven/),
  Gump (http://localhost:8192/maven2)


[INFO] ------------------------------------------------------------------------
[INFO] For more information, run Maven with the -e switch
[INFO] ------------------------------------------------------------------------
[INFO] Total time: 5 seconds
[INFO] Finished at: Thu Jan 08 03:23:58 GMT-08:00 2009
[INFO] Final Memory: 5M/10M
[INFO] ------------------------------------------------------------------------
---------------------------------------------

To subscribe to this information via syndicated feeds:
- RSS: http://vmgump.apache.org/gump/public/ws-axis2-commons/ws-commons-policy/rss.xml
- Atom: http://vmgump.apache.org/gump/public/ws-axis2-commons/ws-commons-policy/atom.xml

============================== Gump Tracking Only ===
Produced by Gump version 2.3.
Gump Run 15000008012009, vmgump:vmgump-public:15000008012009
Gump E-mail Identifier (unique within run) #187.

*********************************************************** G U M P
[GUMP@vmgump]: Project htmlunit (in module htmlunit) failed
To whom it may engage...
        
This is an automated request, but not an unsolicited one. For 
more information please visit http://gump.apache.org/nagged.html, 
and/or contact the folk at general@gump.apache.org.

Project htmlunit has an issue affecting its community integration.
This issue affects 1 projects,
 and has been outstanding for 492 runs.
The current state of this project is 'Failed', with reason 'Configuration Failed'.
For reference only, the following projects are affected by this:
    - htmlunit :  A tool for testing web based applications


Full details are available at:
    http://vmgump.apache.org/gump/public/htmlunit/htmlunit/index.html

That said, some information snippets are provided here.

The following annotations (debug/informational/warning/error messages) were provided:
 -DEBUG- Sole output [htmlunit-08012009.jar] identifier set to project name
 -DEBUG- Dependency on xml-apis exists, no need to add for property maven.jar.xmlParserAPIs.
 -DEBUG- Dependency on rhino exists, no need to add for property maven.jar.js.
 -DEBUG- Dependency on jetty exists, no need to add for property maven.jar.org.mortbay.jetty.
 -DEBUG- Dependency on jakarta-servletapi-5-servlet exists, no need to add for property maven.jar.servlet-api.
 -DEBUG- Dependency on xml-xerces exists, no need to add for property maven.jar.xercesImpl.
 -INFO- Failed with reason configuration failed
 -ERROR- Bad Dependency. Project: commons-beanutils : unknown to *this* workspace 
 -ERROR- Bad Dependency. Project: commons-codec : unknown to *this* workspace 
 -ERROR- Bad Dependency. Project: commons-collections : unknown to *this* workspace 
 -ERROR- Bad Dependency. Project: commons-io : unknown to *this* workspace 
 -ERROR- Bad Dependency. Project: commons-jexl : unknown to *this* workspace 
 -ERROR- Bad Dependency. Project: commons-lang : unknown to *this* workspace 
 -ERROR- Bad Dependency. Project: commons-logging : unknown to *this* workspace 
 -INFO- Failed to extract fallback artifacts from Gump Repository

To subscribe to this information via syndicated feeds:
- RSS: http://vmgump.apache.org/gump/public/htmlunit/htmlunit/rss.xml
- Atom: http://vmgump.apache.org/gump/public/htmlunit/htmlunit/atom.xml

============================== Gump Tracking Only ===
Produced by Gump version 2.3.
Gump Run 15000008012009, vmgump:vmgump-public:15000008012009
Gump E-mail Identifier (unique within run) #206.

*********************************************************** G U M P
[GUMP@vmgump]: Project mina (in module mina) failed
To whom it may engage...
        
This is an automated request, but not an unsolicited one. For 
more information please visit http://gump.apache.org/nagged.html, 
and/or contact the folk at general@gump.apache.org.

Project mina has an issue affecting its community integration.
This issue affects 2 projects,
 and has been outstanding for 619 runs.
The current state of this project is 'Failed', with reason 'Build Failed'.
For reference only, the following projects are affected by this:
    - ldap-protocol :  Apache Directory Server
    - mina :  A Multipurpose Infrastrusture for Network Applications


Full details are available at:
    http://vmgump.apache.org/gump/public/mina/mina/index.html

That said, some information snippets are provided here.

The following annotations (debug/informational/warning/error messages) were provided:
 -WARNING- Bad *Optional* Dependency. Project: commons-net : unknown to *this* workspace
 -INFO- Optional dependency ant-contrib failed with reason build failed
 -DEBUG- (Gump generated) Maven2 Settings in: /srv/gump/public/workspace/mina/gump_mvn_settings.xml
 -INFO- Failed with reason build failed
 -DEBUG- Maven POM in: /srv/gump/public/workspace/mina/pom.xml
 -INFO- Project Reports in: /srv/gump/public/workspace/mina/target/test-reports
 -WARNING- No directory [/srv/gump/public/workspace/mina/target/test-reports]
 -INFO- Failed to extract fallback artifacts from Gump Repository



The following work was performed:
http://vmgump.apache.org/gump/public/mina/mina/gump_work/build_mina_mina.html
Work Name: build_mina_mina (Type: Build)
Work ended in a state of : Failed
Elapsed: 1 min 39 secs
Command Line: mvn --batch-mode -Dmaven.final.name=mina-08012009 --settings /srv/gump/public/workspace/mina/gump_mvn_settings.xml package 
[Working Directory: /srv/gump/public/workspace/mina]
CLASSPATH: /usr/lib/jvm/java-1.5.0-sun/lib/tools.jar:/srv/gump/public/workspace/ant/dist/lib/ant-jmf.jar:/srv/gump/public/workspace/ant/dist/lib/ant-swing.jar:/srv/gump/public/workspace/ant/dist/lib/ant-apache-resolver.jar:/srv/gump/public/workspace/ant/dist/lib/ant-apache-xalan2.jar:/srv/gump/public/workspace/ant/dist/lib/ant-trax.jar:/srv/gump/public/workspace/ant/dist/lib/ant-junit.jar:/srv/gump/public/workspace/ant/dist/lib/ant-launcher.jar:/srv/gump/public/workspace/ant/dist/lib/ant-nodeps.jar:/srv/gump/public/workspace/ant/dist/lib/ant.jar:/srv/gump/packages/cglib/cglib-nodep-2.1_3.jar:/srv/gump/packages/easymock1.2_Java1.3/easymock.jar:/srv/gump/packages/easymockclassextension1.2/easymockclassextension.jar:/srv/gump/packages/emma-2.0.5312/lib/emma.jar:/srv/gump/packages/emma-2.0.5312/lib/emma_ant.jar:/srv/gump/public/workspace/junit/dist/junit-08012009.jar:/srv/gump/public/workspace/maven-emma-plugin/target/maven-emma-plugin-08012009.jar:/srv/gump/packages/maven-site-p
 lugin/maven-site-plugin-1.6.1.jar:/srv/gump/public/workspace/slf4j/slf4j-simple/target/slf4j-simple-1.5.6.jar:/srv/gump/packages/spring-framework-1.2.6/dist/spring-beans.jar:/srv/gump/packages/spring-framework-1.2.6/dist/spring-core.jar:/srv/gump/packages/jsse1.0.3/lib/jcert.jar:/srv/gump/packages/jsse1.0.3/lib/jnet.jar:/srv/gump/packages/jsse1.0.3/lib/jsse.jar:/srv/gump/public/workspace/ant-contrib/target/ant-contrib-08012009.jar
---------------------------------------------
[INFO] ------------------------------------------------------------------------
[INFO] [resources:resources]
[INFO] Using default encoding to copy filtered resources.
Downloading: http://localhost:8192/maven2/tomcat/tomcat-apr/5.5.23/tomcat-apr-5.5.23.pom
632b downloaded
Downloading: http://localhost:8192/maven2/tomcat/tomcat-parent/5.5.23/tomcat-parent-5.5.23.pom
898b downloaded
[INFO] snapshot org.apache.mina:mina-core:2.0.0-RC1-SNAPSHOT: checking for updates from apache.snapshots
Downloading: http://people.apache.org/repo/m2-snapshot-repository/org/apache/mina/mina-core/2.0.0-RC1-SNAPSHOT/mina-core-2.0.0-RC1-SNAPSHOT.jar
Downloading: http://localhost:8192/maven2/tomcat/tomcat-apr/5.5.23/tomcat-apr-5.5.23.jar
24K downloaded
[INFO] ------------------------------------------------------------------------
[ERROR] BUILD ERROR
[INFO] ------------------------------------------------------------------------
[INFO] Failed to resolve artifact.

Missing:
----------
1) org.apache.mina:mina-core:jar:2.0.0-RC1-SNAPSHOT

  Try downloading the file manually from the project website.

  Then, install it using the command: 
      mvn install:install-file -DgroupId=org.apache.mina -DartifactId=mina-core -Dversion=2.0.0-RC1-SNAPSHOT -Dpackaging=jar -Dfile=/path/to/file

  Alternatively, if you host your own repository you can deploy the file there: 
      mvn deploy:deploy-file -DgroupId=org.apache.mina -DartifactId=mina-core -Dversion=2.0.0-RC1-SNAPSHOT -Dpackaging=jar -Dfile=/path/to/file -Durl=[url] -DrepositoryId=[id]

  Path to dependency: 
  	1) org.apache.mina:mina-transport-apr:bundle:2.0.0-RC1-SNAPSHOT
  	2) org.apache.mina:mina-core:jar:2.0.0-RC1-SNAPSHOT

----------
1 required artifact is missing.

for artifact: 
  org.apache.mina:mina-transport-apr:bundle:2.0.0-RC1-SNAPSHOT

from the specified remote repositories:
  apache.snapshots (http://people.apache.org/repo/m2-snapshot-repository),
  Gump (http://localhost:8192/maven2)


[INFO] ------------------------------------------------------------------------
[INFO] For more information, run Maven with the -e switch
[INFO] ------------------------------------------------------------------------
[INFO] Total time: 1 minute 37 seconds
[INFO] Finished at: Thu Jan 08 03:30:22 GMT-08:00 2009
[INFO] Final Memory: 16M/34M
[INFO] ------------------------------------------------------------------------
---------------------------------------------

To subscribe to this information via syndicated feeds:
- RSS: http://vmgump.apache.org/gump/public/mina/mina/rss.xml
- Atom: http://vmgump.apache.org/gump/public/mina/mina/atom.xml

============================== Gump Tracking Only ===
Produced by Gump version 2.3.
Gump Run 15000008012009, vmgump:vmgump-public:15000008012009
Gump E-mail Identifier (unique within run) #218.

*********************************************************** G U M P
[GUMP@vmgump]: Project invicta (in module invicta) failed
To whom it may engage...
        
This is an automated request, but not an unsolicited one. For 
more information please visit http://gump.apache.org/nagged.html, 
and/or contact the folk at general@gump.apache.org.

Project invicta has an issue affecting its community integration.
This issue affects 1 projects,
 and has been outstanding for 2 runs.
The current state of this project is 'Failed', with reason 'Configuration Failed'.
For reference only, the following projects are affected by this:
    - invicta :  Open-source build management tool.


Full details are available at:
    http://vmgump.apache.org/gump/public/invicta/invicta/index.html

That said, some information snippets are provided here.

The following annotations (debug/informational/warning/error messages) were provided:
 -DEBUG- Sole output [invicta-08012009.jar] identifier set to project name
 -DEBUG- Dependency on ant exists, no need to add for property ant.home.
 -INFO- Failed with reason configuration failed
 -ERROR- Bad Dependency. Project: commons-logging : unknown to *this* workspace 
 -ERROR- Bad Dependency. Project: commons-digester : unknown to *this* workspace 
 -ERROR- Bad Dependency. Project: commons-lang : unknown to *this* workspace 
 -ERROR- Bad Dependency. Project: commons-beanutils : unknown to *this* workspace 
 -ERROR- Bad Dependency. Project: commons-collections : unknown to *this* workspace 
 -INFO- Failed to extract fallback artifacts from Gump Repository

To subscribe to this information via syndicated feeds:
- RSS: http://vmgump.apache.org/gump/public/invicta/invicta/rss.xml
- Atom: http://vmgump.apache.org/gump/public/invicta/invicta/atom.xml

============================== Gump Tracking Only ===
Produced by Gump version 2.3.
Gump Run 15000008012009, vmgump:vmgump-public:15000008012009
Gump E-mail Identifier (unique within run) #223.

*********************************************************** G U M P
[GUMP@vmgump]: Project portals-bridges-frameworks (in module portals-bridges) failed
To whom it may engage...
        
This is an automated request, but not an unsolicited one. For 
more information please visit http://gump.apache.org/nagged.html, 
and/or contact the folk at general@gump.apache.org.

Project portals-bridges-frameworks has an issue affecting its community integration.
This issue affects 1 projects,
 and has been outstanding for 971 runs.
The current state of this project is 'Failed', with reason 'Configuration Failed'.
For reference only, the following projects are affected by this:
    - portals-bridges-frameworks :  Support for JSR168 compliant Portlet development


Full details are available at:
    http://vmgump.apache.org/gump/public/portals-bridges/portals-bridges-frameworks/index.html

That said, some information snippets are provided here.

The following annotations (debug/informational/warning/error messages) were provided:
 -DEBUG- Sole output [portals-bridges-frameworks-08012009.jar] identifier set to project name
 -DEBUG- Dependency on portals-pluto-api-1.0 exists, no need to add for property maven.jar.portlet-api.
 -DEBUG- Dependency on jakarta-servletapi-4 exists, no need to add for property maven.jar.servletapi.
 -INFO- Failed with reason configuration failed
 -ERROR- Bad Dependency. Project: commons-beanutils : unknown to *this* workspace 
 -ERROR- Bad Dependency. Project: commons-validator : unknown to *this* workspace 
 -INFO- Failed to extract fallback artifacts from Gump Repository

To subscribe to this information via syndicated feeds:
- RSS: http://vmgump.apache.org/gump/public/portals-bridges/portals-bridges-frameworks/rss.xml
- Atom: http://vmgump.apache.org/gump/public/portals-bridges/portals-bridges-frameworks/atom.xml

============================== Gump Tracking Only ===
Produced by Gump version 2.3.
Gump Run 15000008012009, vmgump:vmgump-public:15000008012009
Gump E-mail Identifier (unique within run) #224.

*********************************************************** G U M P
[GUMP@vmgump]: Project cocoon (in module cocoon) failed
To whom it may engage...
        
This is an automated request, but not an unsolicited one. For 
more information please visit http://gump.apache.org/nagged.html, 
and/or contact the folk at general@gump.apache.org.

Project cocoon has an issue affecting its community integration.
This issue affects 1 projects,
 and has been outstanding for 628 runs.
The current state of this project is 'Failed', with reason 'Build Failed'.
For reference only, the following projects are affected by this:
    - cocoon :  Java XML Framework


Full details are available at:
    http://vmgump.apache.org/gump/public/cocoon/cocoon/index.html

That said, some information snippets are provided here.

The following annotations (debug/informational/warning/error messages) were provided:
 -WARNING- Bad *Optional* Dependency. Project: commons-lang : unknown to *this* workspace
 -WARNING- Bad *Optional* Dependency. Project: commons-beanutils : unknown to *this* workspace
 -WARNING- Bad *Optional* Dependency. Project: commons-codec : unknown to *this* workspace
 -WARNING- Bad *Optional* Dependency. Project: commons-collections : unknown to *this* workspace
 -WARNING- Bad *Optional* Dependency. Project: commons-configuration : unknown to *this* workspace
 -WARNING- Bad *Optional* Dependency. Project: commons-digester : unknown to *this* workspace
 -WARNING- Bad *Optional* Dependency. Project: commons-io : unknown to *this* workspace
 -WARNING- Bad *Optional* Dependency. Project: commons-jexl : unknown to *this* workspace
 -WARNING- Bad *Optional* Dependency. Project: commons-jxpath : unknown to *this* workspace
 -WARNING- Bad *Optional* Dependency. Project: commons-logging : unknown to *this* workspace
 -WARNING- Bad *Optional* Dependency. Project: commons-validator : unknown to *this* workspace
 -DEBUG- (Gump generated) Maven2 Settings in: /srv/gump/public/workspace/cocoon/gump_mvn_settings.xml
 -INFO- Failed with reason build failed
 -DEBUG- Maven POM in: /srv/gump/public/workspace/cocoon/pom.xml



The following work was performed:
http://vmgump.apache.org/gump/public/cocoon/cocoon/gump_work/build_cocoon_cocoon.html
Work Name: build_cocoon_cocoon (Type: Build)
Work ended in a state of : Failed
Elapsed: 4 mins 21 secs
Command Line: mvn --batch-mode --settings /srv/gump/public/workspace/cocoon/gump_mvn_settings.xml package 
[Working Directory: /srv/gump/public/workspace/cocoon]
CLASSPATH: /usr/lib/jvm/java-1.5.0-sun/lib/tools.jar:/srv/gump/public/workspace/junit/dist/junit-08012009.jar:/srv/gump/public/workspace/ant/dist/lib/ant-jmf.jar:/srv/gump/public/workspace/ant/dist/lib/ant-swing.jar:/srv/gump/public/workspace/ant/dist/lib/ant-apache-resolver.jar:/srv/gump/public/workspace/ant/dist/lib/ant-apache-xalan2.jar:/srv/gump/public/workspace/ant/dist/lib/ant-trax.jar:/srv/gump/public/workspace/ant/dist/lib/ant-junit.jar:/srv/gump/public/workspace/ant/dist/lib/ant-launcher.jar:/srv/gump/public/workspace/ant/dist/lib/ant-nodeps.jar:/srv/gump/public/workspace/ant/dist/lib/ant.jar:/srv/gump/public/workspace/aopalliance/build/aopalliance.jar:/srv/gump/packages/bsh-2.0b4/bsh-commands-2.0b4.jar:/srv/gump/packages/bsh-2.0b4/bsh-classpath-2.0b4.jar:/srv/gump/packages/bsh-2.0b4/bsh-core-2.0b4.jar:/srv/gump/packages/bsh-2.0b4/bsh-bsf-2.0b4.jar:/srv/gump/packages/bsh-2.0b4/bsh-2.0b4.jar:/srv/gump/packages/bsh-2.0b4/bsh-reflect-2.0b4.jar:/srv/gump/packages/bsh-2.0
 b4/bsh-util-2.0b4.jar:commons-httpclient-gump-07012009.jar:/srv/gump/packages/dougLea/concurrent.jar:/srv/gump/public/workspace/dom4j/build/dom4j.jar:excalibur-datasource-gump-07012009.jar:excalibur-pool-instrumented-gump-07012009.jar:/srv/gump/public/workspace/hsqldb/lib/hsqldb.jar:/srv/gump/public/workspace/htmlunit/target/htmlunit-08012009.jar:/srv/gump/public/workspace/jakarta-oro/jakarta-oro-08012009.jar:/srv/gump/public/workspace/jakarta-regexp/build/jakarta-regexp-08012009.jar:/srv/gump/public/workspace/jaxen/target/jaxen-08012009.jar:/srv/gump/public/workspace/jdom/build/jdom.jar:/srv/gump/public/workspace/jmock/build/dist/jmock-core-08012009.jar:/srv/gump/public/workspace/jmock/build/dist/jmock-cglib-08012009.jar:/srv/gump/packages/jtidy-04aug2000r7-dev/build/Tidy.jar:/srv/gump/public/workspace/logging-log4j-12/dist/lib/log4j-08012009.jar:/srv/gump/packages/nekohtml-0.9.5/nekohtml.jar:/srv/gump/public/workspace/rhino/build/rhino_08012009/js.jar:velocity-gump-0701200
 9.jar:velocity-dep-gump-07012009.jar:/srv/gump/public/workspace/xml-commons/java/external/build/xml-apis-ext.jar:/srv/gump/public/workspace/xml-commons/java/external/build/xml-apis.jar:/srv/gump/public/workspace/xml-batik/batik-08012009/lib/batik-util.jar:/srv/gump/public/workspace/xml-batik/batik-08012009/lib/batik-swing.jar:/srv/gump/public/workspace/xml-batik/batik-08012009/lib/batik-css.jar:/srv/gump/public/workspace/xml-batik/batik-08012009/lib/batik-bridge.jar:/srv/gump/public/workspace/xml-batik/batik-08012009/lib/batik-xml.jar:/srv/gump/public/workspace/xml-batik/batik-08012009/lib/batik-svg-dom.jar:/srv/gump/public/workspace/xml-batik/batik-08012009/lib/batik-awt-util.jar:/srv/gump/public/workspace/xml-batik/batik-08012009/lib/batik-transcoder.jar:/srv/gump/public/workspace/xml-batik/batik-08012009/lib/batik-gui-util.jar:/srv/gump/public/workspace/xml-batik/batik-08012009/lib/batik-dom.jar:/srv/gump/public/workspace/xml-batik/batik-08012009/lib/batik-ext.jar:/srv/gu
 mp/public/workspace/xml-batik/batik-08012009/lib/batik-script.jar:/srv/gump/public/workspace/xml-batik/batik-08012009/lib/batik-svggen.jar:/srv/gump/public/workspace/xml-batik/batik-08012009/lib/batik-parser.jar:/srv/gump/public/workspace/xml-batik/batik-08012009/lib/batik-extension.jar:/srv/gump/public/workspace/xml-batik/batik-08012009/lib/batik-gvt.jar:fop-gump-07012009.jar:/srv/gump/public/workspace/xml-commons/java/build/resolver.jar:/srv/gump/public/workspace/xml-xerces2/build/xercesImpl.jar:/srv/gump/public/workspace/xmlunit/build/lib/xmlunit-08012009.jar:/srv/gump/public/workspace/xom/build/xom-08012009.jar
---------------------------------------------
[INFO] Using default encoding to copy filtered resources.
Downloading: http://localhost:8192/maven2/commons-jexl/commons-jexl/1.0/commons-jexl-1.0.pom
156b downloaded
[INFO] snapshot org.apache.cocoon:cocoon-configuration-api:1.0.3-SNAPSHOT: checking for updates from gkossakowski-maven2
[INFO] snapshot org.apache.cocoon:cocoon-configuration-api:1.0.3-SNAPSHOT: checking for updates from apache.snapshots
Downloading: http://people.apache.org/~gkossakowski/maven2/repository/org/apache/cocoon/cocoon-configuration-api/1.0.3-SNAPSHOT/cocoon-configuration-api-1.0.3-SNAPSHOT.jar
Downloading: http://people.apache.org/repo/m2-snapshot-repository/org/apache/cocoon/cocoon-configuration-api/1.0.3-SNAPSHOT/cocoon-configuration-api-1.0.3-SNAPSHOT.jar
Downloading: http://localhost:8192/maven2/commons-jexl/commons-jexl/1.0/commons-jexl-1.0.jar
128K downloaded
[INFO] ------------------------------------------------------------------------
[ERROR] BUILD ERROR
[INFO] ------------------------------------------------------------------------
[INFO] Failed to resolve artifact.

Missing:
----------
1) org.apache.cocoon:cocoon-configuration-api:jar:1.0.3-SNAPSHOT

  Try downloading the file manually from the project website.

  Then, install it using the command: 
      mvn install:install-file -DgroupId=org.apache.cocoon -DartifactId=cocoon-configuration-api -Dversion=1.0.3-SNAPSHOT -Dpackaging=jar -Dfile=/path/to/file

  Alternatively, if you host your own repository you can deploy the file there: 
      mvn deploy:deploy-file -DgroupId=org.apache.cocoon -DartifactId=cocoon-configuration-api -Dversion=1.0.3-SNAPSHOT -Dpackaging=jar -Dfile=/path/to/file -Durl=[url] -DrepositoryId=[id]

  Path to dependency: 
  	1) org.apache.cocoon:cocoon-expression-language-impl:jar:1.1.0-SNAPSHOT
  	2) org.apache.cocoon:cocoon-spring-configurator:jar:2.1.0-SNAPSHOT
  	3) org.apache.cocoon:cocoon-configuration-api:jar:1.0.3-SNAPSHOT

----------
1 required artifact is missing.

for artifact: 
  org.apache.cocoon:cocoon-expression-language-impl:jar:1.1.0-SNAPSHOT

from the specified remote repositories:
  gkossakowski-maven2 (http://people.apache.org/~gkossakowski/maven2/repository),
  apache.snapshots (http://people.apache.org/repo/m2-snapshot-repository),
  Gump (http://localhost:8192/maven2)


[INFO] ------------------------------------------------------------------------
[INFO] For more information, run Maven with the -e switch
[INFO] ------------------------------------------------------------------------
[INFO] Total time: 4 minutes 19 seconds
[INFO] Finished at: Thu Jan 08 03:38:06 GMT-08:00 2009
[INFO] Final Memory: 48M/63M
[INFO] ------------------------------------------------------------------------
---------------------------------------------

To subscribe to this information via syndicated feeds:
- RSS: http://vmgump.apache.org/gump/public/cocoon/cocoon/rss.xml
- Atom: http://vmgump.apache.org/gump/public/cocoon/cocoon/atom.xml

============================== Gump Tracking Only ===
Produced by Gump version 2.3.
Gump Run 15000008012009, vmgump:vmgump-public:15000008012009
Gump E-mail Identifier (unique within run) #226.

*********************************************************** G U M P
[GUMP@vmgump]: Project maven-bootstrap (in module maven) failed
To whom it may engage...
        
This is an automated request, but not an unsolicited one. For 
more information please visit http://gump.apache.org/nagged.html, 
and/or contact the folk at general@gump.apache.org.

Project maven-bootstrap has an issue affecting its community integration.
This issue affects 1 projects,
 and has been outstanding for 5 runs.
The current state of this project is 'Failed', with reason 'Configuration Failed'.
For reference only, the following projects are affected by this:
    - maven-bootstrap :  Project Management Tools


Full details are available at:
    http://vmgump.apache.org/gump/public/maven/maven-bootstrap/index.html

That said, some information snippets are provided here.

The following annotations (debug/informational/warning/error messages) were provided:
 -ERROR- No such project [commons-lang] for property.
 -ERROR- No such project [commons-logging] for property.
 -ERROR- Cannot resolve output/outputpath of *unknown* [commons-logging]
 -ERROR- Unhandled Property: maven.jar.commons-logging on: Ant on Project:maven-bootstrap
 -ERROR- Cannot resolve output/outputpath of *unknown* [commons-lang]
 -ERROR- Unhandled Property: maven.jar.commons-lang on: Ant on Project:maven-bootstrap
 -DEBUG- Dependency on ant exists, no need to add for property maven.jar.ant.
 -DEBUG- Dependency on xml-commons-which exists, no need to add for property maven.jar.which.
 -INFO- Failed with reason configuration failed
 -ERROR- Bad Dependency. Project: commons-betwixt : unknown to *this* workspace 
 -ERROR- Bad Dependency. Project: commons-beanutils : unknown to *this* workspace 
 -ERROR- Bad Dependency. Project: commons-collections : unknown to *this* workspace 
 -ERROR- Bad Dependency. Project: commons-digester : unknown to *this* workspace 
 -ERROR- Bad Dependency. Project: commons-jexl : unknown to *this* workspace 
 -ERROR- Bad Dependency. Project: commons-io : unknown to *this* workspace 

To subscribe to this information via syndicated feeds:
- RSS: http://vmgump.apache.org/gump/public/maven/maven-bootstrap/rss.xml
- Atom: http://vmgump.apache.org/gump/public/maven/maven-bootstrap/atom.xml

============================== Gump Tracking Only ===
Produced by Gump version 2.3.
Gump Run 15000008012009, vmgump:vmgump-public:15000008012009
Gump E-mail Identifier (unique within run) #230.

*********************************************************** G U M P
[GUMP@vmgump]: Project JacORB (in module JacORB) failed
To whom it may engage...
        
This is an automated request, but not an unsolicited one. For 
more information please visit http://gump.apache.org/nagged.html, 
and/or contact the folk at general@gump.apache.org.

Project JacORB has an issue affecting its community integration.
This issue affects 1 projects,
 and has been outstanding for 492 runs.
The current state of this project is 'Failed', with reason 'Configuration Failed'.
For reference only, the following projects are affected by this:
    - JacORB :  The free Java implementation of the OMG's CORBA standard.


Full details are available at:
    http://vmgump.apache.org/gump/public/JacORB/JacORB/index.html

That said, some information snippets are provided here.

The following annotations (debug/informational/warning/error messages) were provided:
 -INFO- Failed with reason configuration failed
 -ERROR- Bad Dependency. Project: commons-collections : unknown to *this* workspace 
 -ERROR- Bad Dependency. Project: commons-logging : unknown to *this* workspace 

To subscribe to this information via syndicated feeds:
- RSS: http://vmgump.apache.org/gump/public/JacORB/JacORB/rss.xml
- Atom: http://vmgump.apache.org/gump/public/JacORB/JacORB/atom.xml

============================== Gump Tracking Only ===
Produced by Gump version 2.3.
Gump Run 15000008012009, vmgump:vmgump-public:15000008012009
Gump E-mail Identifier (unique within run) #232.

*********************************************************** G U M P
[GUMP@vmgump]: Project lenya (in module lenya) failed
To whom it may engage...
        
This is an automated request, but not an unsolicited one. For 
more information please visit http://gump.apache.org/nagged.html, 
and/or contact the folk at general@gump.apache.org.

Project lenya has an issue affecting its community integration.
This issue affects 1 projects,
 and has been outstanding for 609 runs.
The current state of this project is 'Failed', with reason 'Configuration Failed'.
For reference only, the following projects are affected by this:
    - lenya :  Content Management System


Full details are available at:
    http://vmgump.apache.org/gump/public/lenya/lenya/index.html

That said, some information snippets are provided here.

The following annotations (debug/informational/warning/error messages) were provided:
 -INFO- Failed with reason configuration failed
 -ERROR- Bad Dependency. Project: commons-io : unknown to *this* workspace 

To subscribe to this information via syndicated feeds:
- RSS: http://vmgump.apache.org/gump/public/lenya/lenya/rss.xml
- Atom: http://vmgump.apache.org/gump/public/lenya/lenya/atom.xml

============================== Gump Tracking Only ===
Produced by Gump version 2.3.
Gump Run 15000008012009, vmgump:vmgump-public:15000008012009
Gump E-mail Identifier (unique within run) #236.

*********************************************************** G U M P
[GUMP@vmgump]: Project maven (in module maven) failed
To whom it may engage...
        
This is an automated request, but not an unsolicited one. For 
more information please visit http://gump.apache.org/nagged.html, 
and/or contact the folk at general@gump.apache.org.

Project maven has an issue affecting its community integration.
This issue affects 1 projects,
 and has been outstanding for 5 runs.
The current state of this project is 'Failed', with reason 'Configuration Failed'.
For reference only, the following projects are affected by this:
    - maven :  Project Management Tools


Full details are available at:
    http://vmgump.apache.org/gump/public/maven/maven/index.html

That said, some information snippets are provided here.

The following annotations (debug/informational/warning/error messages) were provided:
 -DEBUG- Sole output [maven-08012009.jar] identifier set to project name
 -INFO- Failed with reason configuration failed
 -ERROR- Bad Dependency. Project: commons-beanutils : unknown to *this* workspace 
 -ERROR- Bad Dependency. Project: commons-collections : unknown to *this* workspace 
 -ERROR- Bad Dependency. Project: commons-digester : unknown to *this* workspace 
 -ERROR- Bad Dependency. Project: commons-io : unknown to *this* workspace 
 -ERROR- Bad Dependency. Project: commons-jexl : unknown to *this* workspace 
 -ERROR- Bad Dependency. Project: commons-lang : unknown to *this* workspace 
 -ERROR- Bad Dependency. Project: commons-logging : unknown to *this* workspace 
 -INFO- Failed to extract fallback artifacts from Gump Repository

To subscribe to this information via syndicated feeds:
- RSS: http://vmgump.apache.org/gump/public/maven/maven/rss.xml
- Atom: http://vmgump.apache.org/gump/public/maven/maven/atom.xml

============================== Gump Tracking Only ===
Produced by Gump version 2.3.
Gump Run 15000008012009, vmgump:vmgump-public:15000008012009
Gump E-mail Identifier (unique within run) #241.

*********************************************************** G U M P
[GUMP@vmgump]: Project apacheds-core (in module apacheds) failed
To whom it may engage...
        
This is an automated request, but not an unsolicited one. For 
more information please visit http://gump.apache.org/nagged.html, 
and/or contact the folk at general@gump.apache.org.

Project apacheds-core has an issue affecting its community integration.
This issue affects 1 projects,
 and has been outstanding for 604 runs.
The current state of this project is 'Failed', with reason 'Configuration Failed'.
For reference only, the following projects are affected by this:
    - apacheds-core :  Apache Directory Server


Full details are available at:
    http://vmgump.apache.org/gump/public/apacheds/apacheds-core/index.html

That said, some information snippets are provided here.

The following annotations (debug/informational/warning/error messages) were provided:
 -DEBUG- Sole output [apacheds-core-08012009.jar] identifier set to project name
 -DEBUG- Dependency on jakarta-regexp exists, no need to add for property maven.jar.regexp.
 -DEBUG- Dependency on jakarta-oro exists, no need to add for property maven.jar.oro.
 -DEBUG- Dependency on aspectj exists, no need to add for property maven.jar.aspectjrt.
 -INFO- Failed with reason configuration failed
 -ERROR- Bad Dependency. Project: commons-collections : unknown to *this* workspace 
 -ERROR- Bad Dependency. Project: commons-io : unknown to *this* workspace 
 -ERROR- Bad Dependency. Project: commons-lang : unknown to *this* workspace 
 -ERROR- Bad Dependency. Project: commons-logging : unknown to *this* workspace 
 -ERROR- Bad Dependency. Project: commons-primitives : unknown to *this* workspace 
 -INFO- Failed to extract fallback artifacts from Gump Repository

To subscribe to this information via syndicated feeds:
- RSS: http://vmgump.apache.org/gump/public/apacheds/apacheds-core/rss.xml
- Atom: http://vmgump.apache.org/gump/public/apacheds/apacheds-core/atom.xml

============================== Gump Tracking Only ===
Produced by Gump version 2.3.
Gump Run 15000008012009, vmgump:vmgump-public:15000008012009
Gump E-mail Identifier (unique within run) #242.

*********************************************************** G U M P
[GUMP@vmgump]: Project apacheds-main (in module apacheds) failed
To whom it may engage...
        
This is an automated request, but not an unsolicited one. For 
more information please visit http://gump.apache.org/nagged.html, 
and/or contact the folk at general@gump.apache.org.

Project apacheds-main has an issue affecting its community integration.
This issue affects 1 projects,
 and has been outstanding for 602 runs.
The current state of this project is 'Failed', with reason 'Configuration Failed'.
For reference only, the following projects are affected by this:
    - apacheds-main :  Apache Directory Server


Full details are available at:
    http://vmgump.apache.org/gump/public/apacheds/apacheds-main/index.html

That said, some information snippets are provided here.

The following annotations (debug/informational/warning/error messages) were provided:
 -DEBUG- Sole output [apacheds-main-08012009.jar] identifier set to project name
 -DEBUG- Dependency on jakarta-regexp exists, no need to add for property maven.jar.regexp.
 -DEBUG- Dependency on jakarta-oro exists, no need to add for property maven.jar.oro.
 -DEBUG- Dependency on aspectj exists, no need to add for property maven.jar.aspectjrt.
 -INFO- Failed with reason configuration failed
 -ERROR- Bad Dependency. Project: commons-collections : unknown to *this* workspace 
 -ERROR- Bad Dependency. Project: commons-lang : unknown to *this* workspace 
 -ERROR- Bad Dependency. Project: commons-logging : unknown to *this* workspace 
 -ERROR- Bad Dependency. Project: commons-primitives : unknown to *this* workspace 
 -INFO- Failed to extract fallback artifacts from Gump Repository

To subscribe to this information via syndicated feeds:
- RSS: http://vmgump.apache.org/gump/public/apacheds/apacheds-main/rss.xml
- Atom: http://vmgump.apache.org/gump/public/apacheds/apacheds-main/atom.xml

============================== Gump Tracking Only ===
Produced by Gump version 2.3.
Gump Run 15000008012009, vmgump:vmgump-public:15000008012009
Gump E-mail Identifier (unique within run) #245.


--
Apache Gump
http://gump.apache.org/ [Instance: vmgump]

---------------------------------------------------------------------
To unsubscribe, e-mail: general-unsubscribe@gump.apache.org
For additional commands, e-mail: general-help@gump.apache.org


Mime
View raw message