gump-general mailing list archives

Site index · List index
Message view « Date » · « Thread »
Top « Date » · « Thread »
From g...@vmgump.apache.org
Subject BATCH: All dressed up, with nowhere to go...
Date Fri, 02 Jan 2009 05:38:40 GMT
Dear Gumpmeisters,
            
The following 30 notifys should have been sent

*********************************************************** G U M P
[GUMP@vmgump]: Module james-mailet success, but with warnings.
[GUMP@vmgump]: Project jmock2 (in module jmock2) failed
[GUMP@vmgump]: Module town failed
[GUMP@vmgump]: Project ws-commons-xmlschema (in module ws-axis2-commons) failed
[GUMP@vmgump]: Project derby (in module db-derby) failed
[GUMP@vmgump]: Project dotnet-antlib-test (in module ant-antlibs) failed
[GUMP@vmgump]: Project emma (in module emma) failed
[GUMP@vmgump]: Project apache-httpd-configure (in module apache-httpd) failed
[GUMP@vmgump]: Project slf4j (in module slf4j) failed
[GUMP@vmgump]: Project castor (in module castor) failed
[GUMP@vmgump]: Project commons-jci (in module commons-sandbox) failed
[GUMP@vmgump]: Module jakarta-tomcat-5 success, but with warnings.
[GUMP@vmgump]: Project jtidy-cvs (in module jtidy) failed
[GUMP@vmgump]: Project naming-config (in module directory-naming) failed
[GUMP@vmgump]: Project xml-security-tests (in module xml-security) failed
[GUMP@vmgump]: Module jakarta-bsf success, but with warnings.
[GUMP@vmgump]: Project apacheds-shared (in module apacheds) failed
[GUMP@vmgump]: Module groovy success, but with warnings.
[GUMP@vmgump]: Project groovy (in module groovy) failed
[GUMP@vmgump]: Project kerberos-common (in module kerberos-shared) failed
[GUMP@vmgump]: Project JacORB-idllib (in module JacORB) failed
[GUMP@vmgump]: Module jakarta-tomcat success, but with warnings.
[GUMP@vmgump]: Project hivemind (in module hivemind) failed
[GUMP@vmgump]: Project tapestry (in module tapestry) failed
[GUMP@vmgump]: Project ws-commons-axiom (in module ws-axis2-commons) failed
[GUMP@vmgump]: Project ws-commons-policy (in module ws-axis2-commons) failed
[GUMP@vmgump]: Project jetty (in module jetty) failed
[GUMP@vmgump]: Module smartfrog success, but with warnings.
[GUMP@vmgump]: Project mina (in module mina) failed
[GUMP@vmgump]: Project cocoon (in module cocoon) failed
*********************************************************** G U M P
[GUMP@vmgump]: Module james-mailet success, but with warnings.
To whom it may engage...
        
This is an automated request, but not an unsolicited one. For 
more information please visit http://gump.apache.org/nagged.html, 
and/or contact the folk at general@gump.apache.org.

Module james-mailet contains errors.
The current state of this module is 'Success'.

Full details are available at:
    http://vmgump.apache.org/gump/public/james-mailet/index.html

That said, some information snippets are provided here.

The following annotations (debug/informational/warning/error messages) were provided:
 -ERROR- *** Failed to update from source control. Stale contents ***



The following work was performed:
http://vmgump.apache.org/gump/public/james-mailet/gump_work/update_james-mailet.html
Work Name: update_james-mailet (Type: Update)
Work ended in a state of : Failed
Elapsed: 2 secs
Command Line: svn --quiet update --non-interactive james-mailet 
[Working Directory: /srv/gump/public/workspace/cvs]
---------------------------------------------
svn: REPORT request failed on '/repos/asf/!svn/vcc/default'
svn: Target path does not exist
---------------------------------------------

To subscribe to this information via syndicated feeds:
- RSS: http://vmgump.apache.org/gump/public/james-mailet/rss.xml
- Atom: http://vmgump.apache.org/gump/public/james-mailet/atom.xml

============================== Gump Tracking Only ===
Produced by Gump version 2.3.
Gump Run 21000002012009, vmgump:vmgump-public:21000002012009
Gump E-mail Identifier (unique within run) #3.

*********************************************************** G U M P
[GUMP@vmgump]: Project jmock2 (in module jmock2) failed
To whom it may engage...
        
This is an automated request, but not an unsolicited one. For 
more information please visit http://gump.apache.org/nagged.html, 
and/or contact the folk at general@gump.apache.org.

Project jmock2 has an issue affecting its community integration.
This issue affects 1 projects,
 and has been outstanding for 178 runs.
The current state of this project is 'Failed', with reason 'Build Failed'.
For reference only, the following projects are affected by this:
    - jmock2 :  jMock is a library for testing Java code using mock objects.


Full details are available at:
    http://vmgump.apache.org/gump/public/jmock2/jmock2/index.html

That said, some information snippets are provided here.

The following annotations (debug/informational/warning/error messages) were provided:
 -INFO- Failed with reason build failed
 -INFO- Failed to extract fallback artifacts from Gump Repository



The following work was performed:
http://vmgump.apache.org/gump/public/jmock2/jmock2/gump_work/build_jmock2_jmock2.html
Work Name: build_jmock2_jmock2 (Type: Build)
Work ended in a state of : Failed
Elapsed: 5 secs
Command Line: /usr/lib/jvm/java-1.5.0-sun/bin/java -Djava.awt.headless=true -Xbootclasspath/p:/srv/gump/public/workspace/xml-xerces2/build/xercesImpl.jar:/srv/gump/public/workspace/xml-commons/java/external/build/xml-apis.jar org.apache.tools.ant.Main -Dgump.merge=/srv/gump/public/gump/work/merge.xml -Dbuild.sysclasspath=only -Dversion=02012009 
[Working Directory: /srv/gump/public/workspace/jmock2]
CLASSPATH: /usr/lib/jvm/java-1.5.0-sun/lib/tools.jar:/srv/gump/public/workspace/jmock2/build/classes:/srv/gump/public/workspace/jmock2/lib/objenesis-1.0.jar:/srv/gump/public/workspace/ant/dist/lib/ant-jmf.jar:/srv/gump/public/workspace/ant/dist/lib/ant-swing.jar:/srv/gump/public/workspace/ant/dist/lib/ant-apache-resolver.jar:/srv/gump/public/workspace/ant/dist/lib/ant-apache-xalan2.jar:/srv/gump/public/workspace/ant/dist/lib/ant-trax.jar:/srv/gump/public/workspace/ant/dist/lib/ant-junit.jar:/srv/gump/public/workspace/ant/dist/lib/ant-launcher.jar:/srv/gump/public/workspace/ant/dist/lib/ant-nodeps.jar:/srv/gump/public/workspace/ant/dist/lib/ant.jar:/srv/gump/packages/bsh-2.0b4/bsh-commands-2.0b4.jar:/srv/gump/packages/bsh-2.0b4/bsh-classpath-2.0b4.jar:/srv/gump/packages/bsh-2.0b4/bsh-core-2.0b4.jar:/srv/gump/packages/bsh-2.0b4/bsh-bsf-2.0b4.jar:/srv/gump/packages/bsh-2.0b4/bsh-2.0b4.jar:/srv/gump/packages/bsh-2.0b4/bsh-reflect-2.0b4.jar:/srv/gump/packages/bsh-2.0b4/bsh-util-2.
 0b4.jar:/srv/gump/packages/cglib/cglib-nodep-2.1_3.jar:/srv/gump/public/workspace/hamcrest/hamcrest-java/build/hamcrest-core-02012009.jar:/srv/gump/public/workspace/hamcrest/hamcrest-java/build/hamcrest-library-02012009.jar:/srv/gump/public/workspace/junit/dist/junit-02012009.jar:/srv/gump/packages/junit3.8.1/junit.jar:/srv/gump/public/workspace/xml-commons/java/external/build/xml-apis-ext.jar
---------------------------------------------
    [javac] location: class org.jmock.test.unit.lib.CurrentStateMatcherTest
    [javac]         assertTrue("should match", isNotCurrently("S").matches(stateMachine));
    [javac]         ^
    [javac] /srv/gump/public/workspace/jmock2/test/org/jmock/test/unit/lib/CurrentStateMatcherTest.java:38: cannot find symbol
    [javac] symbol  : method assertTrue(java.lang.String,boolean)
    [javac] location: class org.jmock.test.unit.lib.CurrentStateMatcherTest
    [javac]         assertTrue("should not match", !isCurrentlyS.matches(null));
    [javac]         ^
    [javac] /srv/gump/public/workspace/jmock2/test/org/jmock/test/unit/lib/CurrentStateMatcherTest.java:42: cannot find symbol
    [javac] symbol  : method assertTrue(java.lang.String,boolean)
    [javac] location: class org.jmock.test.unit.lib.CurrentStateMatcherTest
    [javac]         assertTrue("should not match", !isCurrentlyS.matches("something else"));
    [javac]         ^
    [javac] /srv/gump/public/workspace/jmock2/test/org/jmock/test/unit/lib/CurrentStateMatcherTest.java:46: cannot find symbol
    [javac] symbol  : method assertEquals(java.lang.String,java.lang.String)
    [javac] location: class org.jmock.test.unit.lib.CurrentStateMatcherTest
    [javac]         assertEquals("a state machine that is S", asString(isCurrently("S")));
    [javac]         ^
    [javac] /srv/gump/public/workspace/jmock2/test/org/jmock/test/unit/lib/CurrentStateMatcherTest.java:47: cannot find symbol
    [javac] symbol  : method assertEquals(java.lang.String,java.lang.String)
    [javac] location: class org.jmock.test.unit.lib.CurrentStateMatcherTest
    [javac]         assertEquals("a state machine that is not S", asString(isNotCurrently("S")));
    [javac]         ^
    [javac] /srv/gump/public/workspace/jmock2/test/org/jmock/test/unit/lib/CurrentStateMatcherTest.java:53: cannot find symbol
    [javac] symbol  : method assertMismatchDescription(java.lang.String,org.hamcrest.Matcher<org.jmock.States>,org.jmock.States)
    [javac] location: class org.jmock.test.unit.lib.CurrentStateMatcherTest
    [javac]         assertMismatchDescription("was not S", isCurrently("S"), stateMachine);
    [javac]         ^
    [javac] /srv/gump/public/workspace/jmock2/test/org/jmock/test/unit/lib/CurrentStateMatcherTest.java:56: method does not override a method from its superclass
    [javac]     @Override
    [javac]      ^
    [javac] /srv/gump/public/workspace/jmock2/test/org/jmock/test/unit/support/SyntheticEmptyInterfaceClassLoader.java:35: cannot find symbol
    [javac] symbol  : variable COMPUTE_MAXS
    [javac] location: class net.sf.cglib.asm.ClassWriter
    [javac]         ClassWriter writer = new ClassWriter(ClassWriter.COMPUTE_MAXS);
    [javac]                                                         ^
    [javac] /srv/gump/public/workspace/jmock2/test/org/jmock/test/unit/support/SyntheticEmptyInterfaceClassLoader.java:35: internal error; cannot instantiate ClassWriter(boolean) at net.sf.cglib.asm.ClassWriter to ()
    [javac]         ClassWriter writer = new ClassWriter(ClassWriter.COMPUTE_MAXS);
    [javac]                              ^
    [javac] /srv/gump/public/workspace/jmock2/test/org/jmock/test/unit/support/SyntheticEmptyInterfaceClassLoader.java:36: visit(int,int,java.lang.String,java.lang.String,java.lang.String[],java.lang.String) in net.sf.cglib.asm.ClassWriter cannot be applied to (int,int,java.lang.String,<nulltype>,java.lang.String,<nulltype>)
    [javac]                 writer.visit(CLASS_FORMAT_VERSION,
    [javac]                       ^
    [javac] Note: Some input files use or override a deprecated API.
    [javac] Note: Recompile with -Xlint:deprecation for details.
    [javac] 21 errors

BUILD FAILED
/srv/gump/public/workspace/jmock2/build.xml:61: Compile failed; see the compiler error output for details.

Total time: 4 seconds
---------------------------------------------

To subscribe to this information via syndicated feeds:
- RSS: http://vmgump.apache.org/gump/public/jmock2/jmock2/rss.xml
- Atom: http://vmgump.apache.org/gump/public/jmock2/jmock2/atom.xml

============================== Gump Tracking Only ===
Produced by Gump version 2.3.
Gump Run 21000002012009, vmgump:vmgump-public:21000002012009
Gump E-mail Identifier (unique within run) #4.

*********************************************************** G U M P
[GUMP@vmgump]: Module town failed
To whom it may engage...
        
This is an automated request, but not an unsolicited one. For 
more information please visit http://gump.apache.org/nagged.html, 
and/or contact the folk at general@gump.apache.org.

Module town has an issue affecting its community integration,
 and has been outstanding for 1336 runs.
The current state of this module is 'Failed', with reason 'Update Failed'.

Full details are available at:
    http://vmgump.apache.org/gump/public/town/index.html

That said, some information snippets are provided here.

The following annotations (debug/informational/warning/error messages) were provided:
 -INFO- Failed with reason update failed



The following work was performed:
http://vmgump.apache.org/gump/public/town/gump_work/update_town.html
Work Name: update_town (Type: Update)
Work ended in a state of : Failed
Elapsed: 
Command Line: cvs -q -z3 -d :pserver:anoncvs@share.whichever.com:/home/cvspublic checkout -P -d town town 
[Working Directory: /srv/gump/public/workspace/cvs]
---------------------------------------------
Unknown host share.whichever.com.
---------------------------------------------

To subscribe to this information via syndicated feeds:
- RSS: http://vmgump.apache.org/gump/public/town/rss.xml
- Atom: http://vmgump.apache.org/gump/public/town/atom.xml

============================== Gump Tracking Only ===
Produced by Gump version 2.3.
Gump Run 21000002012009, vmgump:vmgump-public:21000002012009
Gump E-mail Identifier (unique within run) #5.

*********************************************************** G U M P
[GUMP@vmgump]: Project ws-commons-xmlschema (in module ws-axis2-commons) failed
To whom it may engage...
        
This is an automated request, but not an unsolicited one. For 
more information please visit http://gump.apache.org/nagged.html, 
and/or contact the folk at general@gump.apache.org.

Project ws-commons-xmlschema has an issue affecting its community integration.
This issue affects 4 projects,
 and has been outstanding for 148 runs.
The current state of this project is 'Failed', with reason 'Build Failed'.
For reference only, the following projects are affected by this:
    - ws-axis2 :  Apache Axis2 SOAP Stack
    - ws-commons-xmlschema :  Common stuff for the WS projects.
    - ws-juddi :  ws-juddi -- UDDI Toolkit/Repository
    - ws-juddi-test :  ws-juddi -- UDDI Toolkit/Repository


Full details are available at:
    http://vmgump.apache.org/gump/public/ws-axis2-commons/ws-commons-xmlschema/index.html

That said, some information snippets are provided here.

The following annotations (debug/informational/warning/error messages) were provided:
 -DEBUG- Sole output [ws-commons-xmlschema-02012009.jar] identifier set to project name
 -INFO- Failed with reason build failed
 -INFO- Failed to extract fallback artifacts from Gump Repository



The following work was performed:
http://vmgump.apache.org/gump/public/ws-axis2-commons/ws-commons-xmlschema/gump_work/build_ws-axis2-commons_ws-commons-xmlschema.html
Work Name: build_ws-axis2-commons_ws-commons-xmlschema (Type: Build)
Work ended in a state of : Failed
Elapsed: 
Command Line: /usr/lib/jvm/java-1.5.0-sun/bin/java -Djava.awt.headless=true -Xbootclasspath/p:/srv/gump/public/workspace/xml-commons/java/external/build/xml-apis.jar:/srv/gump/public/workspace/xml-xerces2/build/xercesImpl.jar:/srv/gump/public/workspace/xml-xalan/build/serializer.jar:/srv/gump/public/workspace/xml-xalan/build/xalan-unbundled.jar org.apache.tools.ant.Main -Dgump.merge=/srv/gump/public/gump/work/merge.xml -Dbuild.sysclasspath=only -Doutput.jar=ws-commons-xmlschema-02012009 -DdownloadLibs=false jar 
[Working Directory: /srv/gump/public/workspace/ws-axis2-commons/XmlSchema]
CLASSPATH: /usr/lib/jvm/java-1.5.0-sun/lib/tools.jar:/srv/gump/public/workspace/ws-axis2-commons/XmlSchema/build/classes:/srv/gump/public/workspace/ws-axis2-commons/XmlSchema/build/test-classes:/srv/gump/public/workspace/xml-commons/java/external/build/xml-apis-ext.jar:/srv/gump/public/workspace/xmlunit/build/lib/xmlunit-02012009.jar:/srv/gump/public/workspace/ant/dist/lib/ant-jmf.jar:/srv/gump/public/workspace/ant/dist/lib/ant-swing.jar:/srv/gump/public/workspace/ant/dist/lib/ant-apache-resolver.jar:/srv/gump/public/workspace/ant/dist/lib/ant-apache-xalan2.jar:/srv/gump/public/workspace/ant/dist/lib/ant-trax.jar:/srv/gump/public/workspace/ant/dist/lib/ant-junit.jar:/srv/gump/public/workspace/ant/dist/lib/ant-launcher.jar:/srv/gump/public/workspace/ant/dist/lib/ant-nodeps.jar:/srv/gump/public/workspace/ant/dist/lib/ant.jar:/srv/gump/packages/junit3.8.1/junit.jar:/srv/gump/public/workspace/xml-commons/java/build/resolver.jar:/srv/gump/packages/stax/jsr173_1.0_api.jar:/srv/gump
 /packages/stax/jsr173_1.0_ri.jar:/srv/gump/public/workspace/junit/dist/junit-02012009.jar
---------------------------------------------
Buildfile: build.xml does not exist!
Build failed
---------------------------------------------

To subscribe to this information via syndicated feeds:
- RSS: http://vmgump.apache.org/gump/public/ws-axis2-commons/ws-commons-xmlschema/rss.xml
- Atom: http://vmgump.apache.org/gump/public/ws-axis2-commons/ws-commons-xmlschema/atom.xml

============================== Gump Tracking Only ===
Produced by Gump version 2.3.
Gump Run 21000002012009, vmgump:vmgump-public:21000002012009
Gump E-mail Identifier (unique within run) #7.

*********************************************************** G U M P
[GUMP@vmgump]: Project derby (in module db-derby) failed
To whom it may engage...
        
This is an automated request, but not an unsolicited one. For 
more information please visit http://gump.apache.org/nagged.html, 
and/or contact the folk at general@gump.apache.org.

Project derby has an issue affecting its community integration.
This issue affects 1 projects,
 and has been outstanding for 148 runs.
The current state of this project is 'Failed', with reason 'Build Failed'.
For reference only, the following projects are affected by this:
    - derby :  Apache Derby, 100% Java relational database.


Full details are available at:
    http://vmgump.apache.org/gump/public/db-derby/derby/index.html

That said, some information snippets are provided here.

The following annotations (debug/informational/warning/error messages) were provided:
 -INFO- Failed with reason build failed
 -INFO- Failed to extract fallback artifacts from Gump Repository



The following work was performed:
http://vmgump.apache.org/gump/public/db-derby/derby/gump_work/build_db-derby_derby.html
Work Name: build_db-derby_derby (Type: Build)
Work ended in a state of : Failed
Elapsed: 46 secs
Command Line: /usr/lib/jvm/java-1.5.0-sun/bin/java -Djava.awt.headless=true -Xbootclasspath/p:/srv/gump/public/workspace/xml-commons/java/external/build/xml-apis.jar:/srv/gump/public/workspace/xml-xerces2/build/xercesImpl.jar:/srv/gump/public/workspace/xml-xalan/build/serializer.jar:/srv/gump/public/workspace/xml-xalan/build/xalan-unbundled.jar org.apache.tools.ant.Main -Dgump.merge=/srv/gump/public/gump/work/merge.xml -Dbuild.sysclasspath=only -Dsane=false gump_all 
[Working Directory: /srv/gump/public/workspace/db-derby]
CLASSPATH: /usr/lib/jvm/java-1.5.0-sun/lib/tools.jar:/srv/gump/public/workspace/db-derby/classes:/srv/gump/public/workspace/ant/dist/lib/ant-jmf.jar:/srv/gump/public/workspace/ant/dist/lib/ant-swing.jar:/srv/gump/public/workspace/ant/dist/lib/ant-apache-resolver.jar:/srv/gump/public/workspace/ant/dist/lib/ant-apache-xalan2.jar:/srv/gump/public/workspace/ant/dist/lib/ant-trax.jar:/srv/gump/public/workspace/ant/dist/lib/ant-junit.jar:/srv/gump/public/workspace/ant/dist/lib/ant-launcher.jar:/srv/gump/public/workspace/ant/dist/lib/ant-nodeps.jar:/srv/gump/public/workspace/ant/dist/lib/ant.jar:/srv/gump/public/workspace/xml-commons/java/external/build/xml-apis-ext.jar:/srv/gump/public/workspace/jakarta-servletapi-5/jsr154/dist/lib/servlet-api.jar:/srv/gump/public/workspace/jakarta-oro/jakarta-oro-02012009.jar:/srv/gump/packages/javacc-3.1/bin/lib/javacc.jar:/srv/gump/public/workspace/junit/dist/junit-02012009.jar
---------------------------------------------
    [javac] /srv/gump/public/workspace/db-derby/java/engine/org/apache/derby/iapi/jdbc/BrokeredConnection40.java:210: cannot find symbol
    [javac] symbol  : class SQLClientInfoException
    [javac] location: class org.apache.derby.iapi.jdbc.BrokeredConnection40
    [javac]             throw new SQLClientInfoException
    [javac]                       ^
    [javac] /srv/gump/public/workspace/db-derby/java/engine/org/apache/derby/iapi/jdbc/BrokeredConnection40.java:227: cannot find symbol
    [javac] symbol  : method getClientInfo(java.lang.String)
    [javac] location: interface org.apache.derby.iapi.jdbc.EngineConnection
    [javac]             return getRealConnection().getClientInfo(name);
    [javac]                                     ^
    [javac] /srv/gump/public/workspace/db-derby/java/engine/org/apache/derby/iapi/jdbc/BrokeredConnection40.java:244: cannot find symbol
    [javac] symbol  : method getClientInfo()
    [javac] location: interface org.apache.derby.iapi.jdbc.EngineConnection
    [javac]             return getRealConnection().getClientInfo();
    [javac]                                     ^
    [javac] /srv/gump/public/workspace/db-derby/java/engine/org/apache/derby/iapi/jdbc/BrokeredPreparedStatement40.java:44: cannot find symbol
    [javac] symbol  : method setNString(int,java.lang.String)
    [javac] location: interface java.sql.PreparedStatement
    [javac]         getPreparedStatement().setNString (index, value);
    [javac]                             ^
    [javac] /srv/gump/public/workspace/db-derby/java/engine/org/apache/derby/iapi/jdbc/BrokeredPreparedStatement40.java:49: cannot find symbol
    [javac] symbol  : method setNCharacterStream(int,java.io.Reader)
    [javac] location: interface java.sql.PreparedStatement
    [javac]         getPreparedStatement().setNCharacterStream(parameterIndex, value);
    [javac]                             ^
    [javac] /srv/gump/public/workspace/db-derby/java/engine/org/apache/derby/iapi/jdbc/BrokeredPreparedStatement40.java:53: cannot find symbol
    [javac] symbol  : method setNCharacterStream(int,java.io.Reader,long)
    [javac] location: interface java.sql.PreparedStatement
    [javac]         getPreparedStatement().setNCharacterStream (index, value, length);
    [javac]                             ^
    [javac] /srv/gump/public/workspace/db-derby/java/engine/org/apache/derby/iapi/jdbc/BrokeredPreparedStatement40.java:62: setClob(int,java.sql.Clob) in java.sql.PreparedStatement cannot be applied to (int,java.io.Reader,long)
    [javac]         getPreparedStatement().setClob (parameterIndex, reader, length);
    [javac]                             ^
    [javac] /srv/gump/public/workspace/db-derby/java/engine/org/apache/derby/iapi/jdbc/BrokeredPreparedStatement40.java:67: setBlob(int,java.sql.Blob) in java.sql.PreparedStatement cannot be applied to (int,java.io.InputStream,long)
    [javac]         getPreparedStatement().setBlob (parameterIndex, inputStream, length);
    [javac]                             ^
    [javac] /srv/gump/public/workspace/db-derby/java/engine/org/apache/derby/iapi/jdbc/BrokeredPreparedStatement40.java:72: cannot find symbol
    [javac] symbol  : method setNClob(int,java.io.Reader)
    [javac] location: interface java.sql.PreparedStatement
    [javac]         getPreparedStatement().setNClob(parameterIndex, reader);
    [javac]                             ^
    [javac] 100 errors

BUILD FAILED
/srv/gump/public/workspace/db-derby/build.xml:432: The following error occurred while executing this line:
/srv/gump/public/workspace/db-derby/java/engine/build.xml:58: The following error occurred while executing this line:
/srv/gump/public/workspace/db-derby/java/engine/org/apache/derby/iapi/build.xml:76: The following error occurred while executing this line:
/srv/gump/public/workspace/db-derby/java/engine/org/apache/derby/iapi/jdbc/build.xml:156: Compile failed; see the compiler error output for details.

Total time: 45 seconds
---------------------------------------------

To subscribe to this information via syndicated feeds:
- RSS: http://vmgump.apache.org/gump/public/db-derby/derby/rss.xml
- Atom: http://vmgump.apache.org/gump/public/db-derby/derby/atom.xml

============================== Gump Tracking Only ===
Produced by Gump version 2.3.
Gump Run 21000002012009, vmgump:vmgump-public:21000002012009
Gump E-mail Identifier (unique within run) #8.

*********************************************************** G U M P
[GUMP@vmgump]: Project dotnet-antlib-test (in module ant-antlibs) failed
To whom it may engage...
        
This is an automated request, but not an unsolicited one. For 
more information please visit http://gump.apache.org/nagged.html, 
and/or contact the folk at general@gump.apache.org.

Project dotnet-antlib-test has an issue affecting its community integration.
This issue affects 1 projects,
 and has been outstanding for 178 runs.
The current state of this project is 'Failed', with reason 'Build Failed'.
For reference only, the following projects are affected by this:
    - dotnet-antlib-test :  Task and Type Libraries for Apache Ant


Full details are available at:
    http://vmgump.apache.org/gump/public/ant-antlibs/dotnet-antlib-test/index.html

That said, some information snippets are provided here.

The following annotations (debug/informational/warning/error messages) were provided:
 -INFO- Failed with reason build failed



The following work was performed:
http://vmgump.apache.org/gump/public/ant-antlibs/dotnet-antlib-test/gump_work/build_ant-antlibs_dotnet-antlib-test.html
Work Name: build_ant-antlibs_dotnet-antlib-test (Type: Build)
Work ended in a state of : Failed
Elapsed: 20 secs
Command Line: /usr/lib/jvm/java-1.5.0-sun/bin/java -Djava.awt.headless=true -Xbootclasspath/p:/srv/gump/public/workspace/xml-xerces2/build/xercesImpl.jar:/srv/gump/public/workspace/xml-commons/java/external/build/xml-apis.jar org.apache.tools.ant.Main -Dgump.merge=/srv/gump/public/gump/work/merge.xml -Dbuild.sysclasspath=only -Dant-testutil.jar=/srv/gump/public/workspace/ant/build/lib/ant-testutil.jar test 
[Working Directory: /srv/gump/public/workspace/ant-antlibs/dotnet]
CLASSPATH: /usr/lib/jvm/java-1.5.0-sun/lib/tools.jar:/srv/gump/public/workspace/ant-antlibs/dotnet/build/test-classes:/srv/gump/public/workspace/ant/dist/lib/ant-jmf.jar:/srv/gump/public/workspace/ant/dist/lib/ant-swing.jar:/srv/gump/public/workspace/ant/dist/lib/ant-apache-resolver.jar:/srv/gump/public/workspace/ant/dist/lib/ant-apache-xalan2.jar:/srv/gump/public/workspace/ant/dist/lib/ant-trax.jar:/srv/gump/public/workspace/ant/dist/lib/ant-junit.jar:/srv/gump/public/workspace/ant/dist/lib/ant-launcher.jar:/srv/gump/public/workspace/ant/dist/lib/ant-nodeps.jar:/srv/gump/public/workspace/ant/dist/lib/ant.jar:/srv/gump/public/workspace/ant-antlibs/antunit/build/ant-antunit-02012009.jar:/srv/gump/public/workspace/ant-antlibs/dotnet/build/ant-dotnet-02012009.jar:/srv/gump/public/workspace/xml-commons/java/external/build/xml-apis-ext.jar
---------------------------------------------
[au:antunit] Target: test-passing took 0.007 sec
[au:antunit] Build File: /srv/gump/public/workspace/ant-antlibs/dotnet/src/tests/antunit/dir with spaces/wsdl-test.xml
[au:antunit] Tests run: 1, Failures: 0, Errors: 0, Time elapsed: 0.873 sec
[au:antunit] Target: testWSDL took 0.852 sec
[au:antunit] Build File: /srv/gump/public/workspace/ant-antlibs/dotnet/src/tests/antunit/dotnetexec-test.xml
[au:antunit] Tests run: 2, Failures: 0, Errors: 0, Time elapsed: 1.398 sec
[au:antunit] Target: testCSC took 0.757 sec
[au:antunit] Target: testCSCNoConfig took 0.568 sec
[au:antunit] Build File: /srv/gump/public/workspace/ant-antlibs/dotnet/src/tests/antunit/nunit/nunit-test.xml
[au:antunit] Tests run: 5, Failures: 0, Errors: 0, Time elapsed: 0.173 sec
[au:antunit] Target: test-passing took 0.009 sec
[au:antunit] Target: test-failing took 0.008 sec
[au:antunit] Target: test-failing-errorproperty took 0.005 sec
[au:antunit] Target: test-failing-with-fail took 0.011 sec
[au:antunit] Target: test-no-assembly took 0.027 sec
[au:antunit] Build File: /srv/gump/public/workspace/ant-antlibs/dotnet/src/tests/antunit/old-core-test.xml
[au:antunit] Tests run: 9, Failures: 0, Errors: 0, Time elapsed: 5.49 sec
[au:antunit] Target: testCSCintrinsicFileset took 0.711 sec
[au:antunit] Target: testCSCresponseFile took 0.638 sec
[au:antunit] Target: testILASM took 0.705 sec
[au:antunit] Target: testCSCdll took 0.581 sec
[au:antunit] Target: testILDASM took 0.901 sec
[au:antunit] Target: testILDASM_empty took 0.041 sec
[au:antunit] Target: testJsharp took 0.019 sec
[au:antunit] Target: testCSCResources took 0.797 sec
[au:antunit] Target: testCSC took 0.792 sec
[au:antunit] Build File: /srv/gump/public/workspace/ant-antlibs/dotnet/src/tests/antunit/wsdl2dotnet-test.xml
[au:antunit] Tests run: 15, Failures: 0, Errors: 0, Time elapsed: 3.774 sec
[au:antunit] Target: testSchemaMustBeSet took 0.034 sec
[au:antunit] Target: testLocalWsdlVB took 0.016 sec
[au:antunit] Target: testInvalidExtraOps took 0.012 sec
[au:antunit] Target: testSrcIsMissing took 0.024 sec
[au:antunit] Target: testNoParams took 0.035 sec
[au:antunit] Target: testBothSrc took 0.048 sec
[au:antunit] Target: testSchemaFileMustHaveOneOptionOnly took 0.044 sec
[au:antunit] Target: testLocalWsdl took 1.452 sec
[au:antunit] Target: testSrcIsDir took 0.026 sec
[au:antunit] Target: testLocalWsdlServerVB took 0.097 sec
[au:antunit] Target: testLocalWsdlServer took 1.598 sec
[au:antunit] Target: testNoSrc took 0.016 sec
[au:antunit] Target: testSchemaFileMustExist took 0.011 sec
[au:antunit] Target: testInvalidExtraOpsVB took 0.011 sec
[au:antunit] Target: testDestIsDir took 0.015 sec

test:

BUILD FAILED
/srv/gump/public/workspace/ant-antlibs/dotnet/common/build.xml:216: At least one AntUnit test has failed.

Total time: 19 seconds
---------------------------------------------

To subscribe to this information via syndicated feeds:
- RSS: http://vmgump.apache.org/gump/public/ant-antlibs/dotnet-antlib-test/rss.xml
- Atom: http://vmgump.apache.org/gump/public/ant-antlibs/dotnet-antlib-test/atom.xml

============================== Gump Tracking Only ===
Produced by Gump version 2.3.
Gump Run 21000002012009, vmgump:vmgump-public:21000002012009
Gump E-mail Identifier (unique within run) #9.

*********************************************************** G U M P
[GUMP@vmgump]: Project emma (in module emma) failed
To whom it may engage...
        
This is an automated request, but not an unsolicited one. For 
more information please visit http://gump.apache.org/nagged.html, 
and/or contact the folk at general@gump.apache.org.

Project emma has an issue affecting its community integration.
This issue affects 1 projects,
 and has been outstanding for 647 runs.
The current state of this project is 'Failed', with reason 'Build Failed'.
For reference only, the following projects are affected by this:
    - emma :  code coverage tool


Full details are available at:
    http://vmgump.apache.org/gump/public/emma/emma/index.html

That said, some information snippets are provided here.

The following annotations (debug/informational/warning/error messages) were provided:
 -INFO- Failed with reason build failed
 -INFO- Failed to extract fallback artifacts from Gump Repository



The following work was performed:
http://vmgump.apache.org/gump/public/emma/emma/gump_work/build_emma_emma.html
Work Name: build_emma_emma (Type: Build)
Work ended in a state of : Failed
Elapsed: 7 secs
Command Line: /usr/lib/jvm/java-1.5.0-sun/bin/java -Djava.awt.headless=true -Xbootclasspath/p:/srv/gump/public/workspace/xml-commons/java/external/build/xml-apis.jar:/srv/gump/public/workspace/xml-xerces2/build/xercesImpl.jar org.apache.tools.ant.Main -Dgump.merge=/srv/gump/public/gump/work/merge.xml -Dbuild.sysclasspath=only -Dapp.short.name=emma-02012009 
[Working Directory: /srv/gump/public/workspace/emma]
CLASSPATH: /usr/lib/jvm/java-1.5.0-sun/lib/tools.jar:/srv/gump/public/workspace/emma/out/core/classes:/srv/gump/public/workspace/emma/out/ant/classes:/srv/gump/public/workspace/emma/lib/internal/stamptool.jar:/srv/gump/public/workspace/ant/dist/lib/ant-jmf.jar:/srv/gump/public/workspace/ant/dist/lib/ant-swing.jar:/srv/gump/public/workspace/ant/dist/lib/ant-apache-resolver.jar:/srv/gump/public/workspace/ant/dist/lib/ant-apache-xalan2.jar:/srv/gump/public/workspace/ant/dist/lib/ant-trax.jar:/srv/gump/public/workspace/ant/dist/lib/ant-junit.jar:/srv/gump/public/workspace/ant/dist/lib/ant-launcher.jar:/srv/gump/public/workspace/ant/dist/lib/ant-nodeps.jar:/srv/gump/public/workspace/ant/dist/lib/ant.jar:/srv/gump/public/workspace/xml-commons/java/external/build/xml-apis-ext.jar
---------------------------------------------
     [copy] Copying 1 file to /srv/gump/public/workspace/emma/out/temp

timestamp:

-pre-compile:

core.bootstrap.compile:
    [javac] Compiling 2 source files to /srv/gump/public/workspace/emma/out/core/classes
    [javac] 
    [javac]           WARNING
    [javac] 
    [javac] The -source switch defaults to 1.5 in JDK 1.5 and 1.6.
    [javac] If you specify -target 1.2 you now must also specify -source 1.2.
    [javac] Ant will implicitly add -source 1.2 for you.  Please change your build file.

core.java14.compile:
    [javac] Compiling 1 source file to /srv/gump/public/workspace/emma/out/core/classes
    [javac] 
    [javac]           WARNING
    [javac] 
    [javac] The -source switch defaults to 1.5 in JDK 1.5 and 1.6.
    [javac] If you specify -target 1.2 you now must also specify -source 1.2.
    [javac] Ant will implicitly add -source 1.2 for you.  Please change your build file.

core.java13.compile:
    [javac] Compiling 1 source file to /srv/gump/public/workspace/emma/out/core/classes
    [javac] 
    [javac]           WARNING
    [javac] 
    [javac] The -source switch defaults to 1.5 in JDK 1.5 and 1.6.
    [javac] If you specify -target 1.2 you now must also specify -source 1.2.
    [javac] Ant will implicitly add -source 1.2 for you.  Please change your build file.

core.compile:
    [javac] Compiling 175 source files to /srv/gump/public/workspace/emma/out/core/classes
    [javac] 
    [javac]           WARNING
    [javac] 
    [javac] The -source switch defaults to 1.5 in JDK 1.5 and 1.6.
    [javac] If you specify -target 1.2 you now must also specify -source 1.2.
    [javac] Ant will implicitly add -source 1.2 for you.  Please change your build file.
    [javac] /srv/gump/public/workspace/emma/core/java12/com/vladium/emma/run/InstrClassLoader.java:346: reference to CodeSource is ambiguous, both method CodeSource(java.net.URL,java.security.cert.Certificate[]) in java.security.CodeSource and method CodeSource(java.net.URL,java.security.CodeSigner[]) in java.security.CodeSource match
    [javac]         final CodeSource csrc = new CodeSource (srcURL, null);
    [javac]                                 ^
    [javac] 1 error

BUILD FAILED
/srv/gump/public/workspace/emma/build.xml:297: Compile failed; see the compiler error output for details.

Total time: 7 seconds
---------------------------------------------

To subscribe to this information via syndicated feeds:
- RSS: http://vmgump.apache.org/gump/public/emma/emma/rss.xml
- Atom: http://vmgump.apache.org/gump/public/emma/emma/atom.xml

============================== Gump Tracking Only ===
Produced by Gump version 2.3.
Gump Run 21000002012009, vmgump:vmgump-public:21000002012009
Gump E-mail Identifier (unique within run) #12.

*********************************************************** G U M P
[GUMP@vmgump]: Project apache-httpd-configure (in module apache-httpd) failed
To whom it may engage...
        
This is an automated request, but not an unsolicited one. For 
more information please visit http://gump.apache.org/nagged.html, 
and/or contact the folk at general@gump.apache.org.

Project apache-httpd-configure has an issue affecting its community integration.
This issue affects 6 projects,
 and has been outstanding for 104 runs.
The current state of this project is 'Failed', with reason 'Build Failed'.
For reference only, the following projects are affected by this:
    - apache-httpd-configure :  Apache HTTP Server
    - apache-httpd-make :  Apache HTTP Server
    - apache-httpd-make-install :  Apache HTTP Server
    - jakarta-tomcat-jk-native :  Connectors to various web servers
    - jakarta-tomcat-jk-native-buildconf :  Connectors to various web servers
    - jakarta-tomcat-jk-native-configure :  Connectors to various web servers


Full details are available at:
    http://vmgump.apache.org/gump/public/apache-httpd/apache-httpd-configure/index.html

That said, some information snippets are provided here.

The following annotations (debug/informational/warning/error messages) were provided:
 -INFO- Failed with reason build failed



The following work was performed:
http://vmgump.apache.org/gump/public/apache-httpd/apache-httpd-configure/gump_work/buildscript_apache-httpd_apache-httpd-configure.html
Work Name: buildscript_apache-httpd_apache-httpd-configure (Type: Build)
Work ended in a state of : Failed
Elapsed: 21 secs
Command Line: /srv/gump/public/workspace/apache-httpd/configure --with-apr-util=/srv/gump/public/workspace/apr-util/dest-02012009 --with-apr=/srv/gump/public/workspace/apr/dest-02012009 --prefix=/srv/gump/public/workspace/apache-httpd/dest-02012009 --with-pcre=/srv/gump/public/workspace/pcre/dest-02012009 
[Working Directory: /srv/gump/public/workspace/apache-httpd]
---------------------------------------------
checking for inttypes.h... yes
checking for stdint.h... yes
checking for unistd.h... yes
checking minix/config.h usability... no
checking minix/config.h presence... no
checking for minix/config.h... no
checking whether it is safe to define __EXTENSIONS__... yes
checking for library containing strerror... none required
checking for APR version 1.3.0 or later... yes
checking for APR-util version 1.3.0 or later... yes
checking for ANSI C header files... (cached) no
checking for string.h... (cached) yes
checking limits.h usability... yes
checking limits.h presence... yes
checking for limits.h... yes
checking for unistd.h... (cached) yes
checking sys/socket.h usability... yes
checking sys/socket.h presence... yes
checking for sys/socket.h... yes
checking pwd.h usability... yes
checking pwd.h presence... yes
checking for pwd.h... yes
checking grp.h usability... yes
checking grp.h presence... yes
checking for grp.h... yes
checking for strings.h... (cached) yes
checking sys/prctl.h usability... yes
checking sys/prctl.h presence... yes
checking for sys/prctl.h... yes
checking sys/processor.h usability... no
checking sys/processor.h presence... no
checking for sys/processor.h... no
checking sys/sem.h usability... yes
checking sys/sem.h presence... yes
checking for sys/sem.h... yes
checking sys/sdt.h usability... no
checking sys/sdt.h presence... no
checking for sys/sdt.h... no
checking for sys/wait.h that is POSIX.1 compatible... yes
checking for an ANSI C-conforming const... yes
checking for library containing sqrt... -lm
checking for getpwnam... yes
checking for getgrnam... yes
checking for initgroups... yes
checking for bindprocessor... no
checking for prctl... yes
checking for timegm... yes
checking for getpgid... yes
checking for void pointer length... yes
configure: error: Size of "void *" is less than size of "long"
---------------------------------------------

To subscribe to this information via syndicated feeds:
- RSS: http://vmgump.apache.org/gump/public/apache-httpd/apache-httpd-configure/rss.xml
- Atom: http://vmgump.apache.org/gump/public/apache-httpd/apache-httpd-configure/atom.xml

============================== Gump Tracking Only ===
Produced by Gump version 2.3.
Gump Run 21000002012009, vmgump:vmgump-public:21000002012009
Gump E-mail Identifier (unique within run) #14.

*********************************************************** G U M P
[GUMP@vmgump]: Project slf4j (in module slf4j) failed
To whom it may engage...
        
This is an automated request, but not an unsolicited one. For 
more information please visit http://gump.apache.org/nagged.html, 
and/or contact the folk at general@gump.apache.org.

Project slf4j has an issue affecting its community integration.
This issue affects 2 projects.
The current state of this project is 'Failed', with reason 'Build Failed'.
For reference only, the following projects are affected by this:
    - nlog4j
    - slf4j :  Simple Logging Facade for Java


Full details are available at:
    http://vmgump.apache.org/gump/public/slf4j/slf4j/index.html

That said, some information snippets are provided here.

The following annotations (debug/informational/warning/error messages) were provided:
 -DEBUG- (Gump generated) Maven2 Settings in: /srv/gump/public/workspace/slf4j/gump_mvn_settings.xml
 -INFO- Failed with reason build failed
 -DEBUG- Maven POM in: /srv/gump/public/workspace/slf4j/pom.xml
 -DEBUG- Extracted fallback artifacts from Gump Repository



The following work was performed:
http://vmgump.apache.org/gump/public/slf4j/slf4j/gump_work/build_slf4j_slf4j.html
Work Name: build_slf4j_slf4j (Type: Build)
Work ended in a state of : Failed
Elapsed: 39 secs
Command Line: mvn --batch-mode --settings /srv/gump/public/workspace/slf4j/gump_mvn_settings.xml package 
[Working Directory: /srv/gump/public/workspace/slf4j]
CLASSPATH: /usr/lib/jvm/java-1.5.0-sun/lib/tools.jar:/srv/gump/public/workspace/apache-commons/collections/build/commons-collections-02012009.jar:/srv/gump/public/workspace/apache-commons/logging/target/commons-logging-api-02012009.jar:/srv/gump/public/workspace/logging-log4j-12/dist/lib/log4j-02012009.jar:/srv/gump/public/workspace/xml-commons/java/external/build/xml-apis-ext.jar
---------------------------------------------
[INFO] No goals needed for project - skipping
[INFO] [source:jar {execution: default}]
[INFO] Building jar: /srv/gump/public/workspace/slf4j/slf4j-nop/target/slf4j-nop-1.5.6-sources.jar
[INFO] ------------------------------------------------------------------------
[INFO] Building SLF4J JDK14 Binding
[INFO]    task-segment: [package]
[INFO] ------------------------------------------------------------------------
[INFO] [resources:resources]
[INFO] Using default encoding to copy filtered resources.
[INFO] [compiler:compile]
[INFO] Compiling 5 source files to /srv/gump/public/workspace/slf4j/slf4j-jdk14/target/classes
[INFO] [resources:testResources]
[INFO] Using default encoding to copy filtered resources.
[INFO] [compiler:testCompile]
[INFO] Compiling 3 source files to /srv/gump/public/workspace/slf4j/slf4j-jdk14/target/test-classes
[INFO] [surefire:test]
[INFO] Surefire report directory: /srv/gump/public/workspace/slf4j/slf4j-jdk14/target/surefire-reports

-------------------------------------------------------
 T E S T S
-------------------------------------------------------
Running org.slf4j.impl.JDK14AdapterLoggerNameTest
Tests run: 2, Failures: 0, Errors: 0, Skipped: 0, Time elapsed: 0.064 sec
Running org.slf4j.InvocationTest
Tests run: 5, Failures: 0, Errors: 0, Skipped: 0, Time elapsed: 0.029 sec
Running org.slf4j.impl.PerfTest
Host runs at 8543.138578250879 BIPS
currentBIPS=66844.91978609626 BIPS
Tests run: 1, Failures: 1, Errors: 0, Skipped: 0, Time elapsed: 0.633 sec <<< FAILURE!

Results :

Failed tests: 
  testBug72(org.slf4j.impl.PerfTest)

Tests run: 8, Failures: 1, Errors: 0, Skipped: 0

[INFO] ------------------------------------------------------------------------
[ERROR] BUILD FAILURE
[INFO] ------------------------------------------------------------------------
[INFO] There are test failures.

Please refer to /srv/gump/public/workspace/slf4j/slf4j-jdk14/target/surefire-reports for the individual test results.
[INFO] ------------------------------------------------------------------------
[INFO] For more information, run Maven with the -e switch
[INFO] ------------------------------------------------------------------------
[INFO] Total time: 37 seconds
[INFO] Finished at: Fri Jan 02 02:11:40 GMT-08:00 2009
[INFO] Final Memory: 16M/31M
[INFO] ------------------------------------------------------------------------
---------------------------------------------

To subscribe to this information via syndicated feeds:
- RSS: http://vmgump.apache.org/gump/public/slf4j/slf4j/rss.xml
- Atom: http://vmgump.apache.org/gump/public/slf4j/slf4j/atom.xml

============================== Gump Tracking Only ===
Produced by Gump version 2.3.
Gump Run 21000002012009, vmgump:vmgump-public:21000002012009
Gump E-mail Identifier (unique within run) #15.

*********************************************************** G U M P
[GUMP@vmgump]: Project castor (in module castor) failed
To whom it may engage...
        
This is an automated request, but not an unsolicited one. For 
more information please visit http://gump.apache.org/nagged.html, 
and/or contact the folk at general@gump.apache.org.

Project castor has an issue affecting its community integration.
This issue affects 25 projects,
 and has been outstanding for 88 runs.
The current state of this project is 'Failed', with reason 'Build Failed'.
For reference only, the following projects are affected by this:
    - authx-example :  Apache Authentication and Authorization Framework
    - castor :  Java to XML, SQL, LDAP bindings
    - castor-test :  Java to XML, SQL, LDAP bindings
    - commons-chain :  GoF "Chain of Responsibility" pattern
    - commons-fileupload :  Commons File Upload Package
    - fulcrum-intake :  Services Framework
    - fulcrum-parser :  Services Framework
    - fulcrum-upload :  Services Framework
    - jakarta-tomcat-4.0 :  Servlet 2.3 and JSP 1.2 Reference Implementation
    - jakarta-tomcat-catalina :  Servlet 2.4 Reference Implementation
    - jakarta-tomcat-coyote-tomcat4 :  Connectors to various web servers
    - jakarta-tomcat-jk :  Connectors to various web servers
    - portals-bridges-common :  Support for JSR168 compliant Portlet development
    - portals-bridges-frameworks :  Support for JSR168 compliant Portlet development
    - portals-bridges-struts :  Support for JSR168 compliant Portlet development
    - portals-bridges-velocity :  Support for JSR168 compliant Portlet development
    - portals-pluto-api-1.0 :  JSR168 Container
    - portals-pluto-container-1.0 :  JSR168 Container
    - portals-pluto-deploy-1.0 :  JSR168 Container
    - portals-pluto-descriptors-1.0 :  JSR168 Container
    - portals-pluto-portal-1.0 :  JSR168 Container
    - tomcat-catalina :  Servlet 2.3 and JSP 1.2 Reference Implementation
    - turbine-core :  A servlet based framework.
    - velocity-tools :  VelocityTools project
    - xml-xindice :  native XML database


Full details are available at:
    http://vmgump.apache.org/gump/public/castor/castor/index.html

That said, some information snippets are provided here.

The following annotations (debug/informational/warning/error messages) were provided:
 -DEBUG- Output [castor-core-1.3rc2-SNAPSHOT.jar] identifier set to output basename: [castor-core-1.3rc2-SNAPSHOT]
 -DEBUG- Output [castor-xml-1.3rc2-SNAPSHOT.jar] identifier set to output basename: [castor-xml-1.3rc2-SNAPSHOT]
 -DEBUG- (Gump generated) Maven2 Settings in: /srv/gump/public/workspace/castor/gump_mvn_settings.xml
 -INFO- Failed with reason build failed
 -DEBUG- Maven POM in: /srv/gump/public/workspace/castor/pom.xml
 -INFO- Failed to extract fallback artifacts from Gump Repository



The following work was performed:
http://vmgump.apache.org/gump/public/castor/castor/gump_work/build_castor_castor.html
Work Name: build_castor_castor (Type: Build)
Work ended in a state of : Failed
Elapsed: 2 mins 39 secs
Command Line: mvn --batch-mode -Dmaven.test.skip=true --settings /srv/gump/public/workspace/castor/gump_mvn_settings.xml package 
[Working Directory: /srv/gump/public/workspace/castor]
CLASSPATH: /usr/lib/jvm/java-1.5.0-sun/lib/tools.jar:/srv/gump/public/workspace/ant/dist/lib/ant-jmf.jar:/srv/gump/public/workspace/ant/dist/lib/ant-swing.jar:/srv/gump/public/workspace/ant/dist/lib/ant-apache-resolver.jar:/srv/gump/public/workspace/ant/dist/lib/ant-apache-xalan2.jar:/srv/gump/public/workspace/ant/dist/lib/ant-trax.jar:/srv/gump/public/workspace/ant/dist/lib/ant-junit.jar:/srv/gump/public/workspace/ant/dist/lib/ant-launcher.jar:/srv/gump/public/workspace/ant/dist/lib/ant-nodeps.jar:/srv/gump/public/workspace/ant/dist/lib/ant.jar:/srv/gump/packages/junit3.8.1/junit.jar:/srv/gump/public/workspace/xml-commons/java/build/resolver.jar:/srv/gump/public/workspace/castor/lib/ldapjdk_4.1.jar:/srv/gump/packages/jdbc2_0/jdbc2_0-stdext.jar:/srv/gump/packages/jta-spec1_0_1/jta-spec1_0_1.jar:/srv/gump/public/workspace/jakarta-regexp/build/jakarta-regexp-02012009.jar:/srv/gump/public/workspace/jakarta-oro/jakarta-oro-02012009.jar:/srv/gump/packages/cglib/cglib-nodep-2.1_3.j
 ar:/srv/gump/public/workspace/apache-commons/logging/target/commons-logging-02012009.jar:/srv/gump/public/workspace/apache-commons/logging/target/commons-logging-api-02012009.jar:/srv/gump/public/workspace/junit/dist/junit-02012009.jar:/srv/gump/public/workspace/logging-log4j-12/dist/lib/log4j-02012009.jar:/srv/gump/public/workspace/velocity-engine/bin/velocity-02012009.jar:/srv/gump/public/workspace/velocity-engine/bin/velocity-02012009-dep.jar
---------------------------------------------
[INFO] Building jar: /srv/gump/public/workspace/castor/ddlgen/target/castor-ddlgen-1.3rc2-SNAPSHOT-sources.jar
[INFO] ------------------------------------------------------------------------
[INFO] Building Castor - ant tasks
[INFO]    task-segment: [package]
[INFO] ------------------------------------------------------------------------
[INFO] [resources:resources]
[INFO] Using default encoding to copy filtered resources.
[INFO] [compiler:compile]
[INFO] Compiling 5 source files to /srv/gump/public/workspace/castor/anttask/target/classes
[INFO] [resources:testResources]
[INFO] Using default encoding to copy filtered resources.
[INFO] [compiler:testCompile]
[INFO] Not compiling test sources
[INFO] [surefire:test]
[INFO] Tests are skipped.
[INFO] [jar:jar]
[INFO] Building jar: /srv/gump/public/workspace/castor/anttask/target/castor-anttasks-1.3rc2-SNAPSHOT.jar
[INFO] Preparing source:jar
[WARNING] Removing: jar from forked lifecycle, to prevent recursive invocation.
[INFO] No goals needed for project - skipping
[INFO] [source:jar {execution: default}]
[INFO] Building jar: /srv/gump/public/workspace/castor/anttask/target/castor-anttasks-1.3rc2-SNAPSHOT-sources.jar
[INFO] ------------------------------------------------------------------------
[INFO] Building Castor XML - test suite framework code
[INFO]    task-segment: [package]
[INFO] ------------------------------------------------------------------------
[INFO] [castor:generate {execution: default}]
[INFO] Processing /srv/gump/public/workspace/castor/xmlctf-framework/src/main/resources/org/exolab/castor/tests/framework/TestDescriptor.xsd
[INFO] [resources:resources]
[INFO] Using default encoding to copy filtered resources.
[INFO] [compiler:compile]
[INFO] Compiling 88 source files to /srv/gump/public/workspace/castor/xmlctf-framework/target/classes
[INFO] ------------------------------------------------------------------------
[ERROR] BUILD FAILURE
[INFO] ------------------------------------------------------------------------
[INFO] Compilation failure
/srv/gump/public/workspace/castor/xmlctf-framework/src/main/java/org/castor/xmlctf/CastorTestSuiteRunner.java:[169,25] package junit.swingui does not exist



/srv/gump/public/workspace/castor/xmlctf-framework/src/main/java/org/castor/xmlctf/CastorTestSuiteRunner.java:[169,25] package junit.swingui does not exist


[INFO] ------------------------------------------------------------------------
[INFO] For more information, run Maven with the -e switch
[INFO] ------------------------------------------------------------------------
[INFO] Total time: 2 minutes 37 seconds
[INFO] Finished at: Fri Jan 02 02:15:45 GMT-08:00 2009
[INFO] Final Memory: 20M/50M
[INFO] ------------------------------------------------------------------------
---------------------------------------------

To subscribe to this information via syndicated feeds:
- RSS: http://vmgump.apache.org/gump/public/castor/castor/rss.xml
- Atom: http://vmgump.apache.org/gump/public/castor/castor/atom.xml

============================== Gump Tracking Only ===
Produced by Gump version 2.3.
Gump Run 21000002012009, vmgump:vmgump-public:21000002012009
Gump E-mail Identifier (unique within run) #16.

*********************************************************** G U M P
[GUMP@vmgump]: Project commons-jci (in module commons-sandbox) failed
To whom it may engage...
        
This is an automated request, but not an unsolicited one. For 
more information please visit http://gump.apache.org/nagged.html, 
and/or contact the folk at general@gump.apache.org.

Project commons-jci has an issue affecting its community integration.
This issue affects 2 projects,
 and has been outstanding for 606 runs.
The current state of this project is 'Failed', with reason 'Build Failed'.
For reference only, the following projects are affected by this:
    - commons-javaflow :  Commons Javaflow
    - commons-jci :  Commons JCI


Full details are available at:
    http://vmgump.apache.org/gump/public/commons-sandbox/commons-jci/index.html

That said, some information snippets are provided here.

The following annotations (debug/informational/warning/error messages) were provided:
 -DEBUG- Sole output [commons-jci-02012009.jar] identifier set to project name
 -INFO- Making directory for Maven2 settings: [/srv/gump/public/workspace/commons-sandbox/jci]
 -DEBUG- (Gump generated) Maven2 Settings in: /srv/gump/public/workspace/commons-sandbox/jci/gump_mvn_settings.xml
 -INFO- Failed with reason build failed
 -INFO- Failed to extract fallback artifacts from Gump Repository



The following work was performed:
http://vmgump.apache.org/gump/public/commons-sandbox/commons-jci/gump_work/build_commons-sandbox_commons-jci.html
Work Name: build_commons-sandbox_commons-jci (Type: Build)
Work ended in a state of : Failed
Elapsed: 3 secs
Command Line: mvn --batch-mode --settings /srv/gump/public/workspace/commons-sandbox/jci/gump_mvn_settings.xml package 
[Working Directory: /srv/gump/public/workspace/commons-sandbox/jci]
CLASSPATH: /usr/lib/jvm/java-1.5.0-sun/lib/tools.jar:/srv/gump/public/workspace/jakarta-bcel/target/bcel-5.3-SNAPSHOT.jar:/srv/gump/public/workspace/apache-commons/collections/build/commons-collections-02012009.jar:/srv/gump/public/workspace/apache-commons/io/target/commons-io-02012009.jar:/srv/gump/public/workspace/apache-commons/lang/commons-lang-02012009.jar:/srv/gump/public/workspace/apache-commons/logging/target/commons-logging-02012009.jar:/srv/gump/public/workspace/apache-commons/logging/target/commons-logging-api-02012009.jar:/srv/gump/packages/eclipse-3.1M6/plugins/org.eclipse.jdt.core_3.1.0/jdtcore.jar:/srv/gump/packages/janino-2.3.8/lib/janino.jar:/srv/gump/packages/jarjar/jarjar-0.6.jar:/srv/gump/public/workspace/asm/output/dist/lib/asm-analysis-02012009.jar:/srv/gump/public/workspace/asm/output/dist/lib/asm-util-02012009.jar:/srv/gump/public/workspace/asm/output/dist/lib/asm-xml-02012009.jar:/srv/gump/public/workspace/asm/output/dist/lib/asm-commons-02012009.jar:
 /srv/gump/public/workspace/asm/output/dist/lib/asm-02012009.jar:/srv/gump/public/workspace/asm/output/dist/lib/asm-tree-02012009.jar:/srv/gump/packages/antlr-2.7.6/antlr.jar:/srv/gump/packages/groovy-1.0-jsr-03/groovy-1.0-jsr-03.jar:/srv/gump/packages/maven-cobertura-plugin/maven-cobertura-plugin-1.1.jar
---------------------------------------------
[INFO] Scanning for projects...
[INFO] ------------------------------------------------------------------------
[INFO] Building Maven Default Project
[INFO]    task-segment: [package]
[INFO] ------------------------------------------------------------------------
[INFO] ------------------------------------------------------------------------
[ERROR] BUILD ERROR
[INFO] ------------------------------------------------------------------------
[INFO] Cannot execute mojo: resources. It requires a project with an existing pom.xml, but the build is not using one.
[INFO] ------------------------------------------------------------------------
[INFO] For more information, run Maven with the -e switch
[INFO] ------------------------------------------------------------------------
[INFO] Total time: 1 second
[INFO] Finished at: Fri Jan 02 02:19:55 GMT-08:00 2009
[INFO] Final Memory: 3M/6M
[INFO] ------------------------------------------------------------------------
---------------------------------------------

To subscribe to this information via syndicated feeds:
- RSS: http://vmgump.apache.org/gump/public/commons-sandbox/commons-jci/rss.xml
- Atom: http://vmgump.apache.org/gump/public/commons-sandbox/commons-jci/atom.xml

============================== Gump Tracking Only ===
Produced by Gump version 2.3.
Gump Run 21000002012009, vmgump:vmgump-public:21000002012009
Gump E-mail Identifier (unique within run) #18.

*********************************************************** G U M P
[GUMP@vmgump]: Module jakarta-tomcat-5 success, but with warnings.
To whom it may engage...
        
This is an automated request, but not an unsolicited one. For 
more information please visit http://gump.apache.org/nagged.html, 
and/or contact the folk at general@gump.apache.org.

Module jakarta-tomcat-5 contains errors.
The current state of this module is 'Success'.

Full details are available at:
    http://vmgump.apache.org/gump/public/jakarta-tomcat-5/index.html

That said, some information snippets are provided here.

The following annotations (debug/informational/warning/error messages) were provided:
 -ERROR- *** Failed to update from source control. Stale contents ***



The following work was performed:
http://vmgump.apache.org/gump/public/jakarta-tomcat-5/gump_work/update_jakarta-tomcat-5.html
Work Name: update_jakarta-tomcat-5 (Type: Update)
Work ended in a state of : Failed
Elapsed: 
Command Line: svn --quiet update --non-interactive jakarta-tomcat-5 
[Working Directory: /srv/gump/public/workspace/cvs]
---------------------------------------------
svn: Working copy 'jakarta-tomcat-5' locked
svn: run 'svn cleanup' to remove locks (type 'svn help cleanup' for details)
---------------------------------------------

To subscribe to this information via syndicated feeds:
- RSS: http://vmgump.apache.org/gump/public/jakarta-tomcat-5/rss.xml
- Atom: http://vmgump.apache.org/gump/public/jakarta-tomcat-5/atom.xml

============================== Gump Tracking Only ===
Produced by Gump version 2.3.
Gump Run 21000002012009, vmgump:vmgump-public:21000002012009
Gump E-mail Identifier (unique within run) #19.

*********************************************************** G U M P
[GUMP@vmgump]: Project jtidy-cvs (in module jtidy) failed
To whom it may engage...
        
This is an automated request, but not an unsolicited one. For 
more information please visit http://gump.apache.org/nagged.html, 
and/or contact the folk at general@gump.apache.org.

Project jtidy-cvs has an issue affecting its community integration.
This issue affects 1 projects,
 and has been outstanding for 526 runs.
The current state of this project is 'Failed', with reason 'Build Failed'.
For reference only, the following projects are affected by this:
    - jtidy-cvs :  HTML Templates


Full details are available at:
    http://vmgump.apache.org/gump/public/jtidy/jtidy-cvs/index.html

That said, some information snippets are provided here.

The following annotations (debug/informational/warning/error messages) were provided:
 -DEBUG- Sole output [jtidy-02012009.jar] identifier set to project name
 -DEBUG- Dependency on xml-apis exists, no need to add for property maven.jar.dom3-xml-apis.
 -DEBUG- (Gump generated) Maven Properties in: /srv/gump/public/workspace/jtidy/build.properties
 -INFO- Failed with reason build failed
 -DEBUG- Maven POM in: /srv/gump/public/workspace/jtidy/project.xml
 -DEBUG- Maven project properties in: /srv/gump/public/workspace/jtidy/project.properties
 -INFO- Failed to extract fallback artifacts from Gump Repository



The following work was performed:
http://vmgump.apache.org/gump/public/jtidy/jtidy-cvs/gump_work/build_jtidy_jtidy-cvs.html
Work Name: build_jtidy_jtidy-cvs (Type: Build)
Work ended in a state of : Failed
Elapsed: 2 secs
Command Line: maven --offline jar 
[Working Directory: /srv/gump/public/workspace/jtidy]
CLASSPATH: /usr/lib/jvm/java-1.5.0-sun/lib/tools.jar:/srv/gump/public/workspace/ant/dist/lib/ant-jmf.jar:/srv/gump/public/workspace/ant/dist/lib/ant-swing.jar:/srv/gump/public/workspace/ant/dist/lib/ant-apache-resolver.jar:/srv/gump/public/workspace/ant/dist/lib/ant-apache-xalan2.jar:/srv/gump/public/workspace/ant/dist/lib/ant-trax.jar:/srv/gump/public/workspace/ant/dist/lib/ant-junit.jar:/srv/gump/public/workspace/ant/dist/lib/ant-launcher.jar:/srv/gump/public/workspace/ant/dist/lib/ant-nodeps.jar:/srv/gump/public/workspace/ant/dist/lib/ant.jar:/srv/gump/packages/junit3.8.1/junit.jar:/srv/gump/public/workspace/xml-commons/java/build/resolver.jar:/srv/gump/public/workspace/xml-commons/java/external/build/xml-apis-ext.jar:/srv/gump/public/workspace/apache-commons/logging/target/commons-logging-02012009.jar:/srv/gump/public/workspace/apache-commons/logging/target/commons-logging-api-02012009.jar
---------------------------------------------
	... 33 more
[MethodExpression] Cannot evaluate expression
java.lang.reflect.InvocationTargetException
	at sun.reflect.NativeMethodAccessorImpl.invoke0(Native Method)
	at sun.reflect.NativeMethodAccessorImpl.invoke(NativeMethodAccessorImpl.java:39)
	at sun.reflect.DelegatingMethodAccessorImpl.invoke(DelegatingMethodAccessorImpl.java:25)
	at java.lang.reflect.Method.invoke(Method.java:585)
	at org.apache.commons.betwixt.expression.MethodExpression.evaluate(MethodExpression.java:96)
	at org.apache.commons.betwixt.io.AbstractBeanWriter.writeContent(AbstractBeanWriter.java:658)
	at org.apache.commons.betwixt.io.AbstractBeanWriter.writeRestOfElement(AbstractBeanWriter.java:539)
	at org.apache.commons.betwixt.io.AbstractBeanWriter.write(AbstractBeanWriter.java:481)
	at org.apache.commons.betwixt.io.AbstractBeanWriter.writeContent(AbstractBeanWriter.java:643)
	at org.apache.commons.betwixt.io.AbstractBeanWriter.writeRestOfElement(AbstractBeanWriter.java:539)
	at org.apache.commons.betwixt.io.AbstractBeanWriter.write(AbstractBeanWriter.java:513)
	at org.apache.commons.betwixt.io.AbstractBeanWriter.write(AbstractBeanWriter.java:233)
	at org.apache.commons.betwixt.io.AbstractBeanWriter.writeContent(AbstractBeanWriter.java:630)
	at org.apache.commons.betwixt.io.AbstractBeanWriter.writeRestOfElement(AbstractBeanWriter.java:539)
	at org.apache.commons.betwixt.io.AbstractBeanWriter.write(AbstractBeanWriter.java:513)
	at org.apache.commons.betwixt.io.AbstractBeanWriter.write(AbstractBeanWriter.java:233)
	at org.apache.commons.betwixt.io.AbstractBeanWriter.write(AbstractBeanWriter.java:162)
	at org.apache.commons.betwixt.io.BeanWriter.write(BeanWriter.java:217)
	at org.apache.maven.MavenUtils.getProjectString(MavenUtils.java:432)
	at org.apache.maven.MavenUtils.getInterpolatedPOM(MavenUtils.java:383)
	at org.apache.maven.MavenUtils.getJellyProject(MavenUtils.java:360)
	at org.apache.maven.MavenUtils.getProject(MavenUtils.java:144)
	at org.apache.maven.MavenUtils.getProject(MavenUtils.java:122)
	at org.apache.maven.MavenSession.initializeRootProject(MavenSession.java:232)
	at org.apache.maven.MavenSession.initialize(MavenSession.java:172)
	at org.apache.maven.cli.App.doMain(App.java:475)
	at org.apache.maven.cli.App.main(App.java:1239)
	at sun.reflect.NativeMethodAccessorImpl.invoke0(Native Method)
	at sun.reflect.NativeMethodAccessorImpl.invoke(NativeMethodAccessorImpl.java:39)
	at sun.reflect.DelegatingMethodAccessorImpl.invoke(DelegatingMethodAccessorImpl.java:25)
	at java.lang.reflect.Method.invoke(Method.java:585)
	at com.werken.forehead.Forehead.run(Forehead.java:551)
	at com.werken.forehead.Forehead.main(Forehead.java:581)
Caused by: java.lang.IllegalArgumentException: cvs repository connection string doesn't contain six tokens
	at org.apache.maven.project.Repository.splitSCMConnection(Repository.java:258)
	at org.apache.maven.project.Repository.getScmType(Repository.java:115)
	... 33 more
The build cannot continue because of the following unsatisfied dependencies:

maven-sourceforge-plugin-1.0.jar (try downloading from http://maven-plugins.sourceforge.net)
maven-statcvs-plugin-2.7.jar
maven-xhtml-plugin-1.2.jar (try downloading from http://maven-validator.sourceforge.net)
maven-checkstyle-plugin-2.4.1.jar (try downloading from http://maven.apache.org/reference/plugins/checkstyle)

Total time: 2 seconds
Finished at: Fri Jan 02 02:26:20 GMT-08:00 2009

---------------------------------------------

To subscribe to this information via syndicated feeds:
- RSS: http://vmgump.apache.org/gump/public/jtidy/jtidy-cvs/rss.xml
- Atom: http://vmgump.apache.org/gump/public/jtidy/jtidy-cvs/atom.xml

============================== Gump Tracking Only ===
Produced by Gump version 2.3.
Gump Run 21000002012009, vmgump:vmgump-public:21000002012009
Gump E-mail Identifier (unique within run) #20.

*********************************************************** G U M P
[GUMP@vmgump]: Project naming-config (in module directory-naming) failed
To whom it may engage...
        
This is an automated request, but not an unsolicited one. For 
more information please visit http://gump.apache.org/nagged.html, 
and/or contact the folk at general@gump.apache.org.

Project naming-config has an issue affecting its community integration.
This issue affects 1 projects,
 and has been outstanding for 23 runs.
The current state of this project is 'Failed', with reason 'Build Failed'.
For reference only, the following projects are affected by this:
    - naming-config :  Apache Directory Naming Component


Full details are available at:
    http://vmgump.apache.org/gump/public/directory-naming/naming-config/index.html

That said, some information snippets are provided here.

The following annotations (debug/informational/warning/error messages) were provided:
 -DEBUG- Sole output [naming-config-02012009.jar] identifier set to project name
 -DEBUG- (Gump generated) Maven Properties in: /srv/gump/public/workspace/directory-naming/naming-config/build.properties
 -INFO- Failed with reason build failed
 -DEBUG- Maven POM in: /srv/gump/public/workspace/directory-naming/naming-config/project.xml
 -DEBUG- Maven project properties in: /srv/gump/public/workspace/directory-naming/naming-config/project.properties
 -INFO- Project Reports in: /srv/gump/public/workspace/directory-naming/naming-config/target/test-reports
 -INFO- Failed to extract fallback artifacts from Gump Repository



The following work was performed:
http://vmgump.apache.org/gump/public/directory-naming/naming-config/gump_work/build_directory-naming_naming-config.html
Work Name: build_directory-naming_naming-config (Type: Build)
Work ended in a state of : Failed
Elapsed: 7 secs
Command Line: maven --offline jar 
[Working Directory: /srv/gump/public/workspace/directory-naming/naming-config]
CLASSPATH: /usr/lib/jvm/java-1.5.0-sun/lib/tools.jar:/srv/gump/public/workspace/apache-commons/beanutils/dist/commons-beanutils-02012009.jar:/srv/gump/public/workspace/apache-commons/collections/build/commons-collections-02012009.jar:/srv/gump/public/workspace/apache-commons/dbcp/dist/commons-dbcp.jar:/srv/gump/public/workspace/apache-commons/digester/dist/commons-digester.jar:/srv/gump/public/workspace/apache-commons/lang/commons-lang-02012009.jar:/srv/gump/public/workspace/apache-commons/logging/target/commons-logging-02012009.jar:/srv/gump/public/workspace/apache-commons/logging/target/commons-logging-api-02012009.jar:/srv/gump/public/workspace/apache-commons/pool/dist/commons-pool.jar:/srv/gump/public/workspace/hsqldb/lib/hsqldb.jar:/srv/gump/public/workspace/junit/dist/junit-02012009.jar:/srv/gump/public/workspace/directory-naming/naming-core/target/naming-core-02012009.jar:/srv/gump/public/workspace/directory-naming/naming-factory/target/naming-factory-02012009.jar:/srv
 /gump/public/workspace/directory-naming/naming-java/target/naming-java-02012009.jar:/srv/gump/packages/maven-site-plugin/maven-site-plugin-1.6.1.jar
---------------------------------------------
 __  __
|  \/  |__ _Apache__ ___
| |\/| / _` \ V / -_) ' \  ~ intelligent projects ~
|_|  |_\__,_|\_/\___|_||_|  v. 1.0.2

You are working offline so the build will continue, but naming-core-0.9-SNAPSHOT.jar may be out of date!
You are working offline so the build will continue, but naming-factory-0.9-SNAPSHOT.jar may be out of date!
You are working offline so the build will continue, but naming-java-0.9-SNAPSHOT.jar may be out of date!
build:start:

java:prepare-filesystem:
    [mkdir] Created dir: /srv/gump/public/workspace/directory-naming/naming-config/target/classes

java:compile:
    [echo] Compiling to /srv/gump/public/workspace/directory-naming/naming-config/target/classes
    [javac] Compiling 3 source files to /srv/gump/public/workspace/directory-naming/naming-config/target/classes

java:jar-resources:
Copying 2 files to /srv/gump/public/workspace/directory-naming/naming-config/target/classes/META-INF
Copying 1 file to /srv/gump/public/workspace/directory-naming/naming-config/target/classes

test:prepare-filesystem:
    [mkdir] Created dir: /srv/gump/public/workspace/directory-naming/naming-config/target/test-classes
    [mkdir] Created dir: /srv/gump/public/workspace/directory-naming/naming-config/target/test-reports

test:test-resources:
Copying 5 files to /srv/gump/public/workspace/directory-naming/naming-config/target/test-classes

test:compile:
    [javac] Compiling 1 source file to /srv/gump/public/workspace/directory-naming/naming-config/target/test-classes

test:test:
    [junit] Running org.apache.naming.config.XmlConfiguratorTest
    [junit] Tests run: 5, Failures: 0, Errors: 5, Time elapsed: 0.541 sec
    [junit] [ERROR] TEST org.apache.naming.config.XmlConfiguratorTest FAILED

BUILD FAILED
File...... /home/gump/.maven/cache/maven-test-plugin-1.6.2/plugin.jelly
Element... fail
Line...... 181
Column.... 54
There were test failures.
Total time: 6 seconds
Finished at: Fri Jan 02 02:46:24 GMT-08:00 2009

---------------------------------------------

To subscribe to this information via syndicated feeds:
- RSS: http://vmgump.apache.org/gump/public/directory-naming/naming-config/rss.xml
- Atom: http://vmgump.apache.org/gump/public/directory-naming/naming-config/atom.xml

============================== Gump Tracking Only ===
Produced by Gump version 2.3.
Gump Run 21000002012009, vmgump:vmgump-public:21000002012009
Gump E-mail Identifier (unique within run) #22.

*********************************************************** G U M P
[GUMP@vmgump]: Project xml-security-tests (in module xml-security) failed
To whom it may engage...
        
This is an automated request, but not an unsolicited one. For 
more information please visit http://gump.apache.org/nagged.html, 
and/or contact the folk at general@gump.apache.org.

Project xml-security-tests has an issue affecting its community integration.
This issue affects 1 projects,
 and has been outstanding for 148 runs.
The current state of this project is 'Failed', with reason 'Build Failed'.
For reference only, the following projects are affected by this:
    - xml-security-tests :  XML-Signature Syntax and Processing


Full details are available at:
    http://vmgump.apache.org/gump/public/xml-security/xml-security-tests/index.html

That said, some information snippets are provided here.

The following annotations (debug/informational/warning/error messages) were provided:
 -DEBUG- Dependency on jce exists, no need to add for property lib.jce.
 -INFO- Failed with reason build failed



The following work was performed:
http://vmgump.apache.org/gump/public/xml-security/xml-security-tests/gump_work/build_xml-security_xml-security-tests.html
Work Name: build_xml-security_xml-security-tests (Type: Build)
Work ended in a state of : Failed
Elapsed: 10 mins 8 secs
Command Line: /usr/lib/jvm/java-1.5.0-sun/bin/java -Djava.awt.headless=true -Dant.build.clonevm=true -Xbootclasspath/p:/srv/gump/public/workspace/xml-commons/java/external/build/xml-apis.jar:/srv/gump/public/workspace/xml-xerces2/build/xercesImpl.jar:/srv/gump/public/workspace/xml-xalan/build/serializer.jar:/srv/gump/public/workspace/xml-xalan/build/xalan-unbundled.jar org.apache.tools.ant.Main -Dgump.merge=/srv/gump/public/gump/work/merge.xml -Dbuild.sysclasspath=only -Djce.download.sha1=c1f0e975e8c8e0a0105787b249a50615b485d109 -Dlib.jce=/srv/gump/packages/jce/jce-jdk13-116.jar -Djce.download.md5=85c64cd754719a4bc8da7e9aa0e113fd test 
[Working Directory: /srv/gump/public/workspace/xml-security]
CLASSPATH: /usr/lib/jvm/java-1.5.0-sun/lib/tools.jar:/srv/gump/public/workspace/xml-security/build/test:/srv/gump/public/workspace/xml-security:/srv/gump/public/workspace/xml-security/build/xmlsec-02012009.jar:/srv/gump/public/workspace/ant/dist/lib/ant-jmf.jar:/srv/gump/public/workspace/ant/dist/lib/ant-swing.jar:/srv/gump/public/workspace/ant/dist/lib/ant-apache-resolver.jar:/srv/gump/public/workspace/ant/dist/lib/ant-apache-xalan2.jar:/srv/gump/public/workspace/ant/dist/lib/ant-trax.jar:/srv/gump/public/workspace/ant/dist/lib/ant-junit.jar:/srv/gump/public/workspace/ant/dist/lib/ant-launcher.jar:/srv/gump/public/workspace/ant/dist/lib/ant-nodeps.jar:/srv/gump/public/workspace/ant/dist/lib/ant.jar:/srv/gump/packages/junit3.8.1/junit.jar:/srv/gump/public/workspace/xml-commons/java/build/resolver.jar:/srv/gump/public/workspace/xml-commons/java/external/build/xml-apis-ext.jar:/srv/gump/packages/jce/jce-jdk13-116.jar:/srv/gump/public/workspace/apache-commons/logging/target/comm
 ons-logging-02012009.jar:/srv/gump/public/workspace/apache-commons/logging/target/commons-logging-api-02012009.jar:/srv/gump/public/workspace/junit/dist/junit-02012009.jar
---------------------------------------------
    [junit] Testcase: testBug40783 took 0.008 sec
    [junit] Running org.apache.xml.security.test.utils.Base64Test
    [junit] Testsuite: org.apache.xml.security.test.utils.Base64Test
    [junit] Tests run: 3, Failures: 0, Errors: 0, Time elapsed: 0.076 sec
    [junit] Tests run: 3, Failures: 0, Errors: 0, Time elapsed: 0.076 sec
    [junit] 
    [junit] Testcase: testA1 took 0.012 sec
    [junit] Testcase: testWrap1 took 0 sec
    [junit] Testcase: testWrap2 took 0.001 sec
    [junit] Running org.apache.xml.security.test.utils.IdResolverTest
    [junit] Testsuite: org.apache.xml.security.test.utils.IdResolverTest
    [junit] Tests run: 3, Failures: 0, Errors: 0, Time elapsed: 0.28 sec
    [junit] Tests run: 3, Failures: 0, Errors: 0, Time elapsed: 0.28 sec
    [junit] 
    [junit] Testcase: testIdSoap took 0.081 sec
    [junit] Testcase: testIdWithOtherIdSoap took 0.008 sec
    [junit] Testcase: testANoId took 0.006 sec
    [junit] Running org.apache.xml.security.test.utils.OldApiTest
    [junit] Testsuite: org.apache.xml.security.test.utils.OldApiTest
    [junit] Tests run: 4, Failures: 0, Errors: 0, Time elapsed: 0.504 sec
    [junit] Tests run: 4, Failures: 0, Errors: 0, Time elapsed: 0.504 sec
    [junit] 
    [junit] Testcase: testOldTransformSpiApi took 0.337 sec
    [junit] Testcase: testOldResourceResolverSpi took 0.005 sec
    [junit] Testcase: testOldKeyResolverSpi took 0.01 sec
    [junit] Testcase: testOldKeyResolverSpiInKeyInfo took 0.005 sec
    [junit] Running org.apache.xml.security.test.utils.resolver.AllTests
    [junit] Testsuite: org.apache.xml.security.test.utils.resolver.AllTests
    [junit] Tests run: 3, Failures: 0, Errors: 0, Time elapsed: 0.105 sec
    [junit] Tests run: 3, Failures: 0, Errors: 0, Time elapsed: 0.105 sec
    [junit] 
    [junit] Testcase: testCustomResolver took 0.021 sec
    [junit] Testcase: testLocalFileWithEmptyBaseURI took 0.005 sec
    [junit] Testcase: testBug40783 took 0.008 sec
    [junit] Running org.apache.xml.security.test.utils.resolver.ResourceResolverTest
    [junit] Testsuite: org.apache.xml.security.test.utils.resolver.ResourceResolverTest
    [junit] Tests run: 2, Failures: 0, Errors: 0, Time elapsed: 0.085 sec
    [junit] Tests run: 2, Failures: 0, Errors: 0, Time elapsed: 0.085 sec
    [junit] 
    [junit] Testcase: testCustomResolver took 0.023 sec
    [junit] Testcase: testLocalFileWithEmptyBaseURI took 0.005 sec
[junitreport] Processing /srv/gump/public/workspace/xml-security/build/docs/xml/junit/TESTS-TestSuites.xml to /tmp/null850506800
[junitreport] Loading stylesheet jar:file:/srv/gump/public/workspace/ant/dist/lib/ant-junit.jar!/org/apache/tools/ant/taskdefs/optional/junit/xsl/junit-frames.xsl
[junitreport] Transform time: 24934ms
[junitreport] Deleting: /tmp/null850506800

BUILD FAILED
/srv/gump/public/workspace/xml-security/build.xml:383: Unit Tests Failed

Total time: 10 minutes 8 seconds
---------------------------------------------

To subscribe to this information via syndicated feeds:
- RSS: http://vmgump.apache.org/gump/public/xml-security/xml-security-tests/rss.xml
- Atom: http://vmgump.apache.org/gump/public/xml-security/xml-security-tests/atom.xml

============================== Gump Tracking Only ===
Produced by Gump version 2.3.
Gump Run 21000002012009, vmgump:vmgump-public:21000002012009
Gump E-mail Identifier (unique within run) #24.

*********************************************************** G U M P
[GUMP@vmgump]: Module jakarta-bsf success, but with warnings.
To whom it may engage...
        
This is an automated request, but not an unsolicited one. For 
more information please visit http://gump.apache.org/nagged.html, 
and/or contact the folk at general@gump.apache.org.

Module jakarta-bsf contains errors.
The current state of this module is 'Success'.

Full details are available at:
    http://vmgump.apache.org/gump/public/jakarta-bsf/index.html

That said, some information snippets are provided here.

The following annotations (debug/informational/warning/error messages) were provided:
 -ERROR- *** Failed to update from source control. Stale contents ***



The following work was performed:
http://vmgump.apache.org/gump/public/jakarta-bsf/gump_work/update_jakarta-bsf.html
Work Name: update_jakarta-bsf (Type: Update)
Work ended in a state of : Failed
Elapsed: 
Command Line: svn --quiet update --non-interactive jakarta-bsf 
[Working Directory: /srv/gump/public/workspace/cvs]
---------------------------------------------
svn: Working copy 'jakarta-bsf' locked
svn: run 'svn cleanup' to remove locks (type 'svn help cleanup' for details)
---------------------------------------------

To subscribe to this information via syndicated feeds:
- RSS: http://vmgump.apache.org/gump/public/jakarta-bsf/rss.xml
- Atom: http://vmgump.apache.org/gump/public/jakarta-bsf/atom.xml

============================== Gump Tracking Only ===
Produced by Gump version 2.3.
Gump Run 21000002012009, vmgump:vmgump-public:21000002012009
Gump E-mail Identifier (unique within run) #25.

*********************************************************** G U M P
[GUMP@vmgump]: Project apacheds-shared (in module apacheds) failed
To whom it may engage...
        
This is an automated request, but not an unsolicited one. For 
more information please visit http://gump.apache.org/nagged.html, 
and/or contact the folk at general@gump.apache.org.

Project apacheds-shared has an issue affecting its community integration.
This issue affects 4 projects,
 and has been outstanding for 46 runs.
The current state of this project is 'Failed', with reason 'Build Failed'.
For reference only, the following projects are affected by this:
    - apacheds-core :  Apache Directory Server
    - apacheds-main :  Apache Directory Server
    - apacheds-shared :  Apache Directory Server
    - maven-directory-plugin :  Apache Directory Server


Full details are available at:
    http://vmgump.apache.org/gump/public/apacheds/apacheds-shared/index.html

That said, some information snippets are provided here.

The following annotations (debug/informational/warning/error messages) were provided:
 -DEBUG- Sole output [apacheds-shared-02012009.jar] identifier set to project name
 -DEBUG- (Gump generated) Maven Properties in: /srv/gump/public/workspace/apacheds/shared/build.properties
 -INFO- Failed with reason build failed
 -INFO- Project Reports in: /srv/gump/public/workspace/apacheds/shared/target/test-reports
 -INFO- Failed to extract fallback artifacts from Gump Repository



The following work was performed:
http://vmgump.apache.org/gump/public/apacheds/apacheds-shared/gump_work/build_apacheds_apacheds-shared.html
Work Name: build_apacheds_apacheds-shared (Type: Build)
Work ended in a state of : Failed
Elapsed: 3 secs
Command Line: maven --offline jar 
[Working Directory: /srv/gump/public/workspace/apacheds/shared]
CLASSPATH: /usr/lib/jvm/java-1.5.0-sun/lib/tools.jar:/srv/gump/public/workspace/junit/dist/junit-02012009.jar:/srv/gump/public/workspace/directory-shared/ldap/target/shared-ldap-0.9.14-SNAPSHOT.jar
---------------------------------------------
 __  __
|  \/  |__ _Apache__ ___
| |\/| / _` \ V / -_) ' \  ~ intelligent projects ~
|_|  |_\__,_|\_/\___|_||_|  v. 1.0.2

build:start:

java:prepare-filesystem:
    [mkdir] Created dir: /srv/gump/public/workspace/apacheds/shared/target/classes

java:compile:
    [echo] Compiling to /srv/gump/public/workspace/apacheds/shared/target/classes
    [echo] No java source files to compile.
resources or todir was null

java:jar-resources:

test:prepare-filesystem:
    [mkdir] Created dir: /srv/gump/public/workspace/apacheds/shared/target/test-classes
    [mkdir] Created dir: /srv/gump/public/workspace/apacheds/shared/target/test-reports

test:test-resources:

test:compile:
    [echo] No test source files to compile.

test:test:
    [echo] No tests to run.

BUILD FAILED
File...... /home/gump/.maven/cache/maven-jar-plugin-1.6.1/plugin.jelly
Element... ant:fail
Line...... 53
Column.... 19
You must define currentVersion in your POM.
Total time: 3 seconds
Finished at: Fri Jan 02 03:05:34 GMT-08:00 2009

---------------------------------------------

To subscribe to this information via syndicated feeds:
- RSS: http://vmgump.apache.org/gump/public/apacheds/apacheds-shared/rss.xml
- Atom: http://vmgump.apache.org/gump/public/apacheds/apacheds-shared/atom.xml

============================== Gump Tracking Only ===
Produced by Gump version 2.3.
Gump Run 21000002012009, vmgump:vmgump-public:21000002012009
Gump E-mail Identifier (unique within run) #26.

*********************************************************** G U M P
[GUMP@vmgump]: Module groovy success, but with warnings.
To whom it may engage...
        
This is an automated request, but not an unsolicited one. For 
more information please visit http://gump.apache.org/nagged.html, 
and/or contact the folk at general@gump.apache.org.

Module groovy contains errors.
The current state of this module is 'Success'.

Full details are available at:
    http://vmgump.apache.org/gump/public/groovy/index.html

That said, some information snippets are provided here.

The following annotations (debug/informational/warning/error messages) were provided:
 -ERROR- *** Failed to update from source control. Stale contents ***



The following work was performed:
http://vmgump.apache.org/gump/public/groovy/gump_work/update_groovy.html
Work Name: update_groovy (Type: Update)
Work ended in a state of : Failed
Elapsed: 
Command Line: svn --quiet update --non-interactive groovy 
[Working Directory: /srv/gump/public/workspace/cvs]
---------------------------------------------
svn: Working copy 'groovy' locked
svn: run 'svn cleanup' to remove locks (type 'svn help cleanup' for details)
---------------------------------------------

To subscribe to this information via syndicated feeds:
- RSS: http://vmgump.apache.org/gump/public/groovy/rss.xml
- Atom: http://vmgump.apache.org/gump/public/groovy/atom.xml

============================== Gump Tracking Only ===
Produced by Gump version 2.3.
Gump Run 21000002012009, vmgump:vmgump-public:21000002012009
Gump E-mail Identifier (unique within run) #30.

*********************************************************** G U M P
[GUMP@vmgump]: Project groovy (in module groovy) failed
To whom it may engage...
        
This is an automated request, but not an unsolicited one. For 
more information please visit http://gump.apache.org/nagged.html, 
and/or contact the folk at general@gump.apache.org.

Project groovy has an issue affecting its community integration.
This issue affects 2 projects,
 and has been outstanding for 38 runs.
The current state of this project is 'Failed', with reason 'Missing Build Outputs'.
For reference only, the following projects are affected by this:
    - authx-script :  Apache Authentication and Authorization Framework
    - groovy :  New agile dynamic language using a Java-like syntax for the ...


Full details are available at:
    http://vmgump.apache.org/gump/public/groovy/groovy/index.html

That said, some information snippets are provided here.

The following annotations (debug/informational/warning/error messages) were provided:
 -DEBUG- Sole output [groovy-1.7-beta-1-SNAPSHOT.jar] identifier set to project name
 -DEBUG- (Gump generated) Maven2 Settings in: /srv/gump/public/workspace/groovy/gump_mvn_settings.xml
 -DEBUG- Maven POM in: /srv/gump/public/workspace/groovy/pom.xml
 -INFO- Failed with reason missing build outputs
 -ERROR- Missing Output: /srv/gump/public/workspace/groovy/target/groovy-1.7-beta-1-SNAPSHOT.jar
 -ERROR- See Directory Listing Work for Missing Outputs
 -INFO- Failed to extract fallback artifacts from Gump Repository



The following work was performed:
http://vmgump.apache.org/gump/public/groovy/groovy/gump_work/build_groovy_groovy.html
Work Name: build_groovy_groovy (Type: Build)
Work ended in a state of : Success
Elapsed: 17 secs
Command Line: mvn --batch-mode --settings /srv/gump/public/workspace/groovy/gump_mvn_settings.xml package 
[Working Directory: /srv/gump/public/workspace/groovy]
CLASSPATH: /usr/lib/jvm/java-1.5.0-sun/lib/tools.jar:/srv/gump/public/workspace/ant/dist/lib/ant-jmf.jar:/srv/gump/public/workspace/ant/dist/lib/ant-swing.jar:/srv/gump/public/workspace/ant/dist/lib/ant-apache-resolver.jar:/srv/gump/public/workspace/ant/dist/lib/ant-apache-xalan2.jar:/srv/gump/public/workspace/ant/dist/lib/ant-trax.jar:/srv/gump/public/workspace/ant/dist/lib/ant-junit.jar:/srv/gump/public/workspace/ant/dist/lib/ant-launcher.jar:/srv/gump/public/workspace/ant/dist/lib/ant-nodeps.jar:/srv/gump/public/workspace/ant/dist/lib/ant.jar:/srv/gump/packages/antlr-2.7.6/antlr.jar:/srv/gump/public/workspace/asm/output/dist/lib/asm-analysis-02012009.jar:/srv/gump/public/workspace/asm/output/dist/lib/asm-util-02012009.jar:/srv/gump/public/workspace/asm/output/dist/lib/asm-xml-02012009.jar:/srv/gump/public/workspace/asm/output/dist/lib/asm-commons-02012009.jar:/srv/gump/public/workspace/asm/output/dist/lib/asm-02012009.jar:/srv/gump/public/workspace/asm/output/dist/lib/asm-
 tree-02012009.jar:/srv/gump/packages/axion-1.0-M2/axion-1.0-M2.jar:/srv/gump/packages/cglib/cglib-nodep-2.1_3.jar:/srv/gump/public/workspace/commons-cli-1.x/target/commons-cli-02012009.jar:/srv/gump/public/workspace/apache-commons/collections/build/commons-collections-02012009.jar:/srv/gump/public/workspace/httpcomponents/oac.hc3x/dist/commons-httpclient.jar:/srv/gump/public/workspace/apache-commons/logging/target/commons-logging-02012009.jar:/srv/gump/public/workspace/apache-commons/logging/target/commons-logging-api-02012009.jar:/srv/gump/public/workspace/apache-commons/primitives/target/commons-primitives-02012009.jar:/srv/gump/public/workspace/hsqldb/lib/hsqldb.jar:/srv/gump/public/workspace/jakarta-bsf/build/lib/bsf.jar:/srv/gump/public/workspace/jakarta-regexp/build/jakarta-regexp-02012009.jar:/srv/gump/public/workspace/jakarta-servletapi-5/jsr154/dist/lib/servlet-api.jar:/srv/gump/public/workspace/jakarta-servletapi-5/jsr152/dist/lib/jsp-api.jar:/srv/gump/packages/jar
 jar/jarjar-0.6.jar:/srv/gump/public/workspace/jmock/build/dist/jmock-core-02012009.jar:/srv/gump/public/workspace/jmock/build/dist/jmock-cglib-02012009.jar:/srv/gump/public/workspace/junit/dist/junit-02012009.jar:/srv/gump/packages/mockobjects-0.09/mockobjects-core-0.09.jar:/srv/gump/packages/mockobjects-0.09/mockobjects-jdk1.4-0.09.jar:/srv/gump/packages/mockobjects-0.09/mockobjects-alt-jdk1.4-0.09.jar:/srv/gump/public/workspace/mx4j/dist/lib/mx4j-impl.jar:/srv/gump/public/workspace/mx4j/dist/lib/mx4j-jmx.jar:/srv/gump/public/workspace/mx4j/dist/lib/mx4j.jar:/srv/gump/packages/nekohtml-0.9.5/nekohtml.jar:/srv/gump/packages/openejb-0.9.2/dist/openejb_loader-0.9.2.jar:/srv/gump/packages/openejb-0.9.2/dist/openejb_ejb_tests-0.9.2.jar:/srv/gump/packages/openejb-0.9.2/dist/openejb_server-0.9.2.jar:/srv/gump/packages/openejb-0.9.2/dist/openejb_client-0.9.2.jar:/srv/gump/packages/openejb-0.9.2/dist/openejb-0.9.2.jar:/srv/gump/packages/qdox-1.6.3/qdox-1.6.3.jar:/srv/gump/packages/r
 adeox-1.0-BETA-2/lib/radeox-api.jar:/srv/gump/packages/radeox-1.0-BETA-2/lib/radeox.jar:/srv/gump/public/workspace/xml-commons/java/external/build/xml-apis-ext.jar:/srv/gump/public/workspace/xmlunit/build/lib/xmlunit-02012009.jar:/srv/gump/public/workspace/xpp/build/xpp3-02012009.jar:/srv/gump/public/workspace/xstream/xstream/target/xstream-02012009.jar
---------------------------------------------
Downloading: http://localhost:8192/maven2/asm/asm-analysis/2.2.3/asm-analysis-2.2.3.jar
17K downloaded
Downloading: http://localhost:8192/maven2/bsf/bsf/2.4.0/bsf-2.4.0.jar
103K downloaded
Downloading: http://localhost:8192/maven2/javax/servlet/jsp-api/2.0/jsp-api-2.0.jar
49K downloaded
Downloading: http://localhost:8192/maven2/com/thoughtworks/xstream/xstream/1.3/xstream-1.3.jar
401K downloaded
Downloading: http://localhost:8192/maven2/jline/jline/0.9.94/jline-0.9.94.jar
85K downloaded
[INFO] [compiler:compile]
[INFO] Nothing to compile - all classes are up to date
[INFO] [resources:testResources]
[INFO] Using default encoding to copy filtered resources.
Downloading: http://localhost:8192/maven2/org/apache/ant/ant-launcher/1.7.0/ant-launcher-1.7.0.jar
11K downloaded
Downloading: http://localhost:8192/maven2/org/apache/ant/ant-junit/1.7.0/ant-junit-1.7.0.jar
90K downloaded
Downloading: http://localhost:8192/maven2/jmock/jmock/1.2.0/jmock-1.2.0.jar
168K downloaded
Downloading: http://localhost:8192/maven2/jmock/jmock-cglib/1.2.0/jmock-cglib-1.2.0.jar
6K downloaded
Downloading: http://localhost:8192/maven2/asm/asm-attrs/2.2.3/asm-attrs-2.2.3.jar
6K downloaded
Downloading: http://localhost:8192/maven2/xmlunit/xmlunit/1.1/xmlunit-1.1.jar
94K downloaded
Downloading: http://localhost:8192/maven2/hsqldb/hsqldb/1.8.0.7/hsqldb-1.8.0.7.jar
686K downloaded
[INFO] [compiler:testCompile]
[INFO] Not compiling test sources
Downloading: http://localhost:8192/maven2/org/apache/maven/surefire/surefire-booter/2.3/surefire-booter-2.3.pom
1K downloaded
Downloading: http://localhost:8192/maven2/org/apache/maven/surefire/surefire-api/2.3/surefire-api-2.3.pom
887b downloaded
Downloading: http://localhost:8192/maven2/org/apache/maven/surefire/surefire-booter/2.3/surefire-booter-2.3.jar
28K downloaded
Downloading: http://localhost:8192/maven2/org/apache/maven/surefire/surefire-api/2.3/surefire-api-2.3.jar
49K downloaded
[INFO] [surefire:test]
[INFO] Tests are skipped.
[INFO] [jar:jar]
[WARNING] JAR will be empty - no content was marked for inclusion!
[INFO] Building jar: /srv/gump/public/workspace/groovy/target/groovy-1.6-beta-1-SNAPSHOT.jar
[INFO] ------------------------------------------------------------------------
[INFO] BUILD SUCCESSFUL
[INFO] ------------------------------------------------------------------------
[INFO] Total time: 15 seconds
[INFO] Finished at: Fri Jan 02 03:16:03 GMT-08:00 2009
[INFO] Final Memory: 7M/14M
[INFO] ------------------------------------------------------------------------
---------------------------------------------

To subscribe to this information via syndicated feeds:
- RSS: http://vmgump.apache.org/gump/public/groovy/groovy/rss.xml
- Atom: http://vmgump.apache.org/gump/public/groovy/groovy/atom.xml

============================== Gump Tracking Only ===
Produced by Gump version 2.3.
Gump Run 21000002012009, vmgump:vmgump-public:21000002012009
Gump E-mail Identifier (unique within run) #31.

*********************************************************** G U M P
[GUMP@vmgump]: Project kerberos-common (in module kerberos-shared) failed
To whom it may engage...
        
This is an automated request, but not an unsolicited one. For 
more information please visit http://gump.apache.org/nagged.html, 
and/or contact the folk at general@gump.apache.org.

Project kerberos-common has an issue affecting its community integration.
This issue affects 2 projects,
 and has been outstanding for 46 runs.
The current state of this project is 'Failed', with reason 'Build Failed'.
For reference only, the following projects are affected by this:
    - kerberos-common :  Apache Directory Project
    - kerberos-protocol :  Apache Kerberos Server


Full details are available at:
    http://vmgump.apache.org/gump/public/kerberos-shared/kerberos-common/index.html

That said, some information snippets are provided here.

The following annotations (debug/informational/warning/error messages) were provided:
 -DEBUG- Sole output [kerberos-common-02012009.jar] identifier set to project name
 -DEBUG- Dependency on bcprov exists, no need to add for property maven.jar.bcprov-jdk14.
 -INFO- Making directory for Maven properties: [/srv/gump/public/workspace/kerberos-shared/common]
 -DEBUG- (Gump generated) Maven Properties in: /srv/gump/public/workspace/kerberos-shared/common/build.properties
 -INFO- Failed with reason build failed
 -INFO- Project Reports in: /srv/gump/public/workspace/kerberos-shared/common/target/test-reports
 -INFO- Failed to extract fallback artifacts from Gump Repository



The following work was performed:
http://vmgump.apache.org/gump/public/kerberos-shared/kerberos-common/gump_work/build_kerberos-shared_kerberos-common.html
Work Name: build_kerberos-shared_kerberos-common (Type: Build)
Work ended in a state of : Failed
Elapsed: 3 secs
Command Line: maven --offline jar 
[Working Directory: /srv/gump/public/workspace/kerberos-shared/common]
CLASSPATH: /usr/lib/jvm/java-1.5.0-sun/lib/tools.jar:/srv/gump/public/workspace/directory-shared/asn1/target/shared-asn1-0.9.14-SNAPSHOT.jar:/srv/gump/packages/bouncycastle-jdk14/bcprov-130.jar:/srv/gump/public/workspace/directory-shared/ldap/target/shared-ldap-0.9.14-SNAPSHOT.jar
---------------------------------------------
 __  __
|  \/  |__ _Apache__ ___
| |\/| / _` \ V / -_) ' \  ~ intelligent projects ~
|_|  |_\__,_|\_/\___|_||_|  v. 1.0.2

build:start:

java:prepare-filesystem:
    [mkdir] Created dir: /srv/gump/public/workspace/kerberos-shared/common/target/classes

java:compile:
    [echo] Compiling to /srv/gump/public/workspace/kerberos-shared/common/target/classes
    [echo] No java source files to compile.
resources or todir was null

java:jar-resources:

test:prepare-filesystem:
    [mkdir] Created dir: /srv/gump/public/workspace/kerberos-shared/common/target/test-classes
    [mkdir] Created dir: /srv/gump/public/workspace/kerberos-shared/common/target/test-reports

test:test-resources:

test:compile:
    [echo] No test source files to compile.

test:test:
    [echo] No tests to run.

BUILD FAILED
File...... /home/gump/.maven/cache/maven-jar-plugin-1.6.1/plugin.jelly
Element... ant:fail
Line...... 53
Column.... 19
You must define currentVersion in your POM.
Total time: 3 seconds
Finished at: Fri Jan 02 03:20:45 GMT-08:00 2009

---------------------------------------------

To subscribe to this information via syndicated feeds:
- RSS: http://vmgump.apache.org/gump/public/kerberos-shared/kerberos-common/rss.xml
- Atom: http://vmgump.apache.org/gump/public/kerberos-shared/kerberos-common/atom.xml

============================== Gump Tracking Only ===
Produced by Gump version 2.3.
Gump Run 21000002012009, vmgump:vmgump-public:21000002012009
Gump E-mail Identifier (unique within run) #32.

*********************************************************** G U M P
[GUMP@vmgump]: Project JacORB-idllib (in module JacORB) failed
To whom it may engage...
        
This is an automated request, but not an unsolicited one. For 
more information please visit http://gump.apache.org/nagged.html, 
and/or contact the folk at general@gump.apache.org.

Project JacORB-idllib has an issue affecting its community integration.
This issue affects 2 projects,
 and has been outstanding for 473 runs.
The current state of this project is 'Failed', with reason 'Build Failed'.
For reference only, the following projects are affected by this:
    - JacORB :  The free Java implementation of the OMG's CORBA standard.
    - JacORB-idllib :  The free Java implementation of the OMG's CORBA standard.


Full details are available at:
    http://vmgump.apache.org/gump/public/JacORB/JacORB-idllib/index.html

That said, some information snippets are provided here.

The following annotations (debug/informational/warning/error messages) were provided:
 -DEBUG- Sole output [idl.jar] identifier set to project name
 -INFO- Failed with reason build failed
 -INFO- Failed to extract fallback artifacts from Gump Repository



The following work was performed:
http://vmgump.apache.org/gump/public/JacORB/JacORB-idllib/gump_work/build_JacORB_JacORB-idllib.html
Work Name: build_JacORB_JacORB-idllib (Type: Build)
Work ended in a state of : Failed
Elapsed: 6 secs
Command Line: /usr/lib/jvm/java-1.5.0-sun/bin/java -Djava.awt.headless=true -Xbootclasspath/p:/srv/gump/public/workspace/xml-commons/java/external/build/xml-apis.jar:/srv/gump/public/workspace/xml-xerces2/build/xercesImpl.jar org.apache.tools.ant.Main -Dgump.merge=/srv/gump/public/gump/work/merge.xml -Dbuild.sysclasspath=only init idllib 
[Working Directory: /srv/gump/public/workspace/JacORB]
CLASSPATH: /usr/lib/jvm/java-1.5.0-sun/lib/tools.jar:/srv/gump/public/workspace/ant/build/lib/ant-stylebook.jar:/srv/gump/public/workspace/ant/build/lib/ant-swing.jar:/srv/gump/public/workspace/ant/build/lib/ant-apache-resolver.jar:/srv/gump/public/workspace/ant/build/lib/ant-nodeps.jar:/srv/gump/public/workspace/ant/build/lib/ant-apache-xalan2.jar:/srv/gump/public/workspace/ant/build/lib/ant-apache-regexp.jar:/srv/gump/public/workspace/ant/build/lib/ant-commons-net.jar:/srv/gump/public/workspace/ant/build/lib/ant-apache-log4j.jar:/srv/gump/public/workspace/ant/build/lib/ant-commons-logging.jar:/srv/gump/public/workspace/ant/build/lib/ant-jai.jar:/srv/gump/public/workspace/ant/build/lib/ant-jmf.jar:/srv/gump/public/workspace/ant/build/lib/ant-launcher.jar:/srv/gump/public/workspace/ant/build/lib/ant-jdepend.jar:/srv/gump/public/workspace/ant/build/lib/ant-apache-bsf.jar:/srv/gump/public/workspace/ant/build/lib/ant-apache-oro.jar:/srv/gump/public/workspace/ant/build/lib/ant-ap
 ache-bcel.jar:/srv/gump/public/workspace/ant/build/lib/ant-trax.jar:/srv/gump/public/workspace/ant/build/lib/ant-antlr.jar:/srv/gump/public/workspace/ant/build/lib/ant-junit.jar:/srv/gump/public/workspace/ant/build/lib/ant-jsch.jar:/srv/gump/public/workspace/ant/build/lib/ant-javamail.jar:/srv/gump/public/workspace/ant/build/lib/ant.jar:/srv/gump/public/workspace/xml-commons/java/external/build/xml-apis-ext.jar:/srv/gump/packages/antlr-2.7.6/antlr.jar:/srv/gump/public/workspace/excalibur/framework/api/target/excalibur-framework-api-02012009.jar:/srv/gump/packages/dougLea/concurrent.jar:/srv/gump/packages/avalon-logkit/avalon-logkit-2.1.jar:/srv/gump/public/workspace/xml-xalan/tools/java_cup.jar:/srv/gump/public/workspace/xml-xalan/lib/runtime.jar
---------------------------------------------
    [javac] /srv/gump/public/workspace/JacORB/src/org/jacorb/idl/parser.java:2029: cannot find symbol
    [javac] symbol  : class Symbol
    [javac] location: package org.jacorb.idl.runtime
    [javac]               CUP$parser$result = new org.jacorb.idl.runtime.Symbol(91/*parameter_dcls*/, ((org.jacorb.idl.runtime.Symbol)CUP$parser$stack.elementAt(CUP$parser$top-1)).left, ((org.jacorb.idl.runtime.Symbol)CUP$parser$stack.elementAt(CUP$parser$top-0)).right, RESULT);
    [javac]                                                             ^
    [javac] /srv/gump/public/workspace/JacORB/src/org/jacorb/idl/parser.java:2029: cannot find symbol
    [javac] symbol  : class Symbol
    [javac] location: package org.jacorb.idl.runtime
    [javac]               CUP$parser$result = new org.jacorb.idl.runtime.Symbol(91/*parameter_dcls*/, ((org.jacorb.idl.runtime.Symbol)CUP$parser$stack.elementAt(CUP$parser$top-1)).left, ((org.jacorb.idl.runtime.Symbol)CUP$parser$stack.elementAt(CUP$parser$top-0)).right, RESULT);
    [javac]                                                                                                                   ^
    [javac] /srv/gump/public/workspace/JacORB/src/org/jacorb/idl/parser.java:2029: cannot find symbol
    [javac] symbol  : class Symbol
    [javac] location: package org.jacorb.idl.runtime
    [javac]               CUP$parser$result = new org.jacorb.idl.runtime.Symbol(91/*parameter_dcls*/, ((org.jacorb.idl.runtime.Symbol)CUP$parser$stack.elementAt(CUP$parser$top-1)).left, ((org.jacorb.idl.runtime.Symbol)CUP$parser$stack.elementAt(CUP$parser$top-0)).right, RESULT);
    [javac]                                                                                                                                                                                                       ^
    [javac] /srv/gump/public/workspace/JacORB/src/org/jacorb/idl/parser.java:2037: cannot find symbol
    [javac] symbol  : class Symbol
    [javac] location: package org.jacorb.idl.runtime
    [javac] 		int pdsleft = ((org.jacorb.idl.runtime.Symbol)CUP$parser$stack.elementAt(CUP$parser$top-1)).left;
    [javac]                                                       ^
    [javac] /srv/gump/public/workspace/JacORB/src/org/jacorb/idl/parser.java:2038: cannot find symbol
    [javac] symbol  : class Symbol
    [javac] location: package org.jacorb.idl.runtime
    [javac] 		int pdsright = ((org.jacorb.idl.runtime.Symbol)CUP$parser$stack.elementAt(CUP$parser$top-1)).right;
    [javac]                                                        ^
    [javac] /srv/gump/public/workspace/JacORB/src/org/jacorb/idl/parser.java:2039: cannot find symbol
    [javac] symbol  : class Symbol
    [javac] location: package org.jacorb.idl.runtime
    [javac] 		SymbolList pds = (SymbolList)((org.jacorb.idl.runtime.Symbol) CUP$parser$stack.elementAt(CUP$parser$top-1)).value;
    [javac]                                                                      ^
    [javac] /srv/gump/public/workspace/JacORB/src/org/jacorb/idl/parser.java:2043: cannot find symbol
    [javac] symbol  : class Symbol
    [javac] location: package org.jacorb.idl.runtime
    [javac]               CUP$parser$result = new org.jacorb.idl.runtime.Symbol(91/*parameter_dcls*/, ((org.jacorb.idl.runtime.Symbol)CUP$parser$stack.elementAt(CUP$parser$top-2)).left, ((org.jacorb.idl.runtime.Symbol)CUP$parser$stack.elementAt(CUP$parser$top-0)).right, RESULT);
    [javac]                                                             ^
    [javac] /srv/gump/public/workspace/JacORB/src/org/jacorb/idl/parser.java:2043: cannot find symbol
    [javac] symbol  : class Symbol
    [javac] location: package org.jacorb.idl.runtime
    [javac]               CUP$parser$result = new org.jacorb.idl.runtime.Symbol(91/*parameter_dcls*/, ((org.jacorb.idl.runtime.Symbol)CUP$parser$stack.elementAt(CUP$parser$top-2)).left, ((org.jacorb.idl.runtime.Symbol)CUP$parser$stack.elementAt(CUP$parser$top-0)).right, RESULT);
    [javac]                                                                                                                   ^
    [javac] Note: Some input files use or override a deprecated API.
    [javac] Note: Recompile with -Xlint:deprecation for details.
    [javac] 100 errors

BUILD FAILED
/srv/gump/public/workspace/JacORB/build.xml:68: The following error occurred while executing this line:
/srv/gump/public/workspace/JacORB/src/org/jacorb/idl/build.xml:18: The following error occurred while executing this line:
/srv/gump/public/workspace/JacORB/etc/common.xml:90: Compile failed; see the compiler error output for details.

Total time: 5 seconds
---------------------------------------------

To subscribe to this information via syndicated feeds:
- RSS: http://vmgump.apache.org/gump/public/JacORB/JacORB-idllib/rss.xml
- Atom: http://vmgump.apache.org/gump/public/JacORB/JacORB-idllib/atom.xml

============================== Gump Tracking Only ===
Produced by Gump version 2.3.
Gump Run 21000002012009, vmgump:vmgump-public:21000002012009
Gump E-mail Identifier (unique within run) #34.

*********************************************************** G U M P
[GUMP@vmgump]: Module jakarta-tomcat success, but with warnings.
To whom it may engage...
        
This is an automated request, but not an unsolicited one. For 
more information please visit http://gump.apache.org/nagged.html, 
and/or contact the folk at general@gump.apache.org.

Module jakarta-tomcat contains errors.
The current state of this module is 'Success'.

Full details are available at:
    http://vmgump.apache.org/gump/public/jakarta-tomcat/index.html

That said, some information snippets are provided here.

The following annotations (debug/informational/warning/error messages) were provided:
 -ERROR- *** Failed to update from source control. Stale contents ***



The following work was performed:
http://vmgump.apache.org/gump/public/jakarta-tomcat/gump_work/update_jakarta-tomcat.html
Work Name: update_jakarta-tomcat (Type: Update)
Work ended in a state of : Failed
Elapsed: 1 sec
Command Line: svn --quiet update --non-interactive jakarta-tomcat 
[Working Directory: /srv/gump/public/workspace/cvs]
---------------------------------------------
svn: REPORT request failed on '/repos/asf/!svn/vcc/default'
svn: Target path does not exist
---------------------------------------------

To subscribe to this information via syndicated feeds:
- RSS: http://vmgump.apache.org/gump/public/jakarta-tomcat/rss.xml
- Atom: http://vmgump.apache.org/gump/public/jakarta-tomcat/atom.xml

============================== Gump Tracking Only ===
Produced by Gump version 2.3.
Gump Run 21000002012009, vmgump:vmgump-public:21000002012009
Gump E-mail Identifier (unique within run) #35.

*********************************************************** G U M P
[GUMP@vmgump]: Project hivemind (in module hivemind) failed
To whom it may engage...
        
This is an automated request, but not an unsolicited one. For 
more information please visit http://gump.apache.org/nagged.html, 
and/or contact the folk at general@gump.apache.org.

Project hivemind has an issue affecting its community integration.
This issue affects 6 projects,
 and has been outstanding for 531 runs.
The current state of this project is 'Failed', with reason 'Build Failed'.
For reference only, the following projects are affected by this:
    - eyebrowse :  Web-based mail archive browsing
    - hivemind :  HiveMind is a services and configuration
    microkernel
    - hivemind-test :  HiveMind is a services and configuration
    microkernel
    - jakarta-lucene :  Java Based Search Engine
    - lenya :  Content Management System
    - lucene-java :  Java Based Search Engine


Full details are available at:
    http://vmgump.apache.org/gump/public/hivemind/hivemind/index.html

That said, some information snippets are provided here.

The following annotations (debug/informational/warning/error messages) were provided:
 -INFO- Optional dependency commons-fileupload prerequisite failed with reason build failed
 -DEBUG- (Gump generated) Maven2 Settings in: /srv/gump/public/workspace/hivemind/gump_mvn_settings.xml
 -INFO- Failed with reason build failed
 -DEBUG- Maven POM in: /srv/gump/public/workspace/hivemind/pom.xml
 -INFO- Failed to extract fallback artifacts from Gump Repository



The following work was performed:
http://vmgump.apache.org/gump/public/hivemind/hivemind/gump_work/build_hivemind_hivemind.html
Work Name: build_hivemind_hivemind (Type: Build)
Work ended in a state of : Failed
Elapsed: 26 secs
Command Line: mvn --batch-mode -Dmaven.test.skip=true --settings /srv/gump/public/workspace/hivemind/gump_mvn_settings.xml package 
[Working Directory: /srv/gump/public/workspace/hivemind]
CLASSPATH: /usr/lib/jvm/java-1.5.0-sun/lib/tools.jar:/srv/gump/public/workspace/aopalliance/build/aopalliance.jar:/srv/gump/public/workspace/asm/output/dist/lib/asm-analysis-02012009.jar:/srv/gump/public/workspace/asm/output/dist/lib/asm-util-02012009.jar:/srv/gump/public/workspace/asm/output/dist/lib/asm-xml-02012009.jar:/srv/gump/public/workspace/asm/output/dist/lib/asm-commons-02012009.jar:/srv/gump/public/workspace/asm/output/dist/lib/asm-02012009.jar:/srv/gump/public/workspace/asm/output/dist/lib/asm-tree-02012009.jar:/srv/gump/packages/cglib/cglib-nodep-2.1_3.jar:/srv/gump/public/workspace/apache-commons/dbcp/dist/commons-dbcp.jar:/srv/gump/public/workspace/apache-commons/fileupload/target/commons-fileupload-02012009.jar:/srv/gump/public/workspace/apache-commons/logging/target/commons-logging-02012009.jar:/srv/gump/public/workspace/apache-commons/logging/target/commons-logging-api-02012009.jar:/srv/gump/public/workspace/apache-commons/net/dist/commons-net-02012009.jar:/
 srv/gump/public/workspace/apache-commons/pool/dist/commons-pool.jar:/srv/gump/packages/easymock1.2_Java1.3/easymock.jar:/srv/gump/packages/easymockclassextension1.2/easymockclassextension.jar:/srv/gump/packages/ejb-2_0-fr/ejb.jar:/srv/gump/public/workspace/jakarta-oro/jakarta-oro-02012009.jar:/srv/gump/public/workspace/jakarta-servletapi-4/lib/servlet.jar:/srv/gump/public/workspace/javassist/javassist.jar:/srv/gump/public/workspace/junit/dist/junit-02012009.jar:/srv/gump/public/workspace/logging-log4j-12/dist/lib/log4j-02012009.jar:/srv/gump/public/workspace/mx4j/dist/lib/mx4j-impl.jar:/srv/gump/public/workspace/mx4j/dist/lib/mx4j-jmx.jar:/srv/gump/public/workspace/mx4j/dist/lib/mx4j.jar:/srv/gump/public/workspace/mx4j/remote-dist/lib/mx4j-rjmx.jar:/srv/gump/public/workspace/mx4j/remote-dist/lib/mx4j-remote.jar:/srv/gump/public/workspace/mx4j/remote-dist/lib/mx4j-rimpl.jar:/srv/gump/public/workspace/mx4j/tools-dist/lib/mx4j-tools.jar:/srv/gump/packages/groovy-1.0-jsr-03/groo
 vy-1.0-jsr-03.jar:/srv/gump/packages/spring-framework-1.2.6/dist/spring-beans.jar:/srv/gump/packages/spring-framework-1.2.6/dist/spring-core.jar:/srv/gump/public/workspace/xml-commons/java/external/build/xml-apis-ext.jar
---------------------------------------------
Downloading: http://localhost:8192/maven2/groovy/groovy-all/1.0-jsr-03/groovy-all-1.0-jsr-03.pom
155b downloaded
Downloading: http://localhost:8192/maven2/jboss/jboss-j2ee/3.2.1/jboss-j2ee-3.2.1.pom
149b downloaded
Downloading: http://localhost:8192/maven2/org/springframework/spring-full/1.0.1/spring-full-1.0.1.pom
164b downloaded
Downloading: http://localhost:8192/maven2/groovy/groovy-all/1.0-jsr-03/groovy-all-1.0-jsr-03.jar
1064K downloaded
Downloading: http://localhost:8192/maven2/jboss/jboss-j2ee/3.2.1/jboss-j2ee-3.2.1.jar
68K downloaded
Downloading: http://localhost:8192/maven2/org/springframework/spring-full/1.0.1/spring-full-1.0.1.jar
959K downloaded
[INFO] ------------------------------------------------------------------------
[ERROR] BUILD ERROR
[INFO] ------------------------------------------------------------------------
[INFO] Failed to resolve artifact.

Missing:
----------
1) org.apache.hivemind:hivemind:jar:tests:1.2-SNAPSHOT

  Try downloading the file manually from the project website.

  Then, install it using the command: 
      mvn install:install-file -DgroupId=org.apache.hivemind -DartifactId=hivemind -Dversion=1.2-SNAPSHOT -Dclassifier=tests -Dpackaging=jar -Dfile=/path/to/file

  Alternatively, if you host your own repository you can deploy the file there: 
      mvn deploy:deploy-file -DgroupId=org.apache.hivemind -DartifactId=hivemind -Dversion=1.2-SNAPSHOT -Dclassifier=tests -Dpackaging=jar -Dfile=/path/to/file -Durl=[url] -DrepositoryId=[id]

  Path to dependency: 
  	1) org.apache.hivemind:hivemind-lib:jar:1.2-SNAPSHOT
  	2) org.apache.hivemind:hivemind:jar:tests:1.2-SNAPSHOT

----------
1 required artifact is missing.

for artifact: 
  org.apache.hivemind:hivemind-lib:jar:1.2-SNAPSHOT

from the specified remote repositories:
  Gump (http://localhost:8192/maven2)


[INFO] ------------------------------------------------------------------------
[INFO] For more information, run Maven with the -e switch
[INFO] ------------------------------------------------------------------------
[INFO] Total time: 25 seconds
[INFO] Finished at: Fri Jan 02 03:33:43 GMT-08:00 2009
[INFO] Final Memory: 11M/22M
[INFO] ------------------------------------------------------------------------
---------------------------------------------

To subscribe to this information via syndicated feeds:
- RSS: http://vmgump.apache.org/gump/public/hivemind/hivemind/rss.xml
- Atom: http://vmgump.apache.org/gump/public/hivemind/hivemind/atom.xml

============================== Gump Tracking Only ===
Produced by Gump version 2.3.
Gump Run 21000002012009, vmgump:vmgump-public:21000002012009
Gump E-mail Identifier (unique within run) #37.

*********************************************************** G U M P
[GUMP@vmgump]: Project tapestry (in module tapestry) failed
To whom it may engage...
        
This is an automated request, but not an unsolicited one. For 
more information please visit http://gump.apache.org/nagged.html, 
and/or contact the folk at general@gump.apache.org.

Project tapestry has an issue affecting its community integration.
This issue affects 1 projects,
 and has been outstanding for 586 runs.
The current state of this project is 'Failed', with reason 'Build Failed'.
For reference only, the following projects are affected by this:
    - tapestry :  Component-based web application framework organized around i...


Full details are available at:
    http://vmgump.apache.org/gump/public/tapestry/tapestry/index.html

That said, some information snippets are provided here.

The following annotations (debug/informational/warning/error messages) were provided:
 -DEBUG- Sole output [tapestry-02012009.jar] identifier set to project name
 -INFO- Optional dependency commons-fileupload prerequisite failed with reason build failed
 -INFO- Optional dependency hivemind failed with reason build failed
 -DEBUG- (Gump generated) Maven2 Settings in: /srv/gump/public/workspace/tapestry/gump_mvn_settings.xml
 -INFO- Failed with reason build failed
 -DEBUG- Maven POM in: /srv/gump/public/workspace/tapestry/pom.xml
 -INFO- Failed to extract fallback artifacts from Gump Repository



The following work was performed:
http://vmgump.apache.org/gump/public/tapestry/tapestry/gump_work/build_tapestry_tapestry.html
Work Name: build_tapestry_tapestry (Type: Build)
Work ended in a state of : Failed
Elapsed: 1 min 13 secs
Command Line: mvn --batch-mode --settings /srv/gump/public/workspace/tapestry/gump_mvn_settings.xml package 
[Working Directory: /srv/gump/public/workspace/tapestry]
CLASSPATH: /usr/lib/jvm/java-1.5.0-sun/lib/tools.jar:/srv/gump/public/workspace/apache-commons/beanutils/dist/commons-beanutils-02012009.jar:/srv/gump/public/workspace/apache-commons/codec/dist/commons-codec-02012009.jar:/srv/gump/public/workspace/apache-commons/digester/dist/commons-digester.jar:/srv/gump/public/workspace/apache-commons/fileupload/target/commons-fileupload-02012009.jar:/srv/gump/public/workspace/apache-commons/io/target/commons-io-02012009.jar:/srv/gump/public/workspace/apache-commons/lang/commons-lang-02012009.jar:/srv/gump/public/workspace/apache-commons/logging/target/commons-logging-02012009.jar:/srv/gump/public/workspace/apache-commons/logging/target/commons-logging-api-02012009.jar:/srv/gump/packages/easymock1.2_Java1.3/easymock.jar:/srv/gump/packages/easymockclassextension1.2/easymockclassextension.jar:/srv/gump/public/workspace/hivemind/framework/target/hivemind-1.2.1.jar:/srv/gump/public/workspace/hivemind/library/target/hivemind-lib-1.2.1.jar:/srv/
 gump/public/workspace/jakarta-oro/jakarta-oro-02012009.jar:/srv/gump/public/workspace/jakarta-servletapi-4/lib/servlet.jar:/srv/gump/public/workspace/javassist/javassist.jar:/srv/gump/public/workspace/jdom/build/jdom.jar:/srv/gump/public/workspace/logging-log4j-12/dist/lib/log4j-02012009.jar:/srv/gump/packages/ognl-2.6.7/ognl-2.6.7.jar:/srv/gump/public/workspace/xml-commons/java/external/build/xml-apis-ext.jar:/srv/gump/packages/jCharts-0.7.5/jCharts-0.7.5.jar
---------------------------------------------
location: class ognl.ObjectPropertyAccessor

/srv/gump/public/workspace/tapestry/tapestry-framework/src/java/org/apache/tapestry/listener/ListenerMapPropertyAccessor.java:[91,36] cannot find symbol
symbol  : method getCompiler()
location: class ognl.OgnlRuntime

/srv/gump/public/workspace/tapestry/tapestry-framework/src/java/org/apache/tapestry/listener/ListenerMapPropertyAccessor.java:[93,12] cannot find symbol
symbol  : variable ExpressionCompiler
location: class org.apache.tapestry.listener.ListenerMapPropertyAccessor

/srv/gump/public/workspace/tapestry/tapestry-framework/src/java/org/apache/tapestry/listener/ListenerMapPropertyAccessor.java:[95,19] cannot find symbol
symbol  : method setCurrentAccessor(java.lang.Class)
location: class ognl.OgnlContext

/srv/gump/public/workspace/tapestry/tapestry-framework/src/java/org/apache/tapestry/listener/ListenerMapPropertyAccessor.java:[96,19] cannot find symbol
symbol  : method setCurrentType(java.lang.Class)
location: class ognl.OgnlContext

/srv/gump/public/workspace/tapestry/tapestry-framework/src/java/org/apache/tapestry/listener/ListenerMapPropertyAccessor.java:[101,20] cannot find symbol
symbol  : method getSourceAccessor(ognl.OgnlContext,java.lang.Object,java.lang.Object)
location: class ognl.ObjectPropertyAccessor

/srv/gump/public/workspace/tapestry/tapestry-framework/src/java/org/apache/tapestry/listener/ListenerMapPropertyAccessor.java:[106,18] cannot find symbol
symbol  : class UnsupportedCompilationException
location: class org.apache.tapestry.listener.ListenerMapPropertyAccessor

/srv/gump/public/workspace/tapestry/tapestry-framework/src/java/org/apache/tapestry/services/impl/ExpressionEvaluatorImpl.java:[95,19] cannot find symbol
symbol  : method setCompiler(org.apache.tapestry.services.impl.HiveMindExpressionCompiler)
location: class ognl.OgnlRuntime

/srv/gump/public/workspace/tapestry/tapestry-framework/src/java/org/apache/tapestry/services/impl/ExpressionEvaluatorImpl.java:[109,16] cannot find symbol
symbol  : method getAccessor()
location: interface ognl.Node

/srv/gump/public/workspace/tapestry/tapestry-framework/src/java/org/apache/tapestry/services/impl/ExpressionEvaluatorImpl.java:[110,36] cannot find symbol
symbol  : method getAccessor()
location: interface ognl.Node

/srv/gump/public/workspace/tapestry/tapestry-framework/src/java/org/apache/tapestry/services/impl/ExpressionEvaluatorImpl.java:[246,23] cannot find symbol
symbol  : method clearCache()
location: class ognl.OgnlRuntime


[INFO] ------------------------------------------------------------------------
[INFO] For more information, run Maven with the -e switch
[INFO] ------------------------------------------------------------------------
[INFO] Total time: 1 minute 11 seconds
[INFO] Finished at: Fri Jan 02 03:35:51 GMT-08:00 2009
[INFO] Final Memory: 9M/45M
[INFO] ------------------------------------------------------------------------
---------------------------------------------

To subscribe to this information via syndicated feeds:
- RSS: http://vmgump.apache.org/gump/public/tapestry/tapestry/rss.xml
- Atom: http://vmgump.apache.org/gump/public/tapestry/tapestry/atom.xml

============================== Gump Tracking Only ===
Produced by Gump version 2.3.
Gump Run 21000002012009, vmgump:vmgump-public:21000002012009
Gump E-mail Identifier (unique within run) #38.

*********************************************************** G U M P
[GUMP@vmgump]: Project ws-commons-axiom (in module ws-axis2-commons) failed
To whom it may engage...
        
This is an automated request, but not an unsolicited one. For 
more information please visit http://gump.apache.org/nagged.html, 
and/or contact the folk at general@gump.apache.org.

Project ws-commons-axiom has an issue affecting its community integration.
This issue affects 1 projects,
 and has been outstanding for 32 runs.
The current state of this project is 'Failed', with reason 'Build Failed'.
For reference only, the following projects are affected by this:
    - ws-commons-axiom :  Common stuff for the WS projects.


Full details are available at:
    http://vmgump.apache.org/gump/public/ws-axis2-commons/ws-commons-axiom/index.html

That said, some information snippets are provided here.

The following annotations (debug/informational/warning/error messages) were provided:
 -DEBUG- (Gump generated) Maven2 Settings in: /srv/gump/public/workspace/ws-axis2-commons/axiom/gump_mvn_settings.xml
 -INFO- Failed with reason build failed
 -DEBUG- Maven POM in: /srv/gump/public/workspace/ws-axis2-commons/axiom/pom.xml
 -INFO- Failed to extract fallback artifacts from Gump Repository



The following work was performed:
http://vmgump.apache.org/gump/public/ws-axis2-commons/ws-commons-axiom/gump_work/build_ws-axis2-commons_ws-commons-axiom.html
Work Name: build_ws-axis2-commons_ws-commons-axiom (Type: Build)
Work ended in a state of : Failed
Elapsed: 25 secs
Command Line: mvn --batch-mode --settings /srv/gump/public/workspace/ws-axis2-commons/axiom/gump_mvn_settings.xml package 
[Working Directory: /srv/gump/public/workspace/ws-axis2-commons/axiom]
CLASSPATH: /usr/lib/jvm/java-1.5.0-sun/lib/tools.jar:/srv/gump/public/workspace/logging-log4j-12/dist/lib/log4j-02012009.jar:/srv/gump/packages/jaf-1.1ea/activation.jar:/srv/gump/packages/javamail-1.4/mail.jar:/srv/gump/packages/javamail-1.4/lib/mailapi.jar:/srv/gump/public/workspace/jaxen/target/jaxen-02012009.jar:/srv/gump/packages/jsse1.0.3/lib/jcert.jar:/srv/gump/packages/jsse1.0.3/lib/jnet.jar:/srv/gump/packages/jsse1.0.3/lib/jsse.jar:/srv/gump/packages/jms1.1/lib/jms.jar:/srv/gump/public/workspace/xml-commons/java/external/build/xml-apis-ext.jar:/srv/gump/public/workspace/xml-security/build/xmlsec-02012009.jar:/srv/gump/public/workspace/xmlunit/build/lib/xmlunit-02012009.jar:/srv/gump/public/workspace/junit/dist/junit-02012009.jar
---------------------------------------------
[INFO] Building jar: /srv/gump/public/workspace/ws-axis2-commons/axiom/modules/axiom-api/target/axiom-api-SNAPSHOT-tests.jar
[INFO] ------------------------------------------------------------------------
[INFO] Building Axiom Impl
[INFO]    task-segment: [package]
[INFO] ------------------------------------------------------------------------
Downloading: http://repo1.maven.org/maven2/org/codehaus/woodstox/wstx-asl/3.2.4/wstx-asl-3.2.4.pom
1K downloaded
Downloading: http://repo1.maven.org/maven2/org/codehaus/woodstox/wstx-asl/3.2.4/wstx-asl-3.2.4.jar
507K downloaded
[INFO] snapshot org.apache.ws.commons.axiom:axiom-api:SNAPSHOT: checking for updates from maven2
Downloading: http://repo1.maven.org/maven2/org/apache/ws/commons/axiom/axiom-api/SNAPSHOT/axiom-api-SNAPSHOT-tests.jar
[INFO] ------------------------------------------------------------------------
[ERROR] BUILD ERROR
[INFO] ------------------------------------------------------------------------
[INFO] Failed to resolve artifact.

Missing:
----------
1) org.apache.ws.commons.axiom:axiom-api:jar:tests:SNAPSHOT

  Try downloading the file manually from the project website.

  Then, install it using the command: 
      mvn install:install-file -DgroupId=org.apache.ws.commons.axiom -DartifactId=axiom-api -Dversion=SNAPSHOT -Dclassifier=tests -Dpackaging=jar -Dfile=/path/to/file

  Alternatively, if you host your own repository you can deploy the file there: 
      mvn deploy:deploy-file -DgroupId=org.apache.ws.commons.axiom -DartifactId=axiom-api -Dversion=SNAPSHOT -Dclassifier=tests -Dpackaging=jar -Dfile=/path/to/file -Durl=[url] -DrepositoryId=[id]

  Path to dependency: 
  	1) org.apache.ws.commons.axiom:axiom-impl:jar:SNAPSHOT
  	2) org.apache.ws.commons.axiom:axiom-api:jar:tests:SNAPSHOT

----------
1 required artifact is missing.

for artifact: 
  org.apache.ws.commons.axiom:axiom-impl:jar:SNAPSHOT

from the specified remote repositories:
  maven2 (http://repo1.maven.org/maven2),
  Gump (http://localhost:8192/maven2)


[INFO] ------------------------------------------------------------------------
[INFO] For more information, run Maven with the -e switch
[INFO] ------------------------------------------------------------------------
[INFO] Total time: 24 seconds
[INFO] Finished at: Fri Jan 02 03:36:22 GMT-08:00 2009
[INFO] Final Memory: 15M/27M
[INFO] ------------------------------------------------------------------------
---------------------------------------------

To subscribe to this information via syndicated feeds:
- RSS: http://vmgump.apache.org/gump/public/ws-axis2-commons/ws-commons-axiom/rss.xml
- Atom: http://vmgump.apache.org/gump/public/ws-axis2-commons/ws-commons-axiom/atom.xml

============================== Gump Tracking Only ===
Produced by Gump version 2.3.
Gump Run 21000002012009, vmgump:vmgump-public:21000002012009
Gump E-mail Identifier (unique within run) #39.

*********************************************************** G U M P
[GUMP@vmgump]: Project ws-commons-policy (in module ws-axis2-commons) failed
To whom it may engage...
        
This is an automated request, but not an unsolicited one. For 
more information please visit http://gump.apache.org/nagged.html, 
and/or contact the folk at general@gump.apache.org.

Project ws-commons-policy has an issue affecting its community integration.
This issue affects 1 projects,
 and has been outstanding for 587 runs.
The current state of this project is 'Failed', with reason 'Build Failed'.
For reference only, the following projects are affected by this:
    - ws-commons-policy :  Common stuff for the WS projects.


Full details are available at:
    http://vmgump.apache.org/gump/public/ws-axis2-commons/ws-commons-policy/index.html

That said, some information snippets are provided here.

The following annotations (debug/informational/warning/error messages) were provided:
 -DEBUG- Sole output [ws-commons-policy-02012009.jar] identifier set to project name
 -INFO- Optional dependency ws-commons-axiom failed with reason build failed
 -DEBUG- (Gump generated) Maven2 Settings in: /srv/gump/public/workspace/ws-axis2-commons/neethi/gump_mvn_settings.xml
 -INFO- Failed with reason build failed
 -DEBUG- Maven POM in: /srv/gump/public/workspace/ws-axis2-commons/neethi/pom.xml
 -INFO- Failed to extract fallback artifacts from Gump Repository



The following work was performed:
http://vmgump.apache.org/gump/public/ws-axis2-commons/ws-commons-policy/gump_work/build_ws-axis2-commons_ws-commons-policy.html
Work Name: build_ws-axis2-commons_ws-commons-policy (Type: Build)
Work ended in a state of : Failed
Elapsed: 6 secs
Command Line: mvn --batch-mode --settings /srv/gump/public/workspace/ws-axis2-commons/neethi/gump_mvn_settings.xml package 
[Working Directory: /srv/gump/public/workspace/ws-axis2-commons/neethi]
CLASSPATH: /usr/lib/jvm/java-1.5.0-sun/lib/tools.jar:/srv/gump/public/workspace/apache-commons/logging/target/commons-logging-02012009.jar:/srv/gump/public/workspace/apache-commons/logging/target/commons-logging-api-02012009.jar:/srv/gump/public/workspace/ws-axis2-commons/axiom/modules/axiom-api/target/axiom-api-SNAPSHOT.jar:/srv/gump/public/workspace/ws-axis2-commons/axiom/modules/axiom-impl/target/axiom-impl-SNAPSHOT.jar:/srv/gump/public/workspace/ws-axis2-commons/axiom/modules/axiom-dom/target/axiom-dom-SNAPSHOT.jar:/srv/gump/public/workspace/wsdl4j/build/lib/qname.jar:/srv/gump/public/workspace/wsdl4j/build/lib/wsdl4j.jar
---------------------------------------------

Missing:
----------
1) org.apache.ws.commons.axiom:axiom-api:jar:SNAPSHOT

  Try downloading the file manually from the project website.

  Then, install it using the command: 
      mvn install:install-file -DgroupId=org.apache.ws.commons.axiom -DartifactId=axiom-api -Dversion=SNAPSHOT -Dpackaging=jar -Dfile=/path/to/file

  Alternatively, if you host your own repository you can deploy the file there: 
      mvn deploy:deploy-file -DgroupId=org.apache.ws.commons.axiom -DartifactId=axiom-api -Dversion=SNAPSHOT -Dpackaging=jar -Dfile=/path/to/file -Durl=[url] -DrepositoryId=[id]

  Path to dependency: 
  	1) org.apache.neethi:neethi:jar:SNAPSHOT
  	2) org.apache.ws.commons.axiom:axiom-api:jar:SNAPSHOT

2) org.apache.ws.commons.axiom:axiom-impl:jar:SNAPSHOT

  Try downloading the file manually from the project website.

  Then, install it using the command: 
      mvn install:install-file -DgroupId=org.apache.ws.commons.axiom -DartifactId=axiom-impl -Dversion=SNAPSHOT -Dpackaging=jar -Dfile=/path/to/file

  Alternatively, if you host your own repository you can deploy the file there: 
      mvn deploy:deploy-file -DgroupId=org.apache.ws.commons.axiom -DartifactId=axiom-impl -Dversion=SNAPSHOT -Dpackaging=jar -Dfile=/path/to/file -Durl=[url] -DrepositoryId=[id]

  Path to dependency: 
  	1) org.apache.neethi:neethi:jar:SNAPSHOT
  	2) org.apache.ws.commons.axiom:axiom-impl:jar:SNAPSHOT

----------
2 required artifacts are missing.

for artifact: 
  org.apache.neethi:neethi:jar:SNAPSHOT

from the specified remote repositories:
  apache-ws-snapshots2 (http://ws.zones.apache.org/repository2),
  maven-central (http://repo1.maven.org/maven/),
  Gump (http://localhost:8192/maven2)


[INFO] ------------------------------------------------------------------------
[INFO] For more information, run Maven with the -e switch
[INFO] ------------------------------------------------------------------------
[INFO] Total time: 5 seconds
[INFO] Finished at: Fri Jan 02 03:39:31 GMT-08:00 2009
[INFO] Final Memory: 5M/10M
[INFO] ------------------------------------------------------------------------
---------------------------------------------

To subscribe to this information via syndicated feeds:
- RSS: http://vmgump.apache.org/gump/public/ws-axis2-commons/ws-commons-policy/rss.xml
- Atom: http://vmgump.apache.org/gump/public/ws-axis2-commons/ws-commons-policy/atom.xml

============================== Gump Tracking Only ===
Produced by Gump version 2.3.
Gump Run 21000002012009, vmgump:vmgump-public:21000002012009
Gump E-mail Identifier (unique within run) #41.

*********************************************************** G U M P
[GUMP@vmgump]: Project jetty (in module jetty) failed
To whom it may engage...
        
This is an automated request, but not an unsolicited one. For 
more information please visit http://gump.apache.org/nagged.html, 
and/or contact the folk at general@gump.apache.org.

Project jetty has an issue affecting its community integration.
This issue affects 4 projects,
 and has been outstanding for 601 runs.
The current state of this project is 'Failed', with reason 'Missing Build Outputs'.
For reference only, the following projects are affected by this:
    - apollo :  Apollo Project
    - jetty :  Java HTTP Servlet Server
    - jetty-test :  Java HTTP Servlet Server
    - muse :  Muse Project


Full details are available at:
    http://vmgump.apache.org/gump/public/jetty/jetty/index.html

That said, some information snippets are provided here.

The following annotations (debug/informational/warning/error messages) were provided:
 -INFO- Optional dependency slf4j failed with reason build failed
 -DEBUG- (Gump generated) Maven2 Settings in: /srv/gump/public/workspace/jetty/gump_mvn_settings.xml
 -DEBUG- Maven POM in: /srv/gump/public/workspace/jetty/pom.xml
 -INFO- Failed with reason missing build outputs
 -ERROR- Missing Output: /srv/gump/public/workspace/jetty/extra/jetty-rewrite/target/jetty-rewrite-7.0-SNAPSHOT.jar
 -ERROR- Missing Output: /srv/gump/public/workspace/jetty/plus/jetty-annotations/target/jetty-annotations-7.0-SNAPSHOT.jar
 -ERROR- Missing Output: /srv/gump/public/workspace/jetty/server/jetty-util/target/jetty-util-7.0-SNAPSHOT.jar
 -ERROR- Missing Output: /srv/gump/public/workspace/jetty/plus/jetty-jndi/target/jetty-jndi-7.0-SNAPSHOT.jar
 -ERROR- Missing Output: /srv/gump/public/workspace/jetty/extra/jetty-servlet/target/jetty-servlet-7.0-SNAPSHOT.jar
 -ERROR- Missing Output: /srv/gump/public/workspace/jetty/server/jetty-start/target/jetty-start-7.0-SNAPSHOT.jar
 -ERROR- Missing Output: /srv/gump/public/workspace/jetty/extra/jetty-threadpool/target/jetty-threadpool-7.0-SNAPSHOT.jar
 -ERROR- Missing Output: /srv/gump/public/workspace/jetty/extra/jetty-ajp/target/jetty-ajp-7.0-SNAPSHOT.jar
 -ERROR- Missing Output: /srv/gump/public/workspace/jetty/extra/jetty-html/target/jetty-html-7.0-SNAPSHOT.jar
 -ERROR- Missing Output: /srv/gump/public/workspace/jetty/plus/jetty-plus/target/jetty-plus-7.0-SNAPSHOT.jar
 -ERROR- Missing Output: /srv/gump/public/workspace/jetty/extra/jetty-client/target/jetty-client-7.0-SNAPSHOT.jar
 -ERROR- Missing Output: /srv/gump/public/workspace/jetty/plus/jetty-jmx/target/jetty-jmx-7.0-SNAPSHOT.jar
 -ERROR- Missing Output: /srv/gump/public/workspace/jetty/server/jetty-ssl/target/jetty-ssl-7.0-SNAPSHOT.jar
 -ERROR- Missing Output: /srv/gump/public/workspace/jetty/server/jetty/target/jetty-7.0-SNAPSHOT.jar
 -ERROR- No such directory (where output is expected) : /srv/gump/public/workspace/jetty/extra/jetty-rewrite/target
 -ERROR- No such directory (where output is expected) : /srv/gump/public/workspace/jetty/plus/jetty-annotations/target
 -ERROR- No such directory (where output is expected) : /srv/gump/public/workspace/jetty/server/jetty-util/target
 -ERROR- No such directory (where output is expected) : /srv/gump/public/workspace/jetty/plus/jetty-jndi/target
 -ERROR- No such directory (where output is expected) : /srv/gump/public/workspace/jetty/extra/jetty-servlet/target
 -ERROR- No such directory (where output is expected) : /srv/gump/public/workspace/jetty/server/jetty-start/target
 -ERROR- No such directory (where output is expected) : /srv/gump/public/workspace/jetty/extra/jetty-threadpool/target
 -ERROR- No such directory (where output is expected) : /srv/gump/public/workspace/jetty/extra/jetty-ajp/target
 -ERROR- No such directory (where output is expected) : /srv/gump/public/workspace/jetty/extra/jetty-html/target
 -ERROR- No such directory (where output is expected) : /srv/gump/public/workspace/jetty/plus/jetty-plus/target
 -ERROR- No such directory (where output is expected) : /srv/gump/public/workspace/jetty/extra/jetty-client/target
 -ERROR- No such directory (where output is expected) : /srv/gump/public/workspace/jetty/plus/jetty-jmx/target
 -ERROR- No such directory (where output is expected) : /srv/gump/public/workspace/jetty/server/jetty-ssl/target
 -ERROR- No such directory (where output is expected) : /srv/gump/public/workspace/jetty/server/jetty/target
 -INFO- Failed to extract fallback artifacts from Gump Repository



The following work was performed:
http://vmgump.apache.org/gump/public/jetty/jetty/gump_work/build_jetty_jetty.html
Work Name: build_jetty_jetty (Type: Build)
Work ended in a state of : Success
Elapsed: 4 mins 28 secs
Command Line: mvn --batch-mode -Dmaven.test.skip=true --settings /srv/gump/public/workspace/jetty/gump_mvn_settings.xml package 
[Working Directory: /srv/gump/public/workspace/jetty]
CLASSPATH: /usr/lib/jvm/java-1.5.0-sun/lib/tools.jar:/srv/gump/public/workspace/jetty/modules:/srv/gump/public/workspace/ant/dist/lib/ant-jmf.jar:/srv/gump/public/workspace/ant/dist/lib/ant-swing.jar:/srv/gump/public/workspace/ant/dist/lib/ant-apache-resolver.jar:/srv/gump/public/workspace/ant/dist/lib/ant-apache-xalan2.jar:/srv/gump/public/workspace/ant/dist/lib/ant-trax.jar:/srv/gump/public/workspace/ant/dist/lib/ant-junit.jar:/srv/gump/public/workspace/ant/dist/lib/ant-launcher.jar:/srv/gump/public/workspace/ant/dist/lib/ant-nodeps.jar:/srv/gump/public/workspace/ant/dist/lib/ant.jar:/srv/gump/packages/bsh-2.0b4/bsh-commands-2.0b4.jar:/srv/gump/packages/bsh-2.0b4/bsh-classpath-2.0b4.jar:/srv/gump/packages/bsh-2.0b4/bsh-core-2.0b4.jar:/srv/gump/packages/bsh-2.0b4/bsh-bsf-2.0b4.jar:/srv/gump/packages/bsh-2.0b4/bsh-2.0b4.jar:/srv/gump/packages/bsh-2.0b4/bsh-reflect-2.0b4.jar:/srv/gump/packages/bsh-2.0b4/bsh-util-2.0b4.jar:/srv/gump/public/workspace/apache-commons/beanutils/dis
 t/commons-beanutils-02012009.jar:/srv/gump/public/workspace/apache-commons/digester/dist/commons-digester.jar:/srv/gump/packages/commons-el-1.0/commons-el.jar:/srv/gump/public/workspace/httpcomponents/oac.hc3x/dist/commons-httpclient.jar:/srv/gump/packages/jaf-1.1ea/activation.jar:/srv/gump/public/workspace/jakarta-servletapi-5/jsr154/dist/lib/servlet-api.jar:/srv/gump/packages/javamail-1.4/mail.jar:/srv/gump/packages/javamail-1.4/lib/mailapi.jar:/srv/gump/packages/jtidy-04aug2000r7-dev/build/Tidy.jar:/srv/gump/public/workspace/junit/dist/junit-02012009.jar:/srv/gump/public/workspace/mx4j/dist/lib/mx4j-impl.jar:/srv/gump/public/workspace/mx4j/dist/lib/mx4j-jmx.jar:/srv/gump/public/workspace/mx4j/dist/lib/mx4j.jar:/srv/gump/public/workspace/mx4j/tools-dist/lib/mx4j-tools.jar:log4j-over-slf4j-gump-31122008.jar:slf4j-ext-gump-31122008.jar:slf4j-migrator-gump-31122008.jar:slf4j-nop-gump-31122008.jar:jcl104-over-slf4j-gump-31122008.jar:jcl-over-slf4j-gump-31122008.jar:slf4j-simpl
 e-gump-31122008.jar:slf4j-jdk14-gump-31122008.jar:slf4j-api-gump-31122008.jar:slf4j-log4j12-gump-31122008.jar:jul-to-slf4j-gump-31122008.jar:slf4j-jcl-gump-31122008.jar:/srv/gump/public/workspace/jakarta-slide/webdavclient/dist/lib/jakarta-slide-webdavlib-02012009.jar:/srv/gump/public/workspace/xml-commons/java/external/build/xml-apis-ext.jar
---------------------------------------------
[INFO] ------------------------------------------------------------------------
[INFO] Jetty :: Project ...................................... SUCCESS [10.337s]
[INFO] Jetty :: Server Modules ............................... SUCCESS [0.014s]
[INFO] Jetty :: Utilities .................................... SUCCESS [10.244s]
[INFO] Jetty :: Server Core .................................. SUCCESS [20.477s]
[INFO] Jetty :: XML utilities ................................ SUCCESS [2.451s]
[INFO] Jetty :: Security ..................................... SUCCESS [2.184s]
[INFO] Jetty :: SSL Engine ................................... SUCCESS [3.419s]
[INFO] Jetty :: Webapp Application Support ................... SUCCESS [1.749s]
[INFO] Jetty :: Deployers .................................... SUCCESS [1.756s]
[INFO] Jetty :: Start ........................................ SUCCESS [1.132s]
[INFO] Jetty :: JSP Modules .................................. SUCCESS [0.249s]
[INFO] Glassfish :: Jasper JSP 2.1 ........................... SUCCESS [9.217s]
[INFO] Jetty Plus :: Plus Modules ............................ SUCCESS [0.014s]
[INFO] Jetty Plus :: JMX Management .......................... SUCCESS [1.320s]
[INFO] Jetty Plus :: JNDI Naming ............................. SUCCESS [1.753s]
[INFO] Jetty Plus :: Plus .................................... SUCCESS [46.614s]
[INFO] Jetty Plus :: Servlet Annotations ..................... SUCCESS [7.199s]
[INFO] Jetty Extra :: Extra Modules .......................... SUCCESS [0.014s]
[INFO] Jetty Extra :: Servlet Tester ......................... SUCCESS [0.879s]
[INFO] Jetty Extra :: Rewrite Handler ........................ SUCCESS [1.118s]
[INFO] Jetty Extra :: Asynchronous HTTP Client ............... SUCCESS [2.393s]
[INFO] Jetty Extra :: HTML ................................... SUCCESS [1.286s]
[INFO] Jetty Extra :: Utility Servlets and Filters ........... SUCCESS [2.033s]
[INFO] Jetty Extra :: AJP .................................... SUCCESS [1.718s]
[INFO] Jetty Extra :: Java5 Threadpool ....................... SUCCESS [0.639s]
[INFO] Jetty Extra :: Maven JSPC Plugin ...................... SUCCESS [40.668s]
[INFO] Jetty Extra :: Maven Plugin ........................... SUCCESS [5.683s]
[INFO] Jetty Extra :: Maven Jetty Plugin :: Stub ............. SUCCESS [0.021s]
[INFO] Cometd :: Jetty ....................................... SUCCESS [0.013s]
[INFO] Cometd :: Jetty :: Servlet ............................ SUCCESS [3.457s]
[INFO] Cometd :: Jetty :: Client ............................. SUCCESS [1.058s]
[INFO] Cometd :: Jetty :: Demo ............................... SUCCESS [25.365s]
[INFO] Cometd :: Jetty :: Install ............................ SUCCESS [0.014s]
[INFO] Jetty Example :: Parent ............................... SUCCESS [0.011s]
[INFO] Jetty Example :: Async Rest Webapp .................... SUCCESS [1.312s]
[INFO] Jetty Example :: JAAS Test Webapp ..................... SUCCESS [1.575s]
[INFO] Jetty Example :: Annotations Test Webapp .............. SUCCESS [1.713s]
[INFO] Jetty Example :: Embedded ............................. SUCCESS [1.376s]
[INFO] Jetty Example :: Webapp Example ....................... SUCCESS [4.699s]
[INFO] Jetty Example :: Extra Webapp tests ................... SUCCESS [0.142s]
[INFO] Jetty Example :: JNDI Test Webapp ..................... SUCCESS [0.783s]
[INFO] ------------------------------------------------------------------------
[INFO] ------------------------------------------------------------------------
[INFO] BUILD SUCCESSFUL
[INFO] ------------------------------------------------------------------------
[INFO] Total time: 4 minutes 26 seconds
[INFO] Finished at: Fri Jan 02 03:58:24 GMT-08:00 2009
[INFO] Final Memory: 50M/63M
[INFO] ------------------------------------------------------------------------
---------------------------------------------

To subscribe to this information via syndicated feeds:
- RSS: http://vmgump.apache.org/gump/public/jetty/jetty/rss.xml
- Atom: http://vmgump.apache.org/gump/public/jetty/jetty/atom.xml

============================== Gump Tracking Only ===
Produced by Gump version 2.3.
Gump Run 21000002012009, vmgump:vmgump-public:21000002012009
Gump E-mail Identifier (unique within run) #43.

*********************************************************** G U M P
[GUMP@vmgump]: Module smartfrog success, but with warnings.
To whom it may engage...
        
This is an automated request, but not an unsolicited one. For 
more information please visit http://gump.apache.org/nagged.html, 
and/or contact the folk at general@gump.apache.org.

Module smartfrog contains errors.
The current state of this module is 'Success'.

Full details are available at:
    http://vmgump.apache.org/gump/public/smartfrog/index.html

That said, some information snippets are provided here.

The following annotations (debug/informational/warning/error messages) were provided:
 -ERROR- *** Failed to update from source control. Stale contents ***



The following work was performed:
http://vmgump.apache.org/gump/public/smartfrog/gump_work/update_smartfrog.html
Work Name: update_smartfrog (Type: Update)
Work ended in a state of : Failed
Elapsed: 
Command Line: svn --quiet update --non-interactive smartfrog 
[Working Directory: /srv/gump/public/workspace/cvs]
---------------------------------------------
svn: Working copy 'smartfrog' locked
svn: run 'svn cleanup' to remove locks (type 'svn help cleanup' for details)
---------------------------------------------

To subscribe to this information via syndicated feeds:
- RSS: http://vmgump.apache.org/gump/public/smartfrog/rss.xml
- Atom: http://vmgump.apache.org/gump/public/smartfrog/atom.xml

============================== Gump Tracking Only ===
Produced by Gump version 2.3.
Gump Run 21000002012009, vmgump:vmgump-public:21000002012009
Gump E-mail Identifier (unique within run) #45.

*********************************************************** G U M P
[GUMP@vmgump]: Project mina (in module mina) failed
To whom it may engage...
        
This is an automated request, but not an unsolicited one. For 
more information please visit http://gump.apache.org/nagged.html, 
and/or contact the folk at general@gump.apache.org.

Project mina has an issue affecting its community integration.
This issue affects 2 projects,
 and has been outstanding for 601 runs.
The current state of this project is 'Failed', with reason 'Build Failed'.
For reference only, the following projects are affected by this:
    - ldap-protocol :  Apache Directory Server
    - mina :  A Multipurpose Infrastrusture for Network Applications


Full details are available at:
    http://vmgump.apache.org/gump/public/mina/mina/index.html

That said, some information snippets are provided here.

The following annotations (debug/informational/warning/error messages) were provided:
 -INFO- Optional dependency slf4j failed with reason build failed
 -DEBUG- (Gump generated) Maven2 Settings in: /srv/gump/public/workspace/mina/gump_mvn_settings.xml
 -INFO- Failed with reason build failed
 -DEBUG- Maven POM in: /srv/gump/public/workspace/mina/pom.xml
 -INFO- Project Reports in: /srv/gump/public/workspace/mina/target/test-reports
 -WARNING- No directory [/srv/gump/public/workspace/mina/target/test-reports]
 -INFO- Failed to extract fallback artifacts from Gump Repository



The following work was performed:
http://vmgump.apache.org/gump/public/mina/mina/gump_work/build_mina_mina.html
Work Name: build_mina_mina (Type: Build)
Work ended in a state of : Failed
Elapsed: 33 secs
Command Line: mvn --batch-mode -Dmaven.final.name=mina-02012009 --settings /srv/gump/public/workspace/mina/gump_mvn_settings.xml package 
[Working Directory: /srv/gump/public/workspace/mina]
CLASSPATH: /usr/lib/jvm/java-1.5.0-sun/lib/tools.jar:/srv/gump/public/workspace/ant/dist/lib/ant-jmf.jar:/srv/gump/public/workspace/ant/dist/lib/ant-swing.jar:/srv/gump/public/workspace/ant/dist/lib/ant-apache-resolver.jar:/srv/gump/public/workspace/ant/dist/lib/ant-apache-xalan2.jar:/srv/gump/public/workspace/ant/dist/lib/ant-trax.jar:/srv/gump/public/workspace/ant/dist/lib/ant-junit.jar:/srv/gump/public/workspace/ant/dist/lib/ant-launcher.jar:/srv/gump/public/workspace/ant/dist/lib/ant-nodeps.jar:/srv/gump/public/workspace/ant/dist/lib/ant.jar:/srv/gump/packages/cglib/cglib-nodep-2.1_3.jar:/srv/gump/public/workspace/apache-commons/net/dist/commons-net-02012009.jar:/srv/gump/packages/easymock1.2_Java1.3/easymock.jar:/srv/gump/packages/easymockclassextension1.2/easymockclassextension.jar:/srv/gump/packages/emma-2.0.5312/lib/emma.jar:/srv/gump/packages/emma-2.0.5312/lib/emma_ant.jar:/srv/gump/public/workspace/junit/dist/junit-02012009.jar:/srv/gump/public/workspace/maven-emma-
 plugin/target/maven-emma-plugin-02012009.jar:/srv/gump/packages/maven-site-plugin/maven-site-plugin-1.6.1.jar:slf4j-simple-gump-31122008.jar:/srv/gump/packages/spring-framework-1.2.6/dist/spring-beans.jar:/srv/gump/packages/spring-framework-1.2.6/dist/spring-core.jar:/srv/gump/packages/jsse1.0.3/lib/jcert.jar:/srv/gump/packages/jsse1.0.3/lib/jnet.jar:/srv/gump/packages/jsse1.0.3/lib/jsse.jar:/srv/gump/public/workspace/ant-contrib/target/ant-contrib-02012009.jar
---------------------------------------------
Downloading: http://localhost:8192/maven2/com/agical/rmock/parent/2.0.0/parent-2.0.0.pom
2K downloaded
Downloading: http://localhost:8192/maven2/cglib/cglib-nodep/2.1_2/cglib-nodep-2.1_2.pom
214b downloaded
Downloading: http://localhost:8192/maven2/org/slf4j/jcl-over-slf4j/1.5.2/jcl-over-slf4j-1.5.2.jar
16K downloaded
Downloading: http://localhost:8192/maven2/org/easymock/easymock/2.3/easymock-2.3.jar
69K downloaded
Downloading: http://localhost:8192/maven2/org/easymock/easymockclassextension/2.3/easymockclassextension-2.3.jar
50K downloaded
Downloading: http://localhost:8192/maven2/com/agical/rmock/rmock/2.0.0/rmock-2.0.0.jar
194K downloaded
Downloading: http://localhost:8192/maven2/ant-contrib/ant-contrib/1.0b2/ant-contrib-1.0b2.pom
729b downloaded
Downloading: http://localhost:8192/maven2/ant/ant/1.5/ant-1.5.pom
138b downloaded
Downloading: http://localhost:8192/maven2/ant-contrib/ant-contrib/1.0b2/ant-contrib-1.0b2.jar
229K downloaded
[INFO] [antrun:run {execution: add-license}]
[INFO] Executing tasks
[INFO] Executed tasks
[INFO] ------------------------------------------------------------------------
[INFO] Building Apache MINA Core
[INFO]    task-segment: [package]
[INFO] ------------------------------------------------------------------------
[INFO] [resources:resources]
[INFO] Using default encoding to copy filtered resources.
[INFO] [compiler:compile]
[INFO] Compiling 283 source files to /srv/gump/public/workspace/mina/core/target/classes
[INFO] [resources:testResources]
[INFO] Using default encoding to copy filtered resources.
[INFO] [compiler:testCompile]
[INFO] Compiling 50 source files to /srv/gump/public/workspace/mina/core/target/test-classes
[INFO] ------------------------------------------------------------------------
[ERROR] BUILD FAILURE
[INFO] ------------------------------------------------------------------------
[INFO] Compilation failure

/srv/gump/public/workspace/mina/core/src/test/java/org/apache/mina/filter/logging/MdcInjectionFilterTest.java:[382,9] method does not override a method from its superclass

/srv/gump/public/workspace/mina/core/src/test/java/org/apache/mina/filter/logging/MdcInjectionFilterTest.java:[387,9] method does not override a method from its superclass


[INFO] ------------------------------------------------------------------------
[INFO] For more information, run Maven with the -e switch
[INFO] ------------------------------------------------------------------------
[INFO] Total time: 31 seconds
[INFO] Finished at: Fri Jan 02 04:14:39 GMT-08:00 2009
[INFO] Final Memory: 13M/41M
[INFO] ------------------------------------------------------------------------
---------------------------------------------

To subscribe to this information via syndicated feeds:
- RSS: http://vmgump.apache.org/gump/public/mina/mina/rss.xml
- Atom: http://vmgump.apache.org/gump/public/mina/mina/atom.xml

============================== Gump Tracking Only ===
Produced by Gump version 2.3.
Gump Run 21000002012009, vmgump:vmgump-public:21000002012009
Gump E-mail Identifier (unique within run) #46.

*********************************************************** G U M P
[GUMP@vmgump]: Project cocoon (in module cocoon) failed
To whom it may engage...
        
This is an automated request, but not an unsolicited one. For 
more information please visit http://gump.apache.org/nagged.html, 
and/or contact the folk at general@gump.apache.org.

Project cocoon has an issue affecting its community integration.
This issue affects 1 projects,
 and has been outstanding for 610 runs.
The current state of this project is 'Failed', with reason 'Build Failed'.
For reference only, the following projects are affected by this:
    - cocoon :  Java XML Framework


Full details are available at:
    http://vmgump.apache.org/gump/public/cocoon/cocoon/index.html

That said, some information snippets are provided here.

The following annotations (debug/informational/warning/error messages) were provided:
 -INFO- Optional dependency commons-configuration failed with reason missing build outputs
 -INFO- Optional dependency htmlunit prerequisite failed with reason build failed
 -DEBUG- (Gump generated) Maven2 Settings in: /srv/gump/public/workspace/cocoon/gump_mvn_settings.xml
 -INFO- Failed with reason build failed
 -DEBUG- Maven POM in: /srv/gump/public/workspace/cocoon/pom.xml



The following work was performed:
http://vmgump.apache.org/gump/public/cocoon/cocoon/gump_work/build_cocoon_cocoon.html
Work Name: build_cocoon_cocoon (Type: Build)
Work ended in a state of : Failed
Elapsed: 55 secs
Command Line: mvn --batch-mode --settings /srv/gump/public/workspace/cocoon/gump_mvn_settings.xml package 
[Working Directory: /srv/gump/public/workspace/cocoon]
CLASSPATH: /usr/lib/jvm/java-1.5.0-sun/lib/tools.jar:/srv/gump/public/workspace/junit/dist/junit-02012009.jar:/srv/gump/public/workspace/apache-commons/lang/commons-lang-02012009.jar:/srv/gump/public/workspace/ant/dist/lib/ant-jmf.jar:/srv/gump/public/workspace/ant/dist/lib/ant-swing.jar:/srv/gump/public/workspace/ant/dist/lib/ant-apache-resolver.jar:/srv/gump/public/workspace/ant/dist/lib/ant-apache-xalan2.jar:/srv/gump/public/workspace/ant/dist/lib/ant-trax.jar:/srv/gump/public/workspace/ant/dist/lib/ant-junit.jar:/srv/gump/public/workspace/ant/dist/lib/ant-launcher.jar:/srv/gump/public/workspace/ant/dist/lib/ant-nodeps.jar:/srv/gump/public/workspace/ant/dist/lib/ant.jar:/srv/gump/public/workspace/aopalliance/build/aopalliance.jar:/srv/gump/packages/bsh-2.0b4/bsh-commands-2.0b4.jar:/srv/gump/packages/bsh-2.0b4/bsh-classpath-2.0b4.jar:/srv/gump/packages/bsh-2.0b4/bsh-core-2.0b4.jar:/srv/gump/packages/bsh-2.0b4/bsh-bsf-2.0b4.jar:/srv/gump/packages/bsh-2.0b4/bsh-2.0b4.jar:/srv
 /gump/packages/bsh-2.0b4/bsh-reflect-2.0b4.jar:/srv/gump/packages/bsh-2.0b4/bsh-util-2.0b4.jar:/srv/gump/public/workspace/apache-commons/beanutils/dist/commons-beanutils-02012009.jar:/srv/gump/public/workspace/apache-commons/codec/dist/commons-codec-02012009.jar:/srv/gump/public/workspace/apache-commons/collections/build/commons-collections-02012009.jar:/srv/gump/public/workspace/apache-commons/configuration/target/commons-configuration-1.6-SNAPSHOT.jar:/srv/gump/public/workspace/apache-commons/digester/dist/commons-digester.jar:/srv/gump/public/workspace/httpcomponents/oac.hc3x/dist/commons-httpclient.jar:/srv/gump/public/workspace/apache-commons/io/target/commons-io-02012009.jar:/srv/gump/public/workspace/apache-commons/jexl/dist/commons-jexl-02012009.jar:/srv/gump/public/workspace/apache-commons/jxpath/dist/commons-jxpath.jar:/srv/gump/public/workspace/apache-commons/logging/target/commons-logging-02012009.jar:/srv/gump/public/workspace/apache-commons/logging/target/commo
 ns-logging-api-02012009.jar:/srv/gump/public/workspace/apache-commons/validator/dist/commons-validator-02012009.jar:/srv/gump/packages/dougLea/concurrent.jar:/srv/gump/public/workspace/dom4j/build/dom4j.jar:/srv/gump/public/workspace/excalibur/components/datasource/target/excalibur-datasource-02012009.jar:/srv/gump/public/workspace/excalibur/components/pool/instrumented/target/excalibur-pool-instrumented-02012009.jar:/srv/gump/public/workspace/hsqldb/lib/hsqldb.jar:/srv/gump/public/workspace/htmlunit/target/htmlunit-02012009.jar:/srv/gump/public/workspace/jakarta-oro/jakarta-oro-02012009.jar:/srv/gump/public/workspace/jakarta-regexp/build/jakarta-regexp-02012009.jar:/srv/gump/public/workspace/jaxen/target/jaxen-02012009.jar:/srv/gump/public/workspace/jdom/build/jdom.jar:/srv/gump/public/workspace/jmock/build/dist/jmock-core-02012009.jar:/srv/gump/public/workspace/jmock/build/dist/jmock-cglib-02012009.jar:/srv/gump/packages/jtidy-04aug2000r7-dev/build/Tidy.jar:/srv/gump/publi
 c/workspace/logging-log4j-12/dist/lib/log4j-02012009.jar:/srv/gump/packages/nekohtml-0.9.5/nekohtml.jar:/srv/gump/public/workspace/rhino/build/rhino_02012009/js.jar:/srv/gump/public/workspace/velocity-engine/bin/velocity-02012009.jar:/srv/gump/public/workspace/velocity-engine/bin/velocity-02012009-dep.jar:/srv/gump/public/workspace/xml-commons/java/external/build/xml-apis-ext.jar:/srv/gump/public/workspace/xml-commons/java/external/build/xml-apis.jar:/srv/gump/public/workspace/xml-batik/batik-02012009/lib/batik-util.jar:/srv/gump/public/workspace/xml-batik/batik-02012009/lib/batik-swing.jar:/srv/gump/public/workspace/xml-batik/batik-02012009/lib/batik-css.jar:/srv/gump/public/workspace/xml-batik/batik-02012009/lib/batik-bridge.jar:/srv/gump/public/workspace/xml-batik/batik-02012009/lib/batik-xml.jar:/srv/gump/public/workspace/xml-batik/batik-02012009/lib/batik-svg-dom.jar:/srv/gump/public/workspace/xml-batik/batik-02012009/lib/batik-awt-util.jar:/srv/gump/public/workspace/xm
 l-batik/batik-02012009/lib/batik-transcoder.jar:/srv/gump/public/workspace/xml-batik/batik-02012009/lib/batik-gui-util.jar:/srv/gump/public/workspace/xml-batik/batik-02012009/lib/batik-dom.jar:/srv/gump/public/workspace/xml-batik/batik-02012009/lib/batik-ext.jar:/srv/gump/public/workspace/xml-batik/batik-02012009/lib/batik-script.jar:/srv/gump/public/workspace/xml-batik/batik-02012009/lib/batik-svggen.jar:/srv/gump/public/workspace/xml-batik/batik-02012009/lib/batik-parser.jar:/srv/gump/public/workspace/xml-batik/batik-02012009/lib/batik-extension.jar:/srv/gump/public/workspace/xml-batik/batik-02012009/lib/batik-gvt.jar:/srv/gump/public/workspace/xml-fop/build/fop.jar:/srv/gump/public/workspace/xml-commons/java/build/resolver.jar:/srv/gump/public/workspace/xml-xerces2/build/xercesImpl.jar:/srv/gump/public/workspace/xmlunit/build/lib/xmlunit-02012009.jar:/srv/gump/public/workspace/xom/build/xom-02012009.jar
---------------------------------------------
[INFO] Scanning for projects...
Downloading: http://localhost:8192/maven2/org/apache/apache/4/apache-4.pom
4K downloaded
Downloading: http://localhost:8192/maven2/org/apache/cocoon/cocoon-blocks-modules/6/cocoon-blocks-modules-6.pom
10K downloaded
Downloading: http://localhost:8192/maven2/org/apache/cocoon/cocoon/6/cocoon-6.pom
128K downloaded
Downloading: http://localhost:8192/maven2/org/apache/cocoon/cocoon-core-modules/5/cocoon-core-modules-5.pom
7K downloaded
Downloading: http://localhost:8192/maven2/org/apache/cocoon/cocoon/5/cocoon-5.pom
123K downloaded
[INFO] ------------------------------------------------------------------------
[ERROR] BUILD FAILURE
[INFO] ------------------------------------------------------------------------
[INFO] Project 'org.apache.cocoon:cocoon-xml-util' is duplicated in the reactor
[INFO] ------------------------------------------------------------------------
[INFO] For more information, run Maven with the -e switch
[INFO] ------------------------------------------------------------------------
[INFO] Total time: 53 seconds
[INFO] Finished at: Fri Jan 02 05:27:08 GMT-08:00 2009
[INFO] Final Memory: 26M/48M
[INFO] ------------------------------------------------------------------------
---------------------------------------------

To subscribe to this information via syndicated feeds:
- RSS: http://vmgump.apache.org/gump/public/cocoon/cocoon/rss.xml
- Atom: http://vmgump.apache.org/gump/public/cocoon/cocoon/atom.xml

============================== Gump Tracking Only ===
Produced by Gump version 2.3.
Gump Run 21000002012009, vmgump:vmgump-public:21000002012009
Gump E-mail Identifier (unique within run) #52.


--
Apache Gump
http://gump.apache.org/ [Instance: vmgump]

---------------------------------------------------------------------
To unsubscribe, e-mail: general-unsubscribe@gump.apache.org
For additional commands, e-mail: general-help@gump.apache.org


Mime
View raw message