gump-general mailing list archives

Site index · List index
Message view « Date » · « Thread »
Top « Date » · « Thread »
From g...@vmgump.apache.org
Subject BATCH: All dressed up, with nowhere to go...
Date Thu, 24 Apr 2008 01:01:45 GMT
Dear Gumpmeisters,
            
The following 2 notifys should have been sent

*********************************************************** G U M P
[GUMP@vmgump]: Project asn1-codec (in module directory-shared) failed
[GUMP@vmgump]: Project asn1 (in module directory-shared) failed
*********************************************************** G U M P
[GUMP@vmgump]: Project asn1-codec (in module directory-shared) failed
To whom it may engage...
        
This is an automated request, but not an unsolicited one. For 
more information please visit http://gump.apache.org/nagged.html, 
and/or contact the folk at general@gump.apache.org.

Project asn1-codec has an issue affecting its community integration.
This issue affects 4 projects.
The current state of this project is 'Failed', with reason 'Build Failed'.
For reference only, the following projects are affected by this:
    - apacheds-core :  Apache Directory Server
    - apacheds-main :  Apache Directory Server
    - asn1-codec :  Apache ASN.1 Tools
    - ldap-protocol :  Apache Directory Server


Full details are available at:
    http://vmgump.apache.org/gump/public/directory-shared/asn1-codec/index.html

That said, some information snippets are provided here.

The following annotations (debug/informational/warning/error messages) were provided:
 -DEBUG- Sole output [shared-asn1-codec-0.9.11-SNAPSHOT.jar] identifier set to project name
 -DEBUG- (Gump generated) Maven2 Settings in: /srv/gump/public/workspace/directory-shared/asn1-codec/gump_mvn_settings.xml
 -INFO- Failed with reason build failed
 -DEBUG- Maven POM in: /srv/gump/public/workspace/directory-shared/asn1-codec/pom.xml
 -INFO- Failed to extract fallback artifacts from Gump Repository



The following work was performed:
http://vmgump.apache.org/gump/public/directory-shared/asn1-codec/gump_work/build_directory-shared_asn1-codec.html
Work Name: build_directory-shared_asn1-codec (Type: Build)
Work ended in a state of : Failed
Elapsed: 51 secs
Command Line: mvn --settings /srv/gump/public/workspace/directory-shared/asn1-codec/gump_mvn_settings.xml
package 
[Working Directory: /srv/gump/public/workspace/directory-shared/asn1-codec]
CLASSPATH: /usr/lib/jvm/java-1.5.0-sun/lib/tools.jar:/srv/gump/public/workspace/apache-commons/collections/build/commons-collections-23042008.jar:/srv/gump/public/workspace/apache-commons/lang/commons-lang-23042008.jar:/srv/gump/public/workspace/junit/dist/junit-23042008.jar:/srv/gump/public/workspace/logging-log4j-12/dist/lib/log4j-23042008.jar:/srv/gump/public/workspace/velocity-engine/bin/velocity-23042008.jar:/srv/gump/public/workspace/velocity-engine/bin/velocity-dep-23042008.jar
---------------------------------------------
4/4K
4/4K
4K downloaded
Downloading: http://vm094.oxylos.org/mirror-maven2//org/codehaus/plexus/plexus-utils/1.4.1/plexus-utils-1.4.1.jar
Downloading: http://localhost:8192/maven2/org/codehaus/plexus/plexus-utils/1.4.1/plexus-utils-1.4.1.jar
4/184K
8/184K
12/184K
16/184K
20/184K
24/184K
28/184K
32/184K
32/184K
36/184K
40/184K
44/184K
48/184K
52/184K
56/184K
60/184K
64/184K
65/184K
69/184K
73/184K
77/184K
81/184K
85/184K
89/184K
93/184K
97/184K
98/184K
102/184K
106/184K
110/184K
114/184K
118/184K
122/184K
126/184K
130/184K
131/184K
135/184K
139/184K
143/184K
147/184K
151/184K
155/184K
159/184K
163/184K
167/184K
171/184K
175/184K
179/184K
183/184K
184/184K
184K downloaded
Downloading: http://vm094.oxylos.org/mirror-maven2//velocity/velocity-dep/1.4/velocity-dep-1.4.jar
Downloading: http://localhost:8192/maven2/velocity/velocity-dep/1.4/velocity-dep-1.4.jar
4/761K
8/761K
12/761K
16/761K
20/761K
24/761K
28/761K
32/761K
36/761K
40/761K
44/761K
48/761K
52/761K
56/761K
60/761K
64/761K
68/761K
72/761K
76/761K
80/761K
84/761K
88/761K
92/761K
96/761K
100/761K
104/761K
108/761K
112/761K
116/761K
120/761K
124/761K
128/761K
132/761K
136/761K
140/761K
144/761K
148/761K
152/761K
156/761K
160/761K
164/761K
168/761K
172/761K
176/761K
180/761K
184/761K
188/761K
192/761K
196/761K
200/761K
204/761K
208/761K
212/761K
216/761K
220/761K
224/761K
228/761K
232/761K
236/761K
240/761K
244/761K
248/761K
252/761K
256/761K
260/761K
264/761K
268/761K
272/761K
276/761K
280/761K
284/761K
288/761K
292/761K
296/761K
300/761K
304/761K
308/761K
312/761K
316/761K
320/761K
324/761K
328/761K
332/761K
336/761K
340/761K
344/761K
348/761K
352/761K
356/761K
360/761K
364/761K
368/761K
372/761K
376/761K
380/761K
384/761K
388/761K
392/761K
396/761K
400/761K
404/761K
408/761K
412/761K
416/761K
420/761K
424/761K
428/761K
432/761K
436/761K
440/761K
444/761K
448/761K
452/761K
456/761K
460/761K
464/761K
468/761K
472/761K
476/761K
480/761K
484/761K
488/761K
492/761K
496/761K
500/761K
504/761K
508/761K
512/761K
516/761K
520/761K
524/761K
528/761K
532/761K
536/761K
540/761K
544/761K
548/761K
552/761K
556/761K
560/761K
564/761K
568/761K
572/761K
576/761K
580/761K
584/761K
588/761K
592/761K
596/761K
600/761K
604/761K
608/761K
612/761K
616/761K
620/761K
624/761K
628/761K
632/761K
636/761K
640/761K
644/761K
648/761K
652/761K
656/761K
660/761K
664/761K
668/761K
672/761K
676/761K
680/761K
684/761K
688/761K
692/761K
696/761K
700/761K
704/761K
708/761K
712/761K
716/761K
720/761K
724/761K
728/761K
732/761K
736/761K
740/761K
744/761K
748/761K
752/761K
756/761K
760/761K
761/761K
761K downloaded
Downloading: http://vm094.oxylos.org/mirror-maven2//org/apache/maven/shared/maven-common-artifact-filters/1.0/maven-common-artifact-filters-1.0.jar
Downloading: http://localhost:8192/maven2/org/apache/maven/shared/maven-common-artifact-filters/1.0/maven-common-artifact-filters-1.0.jar
4/26K
8/26K
12/26K
16/26K
20/26K
24/26K
26/26K
26K downloaded
Downloading: http://vm094.oxylos.org/mirror-maven2//org/apache/maven/shared/maven-plugin-testing-harness/1.1/maven-plugin-testing-harness-1.1.jar
Downloading: http://localhost:8192/maven2/org/apache/maven/shared/maven-plugin-testing-harness/1.1/maven-plugin-testing-harness-1.1.jar
4/31K
8/31K
12/31K
16/31K
20/31K
24/31K
28/31K
31/31K
31K downloaded
Downloading: http://vm094.oxylos.org/mirror-maven2//org/apache/maven/shared/maven-downloader/1.1/maven-downloader-1.1.jar
Downloading: http://localhost:8192/maven2/org/apache/maven/shared/maven-downloader/1.1/maven-downloader-1.1.jar
4/6K
6/6K
6K downloaded
Downloading: http://vm094.oxylos.org/mirror-maven2//org/codehaus/plexus/plexus-velocity/1.1.3/plexus-velocity-1.1.3.jar
Downloading: http://localhost:8192/maven2/org/codehaus/plexus/plexus-velocity/1.1.3/plexus-velocity-1.1.3.jar
4/7K
7/7K
7K downloaded
Downloading: http://vm094.oxylos.org/mirror-maven2//commons-collections/commons-collections/2.0/commons-collections-2.0.jar
Downloading: http://localhost:8192/maven2/commons-collections/commons-collections/2.0/commons-collections-2.0.jar
4/559K
8/559K
12/559K
16/559K
20/559K
24/559K
28/559K
32/559K
36/559K
40/559K
44/559K
48/559K
52/559K
56/559K
60/559K
64/559K
68/559K
72/559K
76/559K
80/559K
84/559K
88/559K
92/559K
96/559K
100/559K
104/559K
108/559K
112/559K
116/559K
120/559K
124/559K
128/559K
132/559K
136/559K
140/559K
144/559K
148/559K
152/559K
156/559K
160/559K
164/559K
168/559K
172/559K
176/559K
180/559K
184/559K
188/559K
192/559K
196/559K
200/559K
204/559K
208/559K
212/559K
216/559K
220/559K
224/559K
228/559K
232/559K
236/559K
240/559K
244/559K
248/559K
252/559K
256/559K
260/559K
264/559K
268/559K
272/559K
276/559K
280/559K
284/559K
288/559K
292/559K
296/559K
300/559K
304/559K
308/559K
312/559K
316/559K
320/559K
324/559K
328/559K
332/559K
336/559K
340/559K
344/559K
348/559K
352/559K
356/559K
360/559K
364/559K
368/559K
372/559K
376/559K
380/559K
384/559K
388/559K
392/559K
396/559K
400/559K
404/559K
408/559K
412/559K
416/559K
420/559K
424/559K
428/559K
432/559K
436/559K
440/559K
444/559K
448/559K
452/559K
456/559K
460/559K
464/559K
468/559K
472/559K
476/559K
480/559K
484/559K
488/559K
492/559K
496/559K
500/559K
504/559K
508/559K
512/559K
516/559K
520/559K
524/559K
528/559K
532/559K
536/559K
540/559K
544/559K
548/559K
552/559K
556/559K
559/559K
559K downloaded
Downloading: http://vm094.oxylos.org/mirror-maven2//velocity/velocity/1.4/velocity-1.4.jar
Downloading: http://localhost:8192/maven2/velocity/velocity/1.4/velocity-1.4.jar
4/401K
8/401K
12/401K
16/401K
20/401K
24/401K
28/401K
32/401K
36/401K
40/401K
44/401K
48/401K
52/401K
56/401K
60/401K
64/401K
68/401K
72/401K
76/401K
80/401K
84/401K
88/401K
92/401K
96/401K
100/401K
104/401K
108/401K
112/401K
116/401K
120/401K
124/401K
128/401K
132/401K
136/401K
140/401K
144/401K
148/401K
152/401K
156/401K
160/401K
164/401K
168/401K
172/401K
176/401K
180/401K
184/401K
188/401K
192/401K
196/401K
200/401K
204/401K
208/401K
212/401K
216/401K
220/401K
224/401K
228/401K
232/401K
236/401K
240/401K
244/401K
248/401K
252/401K
256/401K
260/401K
264/401K
268/401K
272/401K
276/401K
280/401K
284/401K
288/401K
292/401K
296/401K
300/401K
304/401K
308/401K
312/401K
316/401K
320/401K
324/401K
328/401K
332/401K
336/401K
340/401K
344/401K
348/401K
352/401K
356/401K
360/401K
364/401K
368/401K
372/401K
376/401K
380/401K
384/401K
388/401K
392/401K
396/401K
400/401K
401/401K
401K downloaded
Downloading: http://vm094.oxylos.org/mirror-maven2//org/codehaus/plexus/plexus-resources/1.0-alpha-4/plexus-resources-1.0-alpha-4.jar
Downloading: http://localhost:8192/maven2/org/codehaus/plexus/plexus-resources/1.0-alpha-4/plexus-resources-1.0-alpha-4.jar
4/16K
8/16K
12/16K
16/16K
16/16K
16K downloaded
[INFO] Setting property: classpath.resource.loader.class => 'org.codehaus.plexus.velocity.ContextClassLoaderResourceLoader'.
[INFO] Setting property: velocimacro.messages.on => 'false'.
[INFO] Setting property: resource.loader => 'classpath'.
[INFO] Setting property: resource.manager.logwhenfound => 'false'.
[ERROR] ResourceManager : No configuration information for resource loader named 'classpath'.
Skipping.
[INFO] [remote-resources:process {execution: default}]
Downloading: http://localhost:8192/maven2/org/apache/apache-jar-resource-bundle/1.4/apache-jar-resource-bundle-1.4.jar
4/12K
8/12K
12/12K
12/12K
12K downloaded
[ERROR] ResourceManager : unable to find resource 'META-INF/NOTICE.vm' in any resource loader.
[INFO] ------------------------------------------------------------------------
[ERROR] BUILD ERROR
[INFO] ------------------------------------------------------------------------
[INFO] Error rendering velocity resource.

Embedded error: Unable to find resource 'META-INF/NOTICE.vm'
[INFO] ------------------------------------------------------------------------
[INFO] For more information, run Maven with the -e switch
[INFO] ------------------------------------------------------------------------
[INFO] Total time: 49 seconds
[INFO] Finished at: Wed Apr 23 19:45:38 GMT-08:00 2008
[INFO] Final Memory: 10M/19M
[INFO] ------------------------------------------------------------------------
---------------------------------------------

To subscribe to this information via syndicated feeds:
- RSS: http://vmgump.apache.org/gump/public/directory-shared/asn1-codec/rss.xml
- Atom: http://vmgump.apache.org/gump/public/directory-shared/asn1-codec/atom.xml

============================== Gump Tracking Only ===
Produced by Gump version 2.3.
Gump Run 40011623042008, vmgump:vmgump-public:40011623042008
Gump E-mail Identifier (unique within run) #1.

*********************************************************** G U M P
[GUMP@vmgump]: Project asn1 (in module directory-shared) failed
To whom it may engage...
        
This is an automated request, but not an unsolicited one. For 
more information please visit http://gump.apache.org/nagged.html, 
and/or contact the folk at general@gump.apache.org.

Project asn1 has an issue affecting its community integration.
This issue affects 1 projects.
The current state of this project is 'Failed', with reason 'Build Failed'.
For reference only, the following projects are affected by this:
    - asn1 :  Apache ASN.1 Tools


Full details are available at:
    http://vmgump.apache.org/gump/public/directory-shared/asn1/index.html

That said, some information snippets are provided here.

The following annotations (debug/informational/warning/error messages) were provided:
 -DEBUG- Sole output [shared-asn1-0.9.11-SNAPSHOT.jar] identifier set to project name
 -DEBUG- (Gump generated) Maven2 Settings in: /srv/gump/public/workspace/directory-shared/asn1/gump_mvn_settings.xml
 -INFO- Failed with reason build failed
 -DEBUG- Maven POM in: /srv/gump/public/workspace/directory-shared/asn1/pom.xml
 -INFO- Failed to extract fallback artifacts from Gump Repository



The following work was performed:
http://vmgump.apache.org/gump/public/directory-shared/asn1/gump_work/build_directory-shared_asn1.html
Work Name: build_directory-shared_asn1 (Type: Build)
Work ended in a state of : Failed
Elapsed: 10 secs
Command Line: mvn --settings /srv/gump/public/workspace/directory-shared/asn1/gump_mvn_settings.xml
package 
[Working Directory: /srv/gump/public/workspace/directory-shared/asn1]
CLASSPATH: /usr/lib/jvm/java-1.5.0-sun/lib/tools.jar:/srv/gump/public/workspace/junit/dist/junit-23042008.jar:/srv/gump/public/workspace/apache-commons/lang/commons-lang-23042008.jar:/srv/gump/public/workspace/apache-commons/collections/build/commons-collections-23042008.jar:/srv/gump/public/workspace/velocity-engine/bin/velocity-23042008.jar:/srv/gump/public/workspace/velocity-engine/bin/velocity-dep-23042008.jar
---------------------------------------------
[INFO] Scanning for projects...
[INFO] ------------------------------------------------------------------------
[INFO] Building Apache Directory ASN.1 Shared
[INFO]    task-segment: [package]
[INFO] ------------------------------------------------------------------------
[INFO] Setting property: classpath.resource.loader.class => 'org.codehaus.plexus.velocity.ContextClassLoaderResourceLoader'.
[INFO] Setting property: velocimacro.messages.on => 'false'.
[INFO] Setting property: resource.loader => 'classpath'.
[INFO] Setting property: resource.manager.logwhenfound => 'false'.
[ERROR] ResourceManager : No configuration information for resource loader named 'classpath'.
Skipping.
[INFO] [remote-resources:process {execution: default}]
[ERROR] ResourceManager : unable to find resource 'META-INF/NOTICE.vm' in any resource loader.
[INFO] ------------------------------------------------------------------------
[ERROR] BUILD ERROR
[INFO] ------------------------------------------------------------------------
[INFO] Error rendering velocity resource.

Embedded error: Unable to find resource 'META-INF/NOTICE.vm'
[INFO] ------------------------------------------------------------------------
[INFO] For more information, run Maven with the -e switch
[INFO] ------------------------------------------------------------------------
[INFO] Total time: 8 seconds
[INFO] Finished at: Wed Apr 23 21:23:45 GMT-08:00 2008
[INFO] Final Memory: 11M/19M
[INFO] ------------------------------------------------------------------------
---------------------------------------------

To subscribe to this information via syndicated feeds:
- RSS: http://vmgump.apache.org/gump/public/directory-shared/asn1/rss.xml
- Atom: http://vmgump.apache.org/gump/public/directory-shared/asn1/atom.xml

============================== Gump Tracking Only ===
Produced by Gump version 2.3.
Gump Run 40011623042008, vmgump:vmgump-public:40011623042008
Gump E-mail Identifier (unique within run) #2.


--
Apache Gump
http://gump.apache.org/ [Instance: vmgump]

---------------------------------------------------------------------
To unsubscribe, e-mail: general-unsubscribe@gump.apache.org
For additional commands, e-mail: general-help@gump.apache.org


Mime
View raw message