gump-general mailing list archives

Site index · List index
Message view « Date » · « Thread »
Top « Date » · « Thread »
From g...@vmgump.apache.org
Subject BATCH: All dressed up, with nowhere to go...
Date Wed, 09 Apr 2008 16:00:56 GMT
Dear Gumpmeisters,
            
The following 12 notifys should have been sent

*********************************************************** G U M P
[GUMP@vmgump]: Project commons-jci (in module commons-sandbox) failed
[GUMP@vmgump]: Project hivemind-compile (in module hivemind) failed
[GUMP@vmgump]: Project jtidy-cvs (in module jtidy) failed
[GUMP@vmgump]: Project stub-compiler (in module asn1) failed
[GUMP@vmgump]: Project apache-httpd-make (in module apache-httpd) failed
[GUMP@vmgump]: Project asn1-der (in module asn1) failed
[GUMP@vmgump]: Project nlog4j (in module nlog4j) failed
[GUMP@vmgump]: Project ws-commons-axiom (in module ws-axis2-commons) failed
[GUMP@vmgump]: Project portals-pluto-portal-1.0 (in module portals-pluto-1.0) failed
[GUMP@vmgump]: Project xml-security-tests (in module xml-security) failed
[GUMP@vmgump]: Project JacORB-idllib (in module JacORB) failed
[GUMP@vmgump]: Project jetty (in module jetty) failed
*********************************************************** G U M P
[GUMP@vmgump]: Project commons-jci (in module commons-sandbox) failed
To whom it may engage...
        
This is an automated request, but not an unsolicited one. For 
more information please visit http://gump.apache.org/nagged.html, 
and/or contact the folk at general@gump.apache.org.

Project commons-jci has an issue affecting its community integration.
This issue affects 1 projects.
The current state of this project is 'Failed', with reason 'Build Failed'.
For reference only, the following projects are affected by this:
    - commons-jci :  Commons JCI


Full details are available at:
    http://vmgump.apache.org/gump/public/commons-sandbox/commons-jci/index.html

That said, some information snippets are provided here.

The following annotations (debug/informational/warning/error messages) were provided:
 -DEBUG- Sole output [commons-jci-09042008.jar] identifier set to project name
 -DEBUG- Dependency on packaged-groovy exists, no need to add for property maven.jar.groovy.
 -INFO- Making directory for Maven properties: [/srv/gump/public/workspace/commons-sandbox/jci]
 -DEBUG- (Gump generated) Maven Properties in: /srv/gump/public/workspace/commons-sandbox/jci/build.properties
 -INFO- Failed with reason build failed
 -INFO- Failed to extract fallback artifacts from Gump Repository



The following work was performed:
http://vmgump.apache.org/gump/public/commons-sandbox/commons-jci/gump_work/build_commons-sandbox_commons-jci.html
Work Name: build_commons-sandbox_commons-jci (Type: Build)
Work ended in a state of : Failed
Elapsed: 4 secs
Command Line: maven --offline jar 
[Working Directory: /srv/gump/public/workspace/commons-sandbox/jci]
CLASSPATH: /usr/lib/jvm/java-1.5.0-sun/lib/tools.jar:/srv/gump/public/workspace/jakarta-bcel/target/bcel-5.3-SNAPSHOT.jar:/srv/gump/public/workspace/apache-commons/collections/build/commons-collections-09042008.jar:/srv/gump/public/workspace/apache-commons/io/target/commons-io-09042008.jar:/srv/gump/public/workspace/apache-commons/lang/commons-lang-09042008.jar:/srv/gump/public/workspace/apache-commons/logging/target/commons-logging-09042008.jar:/srv/gump/public/workspace/apache-commons/logging/target/commons-logging-api-09042008.jar:/srv/gump/packages/eclipse-3.1M6/plugins/org.eclipse.jdt.core_3.1.0/jdtcore.jar:/srv/gump/packages/janino-2.3.8/lib/janino.jar:/srv/gump/packages/jarjar/jarjar-0.6.jar:/srv/gump/public/workspace/asm/output/dist/lib/asm-analysis-09042008.jar:/srv/gump/public/workspace/asm/output/dist/lib/asm-util-09042008.jar:/srv/gump/public/workspace/asm/output/dist/lib/asm-xml-09042008.jar:/srv/gump/public/workspace/asm/output/dist/lib/asm-commons-09042008.jar:
 /srv/gump/public/workspace/asm/output/dist/lib/asm-09042008.jar:/srv/gump/public/workspace/asm/output/dist/lib/asm-tree-09042008.jar:/srv/gump/packages/antlr-2.7.6/antlr.jar:/srv/gump/packages/groovy-1.0-jsr-03/groovy-1.0-jsr-03.jar:/srv/gump/packages/maven-cobertura-plugin/maven-cobertura-plugin-1.1.jar
---------------------------------------------
 __  __
|  \/  |__ _Apache__ ___
| |\/| / _` \ V / -_) ' \  ~ intelligent projects ~
|_|  |_\__,_|\_/\___|_||_|  v. 1.0.2

build:start:

java:prepare-filesystem:
    [mkdir] Created dir: /srv/gump/public/workspace/commons-sandbox/jci/target/classes

java:compile:
    [echo] Compiling to /srv/gump/public/workspace/commons-sandbox/jci/target/classes
    [echo] No java source files to compile.
resources or todir was null

java:jar-resources:

test:prepare-filesystem:
    [mkdir] Created dir: /srv/gump/public/workspace/commons-sandbox/jci/target/test-classes
    [mkdir] Created dir: /srv/gump/public/workspace/commons-sandbox/jci/target/test-reports

test:test-resources:

test:compile:
    [echo] No test source files to compile.

test:test:
    [echo] No tests to run.

BUILD FAILED
File...... /home/gump/.maven/cache/maven-jar-plugin-1.6.1/plugin.jelly
Element... ant:fail
Line...... 53
Column.... 19
You must define currentVersion in your POM.
Total time: 3 seconds
Finished at: Wed Apr 09 10:04:54 GMT-08:00 2008

---------------------------------------------

To subscribe to this information via syndicated feeds:
- RSS: http://vmgump.apache.org/gump/public/commons-sandbox/commons-jci/rss.xml
- Atom: http://vmgump.apache.org/gump/public/commons-sandbox/commons-jci/atom.xml

============================== Gump Tracking Only ===
Produced by Gump version 2.3.
Gump Run 16000809042008, vmgump:vmgump-public:16000809042008
Gump E-mail Identifier (unique within run) #2.

*********************************************************** G U M P
[GUMP@vmgump]: Project hivemind-compile (in module hivemind) failed
To whom it may engage...
        
This is an automated request, but not an unsolicited one. For 
more information please visit http://gump.apache.org/nagged.html, 
and/or contact the folk at general@gump.apache.org.

Project hivemind-compile has an issue affecting its community integration.
This issue affects 8 projects.
The current state of this project is 'Failed', with reason 'Build Failed'.
For reference only, the following projects are affected by this:
    - eyebrowse :  Web-based mail archive browsing
    - hivemind :  HiveMind is a services and configuration
    microkernel
    - hivemind-compile :  HiveMind is a services and configuration
    microkernel
    - hivemind-library :  HiveMind is a services and configuration
    microkernel
    - jakarta-lucene :  Java Based Search Engine
    - lucene-java :  Java Based Search Engine
    - tapestry :  Component-based web application framework organized around i...
    - xml-xindice :  native XML database


Full details are available at:
    http://vmgump.apache.org/gump/public/hivemind/hivemind-compile/index.html

That said, some information snippets are provided here.

The following annotations (debug/informational/warning/error messages) were provided:
 -INFO- Failed with reason build failed



The following work was performed:
http://vmgump.apache.org/gump/public/hivemind/hivemind-compile/gump_work/build_hivemind_hivemind-compile.html
Work Name: build_hivemind_hivemind-compile (Type: Build)
Work ended in a state of : Failed
Elapsed: 1 sec
Command Line: /usr/lib/jvm/java-1.5.0-sun/bin/java -Djava.awt.headless=true -Xbootclasspath/p:/srv/gump/public/workspace/xml-commons/java/external/build/xml-apis.jar:/srv/gump/public/workspace/xml-xerces2/build/xercesImpl.jar org.apache.tools.ant.Main -Dgump.merge=/srv/gump/public/gump/work/merge.xml -Dbuild.sysclasspath=only -Ddownload-warning-marker-displayed=true -Dtest.classes.dir=target/test-classes -Djunit-available=true -Djavacc.home=/srv/gump/packages/javacc-3.1 -Djava.classes.dir=target/classes compile-tests 
[Working Directory: /srv/gump/public/workspace/hivemind/framework]
CLASSPATH: /usr/lib/jvm/java-1.5.0-sun/lib/tools.jar:/srv/gump/public/workspace/hivemind/hivemind/target/classes:/srv/gump/public/workspace/hivemind/hivebuild/target/classes:/srv/gump/public/workspace/hivemind/framework/target/classes:/srv/gump/public/workspace/ant/dist/lib/ant-jmf.jar:/srv/gump/public/workspace/ant/dist/lib/ant-swing.jar:/srv/gump/public/workspace/ant/dist/lib/ant-apache-resolver.jar:/srv/gump/public/workspace/ant/dist/lib/ant-trax.jar:/srv/gump/public/workspace/ant/dist/lib/ant-junit.jar:/srv/gump/public/workspace/ant/dist/lib/ant-launcher.jar:/srv/gump/public/workspace/ant/dist/lib/ant-nodeps.jar:/srv/gump/public/workspace/ant/dist/lib/ant.jar:/srv/gump/public/workspace/apache-commons/logging/target/commons-logging-09042008.jar:/srv/gump/public/workspace/apache-commons/logging/target/commons-logging-api-09042008.jar:/srv/gump/packages/easymock1.2_Java1.3/easymock.jar:/srv/gump/packages/easymockclassextension1.2/easymockclassextension.jar:/srv/gump/public/w
 orkspace/jakarta-oro/jakarta-oro-09042008.jar:/srv/gump/public/workspace/jakarta-servletapi-4/lib/servlet.jar:/srv/gump/public/workspace/javassist/javassist.jar:/srv/gump/public/workspace/junit/dist/junit-09042008.jar:/srv/gump/public/workspace/logging-log4j-12/dist/lib/log4j-09042008.jar:/srv/gump/public/workspace/xml-commons/java/external/build/xml-apis-ext.jar
---------------------------------------------
Buildfile: build.xml does not exist!
Build failed
---------------------------------------------

To subscribe to this information via syndicated feeds:
- RSS: http://vmgump.apache.org/gump/public/hivemind/hivemind-compile/rss.xml
- Atom: http://vmgump.apache.org/gump/public/hivemind/hivemind-compile/atom.xml

============================== Gump Tracking Only ===
Produced by Gump version 2.3.
Gump Run 16000809042008, vmgump:vmgump-public:16000809042008
Gump E-mail Identifier (unique within run) #3.

*********************************************************** G U M P
[GUMP@vmgump]: Project jtidy-cvs (in module jtidy) failed
To whom it may engage...
        
This is an automated request, but not an unsolicited one. For 
more information please visit http://gump.apache.org/nagged.html, 
and/or contact the folk at general@gump.apache.org.

Project jtidy-cvs has an issue affecting its community integration.
This issue affects 1 projects.
The current state of this project is 'Failed', with reason 'Build Failed'.
For reference only, the following projects are affected by this:
    - jtidy-cvs :  HTML Templates


Full details are available at:
    http://vmgump.apache.org/gump/public/jtidy/jtidy-cvs/index.html

That said, some information snippets are provided here.

The following annotations (debug/informational/warning/error messages) were provided:
 -DEBUG- Sole output [jtidy-09042008.jar] identifier set to project name
 -DEBUG- Dependency on xml-apis exists, no need to add for property maven.jar.dom3-xml-apis.
 -DEBUG- (Gump generated) Maven Properties in: /srv/gump/public/workspace/jtidy/build.properties
 -INFO- Failed with reason build failed
 -DEBUG- Maven POM in: /srv/gump/public/workspace/jtidy/project.xml
 -DEBUG- Maven project properties in: /srv/gump/public/workspace/jtidy/project.properties
 -INFO- Failed to extract fallback artifacts from Gump Repository



The following work was performed:
http://vmgump.apache.org/gump/public/jtidy/jtidy-cvs/gump_work/build_jtidy_jtidy-cvs.html
Work Name: build_jtidy_jtidy-cvs (Type: Build)
Work ended in a state of : Failed
Elapsed: 3 secs
Command Line: maven --offline jar 
[Working Directory: /srv/gump/public/workspace/jtidy]
CLASSPATH: /usr/lib/jvm/java-1.5.0-sun/lib/tools.jar:/srv/gump/public/workspace/ant/dist/lib/ant-jmf.jar:/srv/gump/public/workspace/ant/dist/lib/ant-swing.jar:/srv/gump/public/workspace/ant/dist/lib/ant-apache-resolver.jar:/srv/gump/public/workspace/ant/dist/lib/ant-trax.jar:/srv/gump/public/workspace/ant/dist/lib/ant-junit.jar:/srv/gump/public/workspace/ant/dist/lib/ant-launcher.jar:/srv/gump/public/workspace/ant/dist/lib/ant-nodeps.jar:/srv/gump/public/workspace/ant/dist/lib/ant.jar:/srv/gump/packages/junit3.8.1/junit.jar:/srv/gump/public/workspace/xml-commons/java/build/resolver.jar:/srv/gump/public/workspace/xml-commons/java/external/build/xml-apis-ext.jar:/srv/gump/public/workspace/apache-commons/logging/target/commons-logging-09042008.jar:/srv/gump/public/workspace/apache-commons/logging/target/commons-logging-api-09042008.jar
---------------------------------------------
[MethodExpression] Cannot evaluate expression
java.lang.reflect.InvocationTargetException
	at sun.reflect.NativeMethodAccessorImpl.invoke0(Native Method)
	at sun.reflect.NativeMethodAccessorImpl.invoke(NativeMethodAccessorImpl.java:39)
	at sun.reflect.DelegatingMethodAccessorImpl.invoke(DelegatingMethodAccessorImpl.java:25)
	at java.lang.reflect.Method.invoke(Method.java:585)
	at org.apache.commons.betwixt.expression.MethodExpression.evaluate(MethodExpression.java:96)
	at org.apache.commons.betwixt.io.AbstractBeanWriter.writeContent(AbstractBeanWriter.java:658)
	at org.apache.commons.betwixt.io.AbstractBeanWriter.writeRestOfElement(AbstractBeanWriter.java:539)
	at org.apache.commons.betwixt.io.AbstractBeanWriter.write(AbstractBeanWriter.java:481)
	at org.apache.commons.betwixt.io.AbstractBeanWriter.writeContent(AbstractBeanWriter.java:643)
	at org.apache.commons.betwixt.io.AbstractBeanWriter.writeRestOfElement(AbstractBeanWriter.java:539)
	at org.apache.commons.betwixt.io.AbstractBeanWriter.write(AbstractBeanWriter.java:513)
	at org.apache.commons.betwixt.io.AbstractBeanWriter.write(AbstractBeanWriter.java:233)
	at org.apache.commons.betwixt.io.AbstractBeanWriter.writeContent(AbstractBeanWriter.java:630)
	at org.apache.commons.betwixt.io.AbstractBeanWriter.writeRestOfElement(AbstractBeanWriter.java:539)
	at org.apache.commons.betwixt.io.AbstractBeanWriter.write(AbstractBeanWriter.java:513)
	at org.apache.commons.betwixt.io.AbstractBeanWriter.write(AbstractBeanWriter.java:233)
	at org.apache.commons.betwixt.io.AbstractBeanWriter.write(AbstractBeanWriter.java:162)
	at org.apache.commons.betwixt.io.BeanWriter.write(BeanWriter.java:217)
	at org.apache.maven.MavenUtils.getProjectString(MavenUtils.java:432)
	at org.apache.maven.MavenUtils.getInterpolatedPOM(MavenUtils.java:383)
	at org.apache.maven.MavenUtils.getJellyProject(MavenUtils.java:360)
	at org.apache.maven.MavenUtils.getProject(MavenUtils.java:144)
	at org.apache.maven.MavenUtils.getProject(MavenUtils.java:122)
	at org.apache.maven.MavenSession.initializeRootProject(MavenSession.java:232)
	at org.apache.maven.MavenSession.initialize(MavenSession.java:172)
	at org.apache.maven.cli.App.doMain(App.java:475)
	at org.apache.maven.cli.App.main(App.java:1239)
	at sun.reflect.NativeMethodAccessorImpl.invoke0(Native Method)
	at sun.reflect.NativeMethodAccessorImpl.invoke(NativeMethodAccessorImpl.java:39)
	at sun.reflect.DelegatingMethodAccessorImpl.invoke(DelegatingMethodAccessorImpl.java:25)
	at java.lang.reflect.Method.invoke(Method.java:585)
	at com.werken.forehead.Forehead.run(Forehead.java:551)
	at com.werken.forehead.Forehead.main(Forehead.java:581)
Caused by: java.lang.IllegalArgumentException: cvs repository connection string doesn't contain six tokens
	at org.apache.maven.project.Repository.splitSCMConnection(Repository.java:258)
	at org.apache.maven.project.Repository.getScmType(Repository.java:115)
	... 33 more
The build cannot continue because of the following unsatisfied dependencies:

maven-sourceforge-plugin-1.0.jar (try downloading from http://maven-plugins.sourceforge.net)
maven-statcvs-plugin-2.7.jar
maven-findbugs-plugin-0.9.2.jar
maven-xhtml-plugin-1.2.jar (try downloading from http://maven-validator.sourceforge.net)
maven-checkstyle-plugin-2.4.1.jar (try downloading from http://maven.apache.org/reference/plugins/checkstyle)

Total time: 2 seconds
Finished at: Wed Apr 09 10:15:48 GMT-08:00 2008

---------------------------------------------

To subscribe to this information via syndicated feeds:
- RSS: http://vmgump.apache.org/gump/public/jtidy/jtidy-cvs/rss.xml
- Atom: http://vmgump.apache.org/gump/public/jtidy/jtidy-cvs/atom.xml

============================== Gump Tracking Only ===
Produced by Gump version 2.3.
Gump Run 16000809042008, vmgump:vmgump-public:16000809042008
Gump E-mail Identifier (unique within run) #4.

*********************************************************** G U M P
[GUMP@vmgump]: Project stub-compiler (in module asn1) failed
To whom it may engage...
        
This is an automated request, but not an unsolicited one. For 
more information please visit http://gump.apache.org/nagged.html, 
and/or contact the folk at general@gump.apache.org.

Project stub-compiler has an issue affecting its community integration.
This issue affects 1 projects.
The current state of this project is 'Failed', with reason 'Build Failed'.
For reference only, the following projects are affected by this:
    - stub-compiler :  Apache ASN.1 Tools


Full details are available at:
    http://vmgump.apache.org/gump/public/asn1/stub-compiler/index.html

That said, some information snippets are provided here.

The following annotations (debug/informational/warning/error messages) were provided:
 -DEBUG- Sole output [stub-compiler-09042008.jar] identifier set to project name
 -DEBUG- Dependency on velocity-engine exists, no need to add for property maven.jar.velocity-dep.
 -DEBUG- Dependency on packaged-logkit exists, no need to add for property maven.jar.avalon-logkit.
 -INFO- Making directory for Maven properties: [/srv/gump/public/workspace/asn1/stub-compiler]
 -DEBUG- (Gump generated) Maven Properties in: /srv/gump/public/workspace/asn1/stub-compiler/build.properties
 -INFO- Failed with reason build failed
 -INFO- Project Reports in: /srv/gump/public/workspace/asn1/stub-compiler/target/test-reports
 -INFO- Failed to extract fallback artifacts from Gump Repository



The following work was performed:
http://vmgump.apache.org/gump/public/asn1/stub-compiler/gump_work/build_asn1_stub-compiler.html
Work Name: build_asn1_stub-compiler (Type: Build)
Work ended in a state of : Failed
Elapsed: 5 secs
Command Line: maven --offline jar 
[Working Directory: /srv/gump/public/workspace/asn1/stub-compiler]
CLASSPATH: /usr/lib/jvm/java-1.5.0-sun/lib/tools.jar:/srv/gump/packages/antlr-2.7.6/antlr.jar:/srv/gump/packages/avalon-logkit/avalon-logkit-2.1.jar:/srv/gump/public/workspace/apache-commons/collections/build/commons-collections-09042008.jar:/srv/gump/public/workspace/apache-commons/lang/commons-lang-09042008.jar:/srv/gump/public/workspace/apache-commons/logging/target/commons-logging-09042008.jar:/srv/gump/public/workspace/apache-commons/logging/target/commons-logging-api-09042008.jar:/srv/gump/public/workspace/velocity-engine/bin/velocity-dep-09042008.jar:/srv/gump/public/workspace/junit/dist/junit-09042008.jar:/srv/gump/public/workspace/slf4j/slf4j-api/target/slf4j-api-1.5.1-SNAPSHOT.jar:/srv/gump/public/workspace/slf4j/slf4j-simple/target/slf4j-simple-1.5.1-SNAPSHOT.jar
---------------------------------------------
 __  __
|  \/  |__ _Apache__ ___
| |\/| / _` \ V / -_) ' \  ~ intelligent projects ~
|_|  |_\__,_|\_/\___|_||_|  v. 1.0.2

build:start:

java:prepare-filesystem:
    [mkdir] Created dir: /srv/gump/public/workspace/asn1/stub-compiler/target/classes

java:compile:
    [echo] Compiling to /srv/gump/public/workspace/asn1/stub-compiler/target/classes
    [echo] No java source files to compile.
resources or todir was null

java:jar-resources:

test:prepare-filesystem:
    [mkdir] Created dir: /srv/gump/public/workspace/asn1/stub-compiler/target/test-classes
    [mkdir] Created dir: /srv/gump/public/workspace/asn1/stub-compiler/target/test-reports

test:test-resources:

test:compile:
    [echo] No test source files to compile.

test:test:
    [echo] No tests to run.

BUILD FAILED
File...... /home/gump/.maven/cache/maven-jar-plugin-1.6.1/plugin.jelly
Element... ant:fail
Line...... 53
Column.... 19
You must define currentVersion in your POM.
Total time: 4 seconds
Finished at: Wed Apr 09 10:20:56 GMT-08:00 2008

---------------------------------------------

To subscribe to this information via syndicated feeds:
- RSS: http://vmgump.apache.org/gump/public/asn1/stub-compiler/rss.xml
- Atom: http://vmgump.apache.org/gump/public/asn1/stub-compiler/atom.xml

============================== Gump Tracking Only ===
Produced by Gump version 2.3.
Gump Run 16000809042008, vmgump:vmgump-public:16000809042008
Gump E-mail Identifier (unique within run) #5.

*********************************************************** G U M P
[GUMP@vmgump]: Project apache-httpd-make (in module apache-httpd) failed
To whom it may engage...
        
This is an automated request, but not an unsolicited one. For 
more information please visit http://gump.apache.org/nagged.html, 
and/or contact the folk at general@gump.apache.org.

Project apache-httpd-make has an issue affecting its community integration.
This issue affects 5 projects.
The current state of this project is 'Failed', with reason 'Build Failed'.
For reference only, the following projects are affected by this:
    - apache-httpd-make :  Apache HTTP Server
    - apache-httpd-make-install :  Apache HTTP Server
    - jakarta-tomcat-jk-native :  Connectors to various web servers
    - jakarta-tomcat-jk-native-buildconf :  Connectors to various web servers
    - jakarta-tomcat-jk-native-configure :  Connectors to various web servers


Full details are available at:
    http://vmgump.apache.org/gump/public/apache-httpd/apache-httpd-make/index.html

That said, some information snippets are provided here.

The following annotations (debug/informational/warning/error messages) were provided:
 -INFO- Failed with reason build failed



The following work was performed:
http://vmgump.apache.org/gump/public/apache-httpd/apache-httpd-make/gump_work/build_apache-httpd_apache-httpd-make.html
Work Name: build_apache-httpd_apache-httpd-make (Type: Build)
Work ended in a state of : Failed
Elapsed: 4 mins 2 secs
Command Line: make 
[Working Directory: /srv/gump/public/workspace/apache-httpd]
---------------------------------------------
/srv/gump/public/workspace/apr/dest-09042008/build-1/libtool --silent --mode=compile ccache gcc -g -O2 -pthread    -DLINUX=2 -D_REENTRANT -D_GNU_SOURCE -D_LARGEFILE64_SOURCE    -I/srv/gump/public/workspace/apache-httpd/srclib/pcre -I. -I/srv/gump/public/workspace/apache-httpd/os/unix -I/srv/gump/public/workspace/apache-httpd/server/mpm/prefork -I/srv/gump/public/workspace/apache-httpd/modules/http -I/srv/gump/public/workspace/apache-httpd/modules/filters -I/srv/gump/public/workspace/apache-httpd/modules/proxy -I/srv/gump/public/workspace/apache-httpd/modules/session -I/srv/gump/public/workspace/apache-httpd/include -I/srv/gump/public/workspace/apache-httpd/modules/generators -I/srv/gump/public/workspace/apache-httpd/modules/mappers -I/srv/gump/public/workspace/apache-httpd/modules/database -I/srv/gump/public/workspace/apr/dest-09042008/include/apr-1 -I/srv/gump/public/workspace/apr-util/dest-09042008/include/apr-1 -I/srv/gump/public/workspace/apache-httpd/modules/cache -I/srv
 /gump/public/workspace/apache-httpd/modules/proxy/../generators -I/srv/gump/public/workspace/apache-httpd/modules/ssl -I/srv/gump/public/workspace/apache-httpd/modules/dav/main  -prefer-non-pic -static -c mod_userdir.c && touch mod_userdir.lo
/srv/gump/public/workspace/apr/dest-09042008/build-1/libtool --silent --mode=link ccache gcc -g -O2 -pthread   -static     -o libmod_userdir.la mod_userdir.lo 
/srv/gump/public/workspace/apr/dest-09042008/build-1/libtool --silent --mode=compile ccache gcc -g -O2 -pthread    -DLINUX=2 -D_REENTRANT -D_GNU_SOURCE -D_LARGEFILE64_SOURCE    -I/srv/gump/public/workspace/apache-httpd/srclib/pcre -I. -I/srv/gump/public/workspace/apache-httpd/os/unix -I/srv/gump/public/workspace/apache-httpd/server/mpm/prefork -I/srv/gump/public/workspace/apache-httpd/modules/http -I/srv/gump/public/workspace/apache-httpd/modules/filters -I/srv/gump/public/workspace/apache-httpd/modules/proxy -I/srv/gump/public/workspace/apache-httpd/modules/session -I/srv/gump/public/workspace/apache-httpd/include -I/srv/gump/public/workspace/apache-httpd/modules/generators -I/srv/gump/public/workspace/apache-httpd/modules/mappers -I/srv/gump/public/workspace/apache-httpd/modules/database -I/srv/gump/public/workspace/apr/dest-09042008/include/apr-1 -I/srv/gump/public/workspace/apr-util/dest-09042008/include/apr-1 -I/srv/gump/public/workspace/apache-httpd/modules/cache -I/srv
 /gump/public/workspace/apache-httpd/modules/proxy/../generators -I/srv/gump/public/workspace/apache-httpd/modules/ssl -I/srv/gump/public/workspace/apache-httpd/modules/dav/main  -prefer-non-pic -static -c mod_alias.c && touch mod_alias.lo
/srv/gump/public/workspace/apr/dest-09042008/build-1/libtool --silent --mode=link ccache gcc -g -O2 -pthread   -static     -o libmod_alias.la mod_alias.lo 
/srv/gump/public/workspace/apr/dest-09042008/build-1/libtool --silent --mode=compile ccache gcc -g -O2 -pthread    -DLINUX=2 -D_REENTRANT -D_GNU_SOURCE -D_LARGEFILE64_SOURCE    -I/srv/gump/public/workspace/apache-httpd/srclib/pcre -I. -I/srv/gump/public/workspace/apache-httpd/os/unix -I/srv/gump/public/workspace/apache-httpd/server/mpm/prefork -I/srv/gump/public/workspace/apache-httpd/modules/http -I/srv/gump/public/workspace/apache-httpd/modules/filters -I/srv/gump/public/workspace/apache-httpd/modules/proxy -I/srv/gump/public/workspace/apache-httpd/modules/session -I/srv/gump/public/workspace/apache-httpd/include -I/srv/gump/public/workspace/apache-httpd/modules/generators -I/srv/gump/public/workspace/apache-httpd/modules/mappers -I/srv/gump/public/workspace/apache-httpd/modules/database -I/srv/gump/public/workspace/apr/dest-09042008/include/apr-1 -I/srv/gump/public/workspace/apr-util/dest-09042008/include/apr-1 -I/srv/gump/public/workspace/apache-httpd/modules/cache -I/srv
 /gump/public/workspace/apache-httpd/modules/proxy/../generators -I/srv/gump/public/workspace/apache-httpd/modules/ssl -I/srv/gump/public/workspace/apache-httpd/modules/dav/main  -prefer-non-pic -static -c mod_so.c && touch mod_so.lo
/srv/gump/public/workspace/apr/dest-09042008/build-1/libtool --silent --mode=link ccache gcc -g -O2 -pthread   -static     -o libmod_so.la mod_so.lo 
make[3]: Leaving directory `/srv/gump/public/workspace/apache-httpd/modules/mappers'
make[2]: Leaving directory `/srv/gump/public/workspace/apache-httpd/modules/mappers'
make[1]: Leaving directory `/srv/gump/public/workspace/apache-httpd/modules'
Making all in support
make[1]: Entering directory `/srv/gump/public/workspace/apache-httpd/support'
make[2]: Entering directory `/srv/gump/public/workspace/apache-httpd/support'
/srv/gump/public/workspace/apr/dest-09042008/build-1/libtool --silent --mode=compile ccache gcc -g -O2 -pthread    -DLINUX=2 -D_REENTRANT -D_GNU_SOURCE -D_LARGEFILE64_SOURCE    -I/srv/gump/public/workspace/apache-httpd/srclib/pcre -I. -I/srv/gump/public/workspace/apache-httpd/os/unix -I/srv/gump/public/workspace/apache-httpd/server/mpm/prefork -I/srv/gump/public/workspace/apache-httpd/modules/http -I/srv/gump/public/workspace/apache-httpd/modules/filters -I/srv/gump/public/workspace/apache-httpd/modules/proxy -I/srv/gump/public/workspace/apache-httpd/modules/session -I/srv/gump/public/workspace/apache-httpd/include -I/srv/gump/public/workspace/apache-httpd/modules/generators -I/srv/gump/public/workspace/apache-httpd/modules/mappers -I/srv/gump/public/workspace/apache-httpd/modules/database -I/srv/gump/public/workspace/apr/dest-09042008/include/apr-1 -I/srv/gump/public/workspace/apr-util/dest-09042008/include/apr-1 -I/srv/gump/public/workspace/apache-httpd/modules/cache -I/srv
 /gump/public/workspace/apache-httpd/modules/proxy/../generators -I/srv/gump/public/workspace/apache-httpd/modules/ssl -I/srv/gump/public/workspace/apache-httpd/modules/dav/main  -prefer-non-pic -static -c htpasswd.c && touch htpasswd.lo
/srv/gump/public/workspace/apr/dest-09042008/build-1/libtool --silent --mode=link ccache gcc -g -O2 -pthread        -o htpasswd  htpasswd.lo   -lm /srv/gump/public/workspace/apache-httpd/srclib/pcre/libpcre.la                             /srv/gump/public/workspace/apr-util/dest-09042008/lib/libaprutil-1.la -lexpat /srv/gump/public/workspace/apr/dest-09042008/lib/libapr-1.la -lrt -lcrypt -lpthread -ldl
/srv/gump/public/workspace/apr/dest-09042008/build-1/libtool --silent --mode=compile ccache gcc -g -O2 -pthread    -DLINUX=2 -D_REENTRANT -D_GNU_SOURCE -D_LARGEFILE64_SOURCE    -I/srv/gump/public/workspace/apache-httpd/srclib/pcre -I. -I/srv/gump/public/workspace/apache-httpd/os/unix -I/srv/gump/public/workspace/apache-httpd/server/mpm/prefork -I/srv/gump/public/workspace/apache-httpd/modules/http -I/srv/gump/public/workspace/apache-httpd/modules/filters -I/srv/gump/public/workspace/apache-httpd/modules/proxy -I/srv/gump/public/workspace/apache-httpd/modules/session -I/srv/gump/public/workspace/apache-httpd/include -I/srv/gump/public/workspace/apache-httpd/modules/generators -I/srv/gump/public/workspace/apache-httpd/modules/mappers -I/srv/gump/public/workspace/apache-httpd/modules/database -I/srv/gump/public/workspace/apr/dest-09042008/include/apr-1 -I/srv/gump/public/workspace/apr-util/dest-09042008/include/apr-1 -I/srv/gump/public/workspace/apache-httpd/modules/cache -I/srv
 /gump/public/workspace/apache-httpd/modules/proxy/../generators -I/srv/gump/public/workspace/apache-httpd/modules/ssl -I/srv/gump/public/workspace/apache-httpd/modules/dav/main  -prefer-non-pic -static -c htdigest.c && touch htdigest.lo
/srv/gump/public/workspace/apr/dest-09042008/build-1/libtool --silent --mode=link ccache gcc -g -O2 -pthread        -o htdigest  htdigest.lo   -lm /srv/gump/public/workspace/apache-httpd/srclib/pcre/libpcre.la                             /srv/gump/public/workspace/apr-util/dest-09042008/lib/libaprutil-1.la -lexpat /srv/gump/public/workspace/apr/dest-09042008/lib/libapr-1.la -lrt -lcrypt -lpthread -ldl
/srv/gump/public/workspace/apr/dest-09042008/build-1/libtool --silent --mode=compile ccache gcc -g -O2 -pthread    -DLINUX=2 -D_REENTRANT -D_GNU_SOURCE -D_LARGEFILE64_SOURCE    -I/srv/gump/public/workspace/apache-httpd/srclib/pcre -I. -I/srv/gump/public/workspace/apache-httpd/os/unix -I/srv/gump/public/workspace/apache-httpd/server/mpm/prefork -I/srv/gump/public/workspace/apache-httpd/modules/http -I/srv/gump/public/workspace/apache-httpd/modules/filters -I/srv/gump/public/workspace/apache-httpd/modules/proxy -I/srv/gump/public/workspace/apache-httpd/modules/session -I/srv/gump/public/workspace/apache-httpd/include -I/srv/gump/public/workspace/apache-httpd/modules/generators -I/srv/gump/public/workspace/apache-httpd/modules/mappers -I/srv/gump/public/workspace/apache-httpd/modules/database -I/srv/gump/public/workspace/apr/dest-09042008/include/apr-1 -I/srv/gump/public/workspace/apr-util/dest-09042008/include/apr-1 -I/srv/gump/public/workspace/apache-httpd/modules/cache -I/srv
 /gump/public/workspace/apache-httpd/modules/proxy/../generators -I/srv/gump/public/workspace/apache-httpd/modules/ssl -I/srv/gump/public/workspace/apache-httpd/modules/dav/main  -prefer-non-pic -static -c rotatelogs.c && touch rotatelogs.lo
/srv/gump/public/workspace/apr/dest-09042008/build-1/libtool --silent --mode=link ccache gcc -g -O2 -pthread        -o rotatelogs  rotatelogs.lo   -lm /srv/gump/public/workspace/apache-httpd/srclib/pcre/libpcre.la                             /srv/gump/public/workspace/apr-util/dest-09042008/lib/libaprutil-1.la -lexpat /srv/gump/public/workspace/apr/dest-09042008/lib/libapr-1.la -lrt -lcrypt -lpthread -ldl
/srv/gump/public/workspace/apr/dest-09042008/build-1/libtool --silent --mode=compile ccache gcc -g -O2 -pthread    -DLINUX=2 -D_REENTRANT -D_GNU_SOURCE -D_LARGEFILE64_SOURCE    -I/srv/gump/public/workspace/apache-httpd/srclib/pcre -I. -I/srv/gump/public/workspace/apache-httpd/os/unix -I/srv/gump/public/workspace/apache-httpd/server/mpm/prefork -I/srv/gump/public/workspace/apache-httpd/modules/http -I/srv/gump/public/workspace/apache-httpd/modules/filters -I/srv/gump/public/workspace/apache-httpd/modules/proxy -I/srv/gump/public/workspace/apache-httpd/modules/session -I/srv/gump/public/workspace/apache-httpd/include -I/srv/gump/public/workspace/apache-httpd/modules/generators -I/srv/gump/public/workspace/apache-httpd/modules/mappers -I/srv/gump/public/workspace/apache-httpd/modules/database -I/srv/gump/public/workspace/apr/dest-09042008/include/apr-1 -I/srv/gump/public/workspace/apr-util/dest-09042008/include/apr-1 -I/srv/gump/public/workspace/apache-httpd/modules/cache -I/srv
 /gump/public/workspace/apache-httpd/modules/proxy/../generators -I/srv/gump/public/workspace/apache-httpd/modules/ssl -I/srv/gump/public/workspace/apache-httpd/modules/dav/main  -prefer-non-pic -static -c logresolve.c && touch logresolve.lo
/srv/gump/public/workspace/apr/dest-09042008/build-1/libtool --silent --mode=link ccache gcc -g -O2 -pthread        -o logresolve  logresolve.lo   -lm /srv/gump/public/workspace/apache-httpd/srclib/pcre/libpcre.la                             /srv/gump/public/workspace/apr-util/dest-09042008/lib/libaprutil-1.la -lexpat /srv/gump/public/workspace/apr/dest-09042008/lib/libapr-1.la -lrt -lcrypt -lpthread -ldl
/srv/gump/public/workspace/apr/dest-09042008/build-1/libtool --silent --mode=compile ccache gcc -g -O2 -pthread    -DLINUX=2 -D_REENTRANT -D_GNU_SOURCE -D_LARGEFILE64_SOURCE    -I/srv/gump/public/workspace/apache-httpd/srclib/pcre -I. -I/srv/gump/public/workspace/apache-httpd/os/unix -I/srv/gump/public/workspace/apache-httpd/server/mpm/prefork -I/srv/gump/public/workspace/apache-httpd/modules/http -I/srv/gump/public/workspace/apache-httpd/modules/filters -I/srv/gump/public/workspace/apache-httpd/modules/proxy -I/srv/gump/public/workspace/apache-httpd/modules/session -I/srv/gump/public/workspace/apache-httpd/include -I/srv/gump/public/workspace/apache-httpd/modules/generators -I/srv/gump/public/workspace/apache-httpd/modules/mappers -I/srv/gump/public/workspace/apache-httpd/modules/database -I/srv/gump/public/workspace/apr/dest-09042008/include/apr-1 -I/srv/gump/public/workspace/apr-util/dest-09042008/include/apr-1 -I/srv/gump/public/workspace/apache-httpd/modules/cache -I/srv
 /gump/public/workspace/apache-httpd/modules/proxy/../generators -I/srv/gump/public/workspace/apache-httpd/modules/ssl -I/srv/gump/public/workspace/apache-httpd/modules/dav/main  -prefer-non-pic -static -c ab.c && touch ab.lo
/srv/gump/public/workspace/apr/dest-09042008/build-1/libtool --silent --mode=link ccache gcc -g -O2 -pthread        -o ab  ab.lo   -lm /srv/gump/public/workspace/apache-httpd/srclib/pcre/libpcre.la                             /srv/gump/public/workspace/apr-util/dest-09042008/lib/libaprutil-1.la -lexpat /srv/gump/public/workspace/apr/dest-09042008/lib/libapr-1.la -lrt -lcrypt -lpthread -ldl 
/srv/gump/public/workspace/apr/dest-09042008/build-1/libtool --silent --mode=compile ccache gcc -g -O2 -pthread    -DLINUX=2 -D_REENTRANT -D_GNU_SOURCE -D_LARGEFILE64_SOURCE    -I/srv/gump/public/workspace/apache-httpd/srclib/pcre -I. -I/srv/gump/public/workspace/apache-httpd/os/unix -I/srv/gump/public/workspace/apache-httpd/server/mpm/prefork -I/srv/gump/public/workspace/apache-httpd/modules/http -I/srv/gump/public/workspace/apache-httpd/modules/filters -I/srv/gump/public/workspace/apache-httpd/modules/proxy -I/srv/gump/public/workspace/apache-httpd/modules/session -I/srv/gump/public/workspace/apache-httpd/include -I/srv/gump/public/workspace/apache-httpd/modules/generators -I/srv/gump/public/workspace/apache-httpd/modules/mappers -I/srv/gump/public/workspace/apache-httpd/modules/database -I/srv/gump/public/workspace/apr/dest-09042008/include/apr-1 -I/srv/gump/public/workspace/apr-util/dest-09042008/include/apr-1 -I/srv/gump/public/workspace/apache-httpd/modules/cache -I/srv
 /gump/public/workspace/apache-httpd/modules/proxy/../generators -I/srv/gump/public/workspace/apache-httpd/modules/ssl -I/srv/gump/public/workspace/apache-httpd/modules/dav/main  -prefer-non-pic -static -c checkgid.c && touch checkgid.lo
/srv/gump/public/workspace/apr/dest-09042008/build-1/libtool --silent --mode=link ccache gcc -g -O2 -pthread        -o checkgid  checkgid.lo   -lm /srv/gump/public/workspace/apache-httpd/srclib/pcre/libpcre.la                             /srv/gump/public/workspace/apr-util/dest-09042008/lib/libaprutil-1.la -lexpat /srv/gump/public/workspace/apr/dest-09042008/lib/libapr-1.la -lrt -lcrypt -lpthread -ldl
/srv/gump/public/workspace/apr/dest-09042008/build-1/libtool --silent --mode=compile ccache gcc -g -O2 -pthread    -DLINUX=2 -D_REENTRANT -D_GNU_SOURCE -D_LARGEFILE64_SOURCE    -I/srv/gump/public/workspace/apache-httpd/srclib/pcre -I. -I/srv/gump/public/workspace/apache-httpd/os/unix -I/srv/gump/public/workspace/apache-httpd/server/mpm/prefork -I/srv/gump/public/workspace/apache-httpd/modules/http -I/srv/gump/public/workspace/apache-httpd/modules/filters -I/srv/gump/public/workspace/apache-httpd/modules/proxy -I/srv/gump/public/workspace/apache-httpd/modules/session -I/srv/gump/public/workspace/apache-httpd/include -I/srv/gump/public/workspace/apache-httpd/modules/generators -I/srv/gump/public/workspace/apache-httpd/modules/mappers -I/srv/gump/public/workspace/apache-httpd/modules/database -I/srv/gump/public/workspace/apr/dest-09042008/include/apr-1 -I/srv/gump/public/workspace/apr-util/dest-09042008/include/apr-1 -I/srv/gump/public/workspace/apache-httpd/modules/cache -I/srv
 /gump/public/workspace/apache-httpd/modules/proxy/../generators -I/srv/gump/public/workspace/apache-httpd/modules/ssl -I/srv/gump/public/workspace/apache-httpd/modules/dav/main  -prefer-non-pic -static -c htdbm.c && touch htdbm.lo
/srv/gump/public/workspace/apr/dest-09042008/build-1/libtool --silent --mode=link ccache gcc -g -O2 -pthread        -o htdbm  htdbm.lo   -lm /srv/gump/public/workspace/apache-httpd/srclib/pcre/libpcre.la                             /srv/gump/public/workspace/apr-util/dest-09042008/lib/libaprutil-1.la -lexpat /srv/gump/public/workspace/apr/dest-09042008/lib/libapr-1.la -lrt -lcrypt -lpthread -ldl
/srv/gump/public/workspace/apr/dest-09042008/build-1/libtool --silent --mode=compile ccache gcc -g -O2 -pthread    -DLINUX=2 -D_REENTRANT -D_GNU_SOURCE -D_LARGEFILE64_SOURCE    -I/srv/gump/public/workspace/apache-httpd/srclib/pcre -I. -I/srv/gump/public/workspace/apache-httpd/os/unix -I/srv/gump/public/workspace/apache-httpd/server/mpm/prefork -I/srv/gump/public/workspace/apache-httpd/modules/http -I/srv/gump/public/workspace/apache-httpd/modules/filters -I/srv/gump/public/workspace/apache-httpd/modules/proxy -I/srv/gump/public/workspace/apache-httpd/modules/session -I/srv/gump/public/workspace/apache-httpd/include -I/srv/gump/public/workspace/apache-httpd/modules/generators -I/srv/gump/public/workspace/apache-httpd/modules/mappers -I/srv/gump/public/workspace/apache-httpd/modules/database -I/srv/gump/public/workspace/apr/dest-09042008/include/apr-1 -I/srv/gump/public/workspace/apr-util/dest-09042008/include/apr-1 -I/srv/gump/public/workspace/apache-httpd/modules/cache -I/srv
 /gump/public/workspace/apache-httpd/modules/proxy/../generators -I/srv/gump/public/workspace/apache-httpd/modules/ssl -I/srv/gump/public/workspace/apache-httpd/modules/dav/main  -prefer-non-pic -static -c htcacheclean.c && touch htcacheclean.lo
/srv/gump/public/workspace/apr/dest-09042008/build-1/libtool --silent --mode=link ccache gcc -g -O2 -pthread        -o htcacheclean  htcacheclean.lo   -lm /srv/gump/public/workspace/apache-httpd/srclib/pcre/libpcre.la                             /srv/gump/public/workspace/apr-util/dest-09042008/lib/libaprutil-1.la -lexpat /srv/gump/public/workspace/apr/dest-09042008/lib/libapr-1.la -lrt -lcrypt -lpthread -ldl
/srv/gump/public/workspace/apr/dest-09042008/build-1/libtool --silent --mode=compile ccache gcc -g -O2 -pthread    -DLINUX=2 -D_REENTRANT -D_GNU_SOURCE -D_LARGEFILE64_SOURCE    -I/srv/gump/public/workspace/apache-httpd/srclib/pcre -I. -I/srv/gump/public/workspace/apache-httpd/os/unix -I/srv/gump/public/workspace/apache-httpd/server/mpm/prefork -I/srv/gump/public/workspace/apache-httpd/modules/http -I/srv/gump/public/workspace/apache-httpd/modules/filters -I/srv/gump/public/workspace/apache-httpd/modules/proxy -I/srv/gump/public/workspace/apache-httpd/modules/session -I/srv/gump/public/workspace/apache-httpd/include -I/srv/gump/public/workspace/apache-httpd/modules/generators -I/srv/gump/public/workspace/apache-httpd/modules/mappers -I/srv/gump/public/workspace/apache-httpd/modules/database -I/srv/gump/public/workspace/apr/dest-09042008/include/apr-1 -I/srv/gump/public/workspace/apr-util/dest-09042008/include/apr-1 -I/srv/gump/public/workspace/apache-httpd/modules/cache -I/srv
 /gump/public/workspace/apache-httpd/modules/proxy/../generators -I/srv/gump/public/workspace/apache-httpd/modules/ssl -I/srv/gump/public/workspace/apache-httpd/modules/dav/main  -prefer-non-pic -static -c httxt2dbm.c && touch httxt2dbm.lo
/srv/gump/public/workspace/apr/dest-09042008/build-1/libtool --silent --mode=link ccache gcc -g -O2 -pthread        -o httxt2dbm  httxt2dbm.lo   -lm /srv/gump/public/workspace/apache-httpd/srclib/pcre/libpcre.la                             /srv/gump/public/workspace/apr-util/dest-09042008/lib/libaprutil-1.la -lexpat /srv/gump/public/workspace/apr/dest-09042008/lib/libapr-1.la -lrt -lcrypt -lpthread -ldl
/srv/gump/public/workspace/apr/dest-09042008/build-1/libtool --silent --mode=compile ccache gcc -g -O2 -pthread    -DLINUX=2 -D_REENTRANT -D_GNU_SOURCE -D_LARGEFILE64_SOURCE    -I/srv/gump/public/workspace/apache-httpd/srclib/pcre -I. -I/srv/gump/public/workspace/apache-httpd/os/unix -I/srv/gump/public/workspace/apache-httpd/server/mpm/prefork -I/srv/gump/public/workspace/apache-httpd/modules/http -I/srv/gump/public/workspace/apache-httpd/modules/filters -I/srv/gump/public/workspace/apache-httpd/modules/proxy -I/srv/gump/public/workspace/apache-httpd/modules/session -I/srv/gump/public/workspace/apache-httpd/include -I/srv/gump/public/workspace/apache-httpd/modules/generators -I/srv/gump/public/workspace/apache-httpd/modules/mappers -I/srv/gump/public/workspace/apache-httpd/modules/database -I/srv/gump/public/workspace/apr/dest-09042008/include/apr-1 -I/srv/gump/public/workspace/apr-util/dest-09042008/include/apr-1 -I/srv/gump/public/workspace/apache-httpd/modules/cache -I/srv
 /gump/public/workspace/apache-httpd/modules/proxy/../generators -I/srv/gump/public/workspace/apache-httpd/modules/ssl -I/srv/gump/public/workspace/apache-httpd/modules/dav/main  -prefer-non-pic -static -c fcgistarter.c && touch fcgistarter.lo
/srv/gump/public/workspace/apr/dest-09042008/build-1/libtool --silent --mode=link ccache gcc -g -O2 -pthread        -o fcgistarter  fcgistarter.lo   -lm /srv/gump/public/workspace/apache-httpd/srclib/pcre/libpcre.la                             /srv/gump/public/workspace/apr-util/dest-09042008/lib/libaprutil-1.la -lexpat /srv/gump/public/workspace/apr/dest-09042008/lib/libapr-1.la -lrt -lcrypt -lpthread -ldl
make[2]: Leaving directory `/srv/gump/public/workspace/apache-httpd/support'
make[1]: Leaving directory `/srv/gump/public/workspace/apache-httpd/support'
make[1]: Entering directory `/srv/gump/public/workspace/apache-httpd'
/srv/gump/public/workspace/apr/dest-09042008/build-1/libtool --silent --mode=compile ccache gcc -g -O2 -pthread    -DLINUX=2 -D_REENTRANT -D_GNU_SOURCE -D_LARGEFILE64_SOURCE    -I/srv/gump/public/workspace/apache-httpd/srclib/pcre -I. -I/srv/gump/public/workspace/apache-httpd/os/unix -I/srv/gump/public/workspace/apache-httpd/server/mpm/prefork -I/srv/gump/public/workspace/apache-httpd/modules/http -I/srv/gump/public/workspace/apache-httpd/modules/filters -I/srv/gump/public/workspace/apache-httpd/modules/proxy -I/srv/gump/public/workspace/apache-httpd/modules/session -I/srv/gump/public/workspace/apache-httpd/include -I/srv/gump/public/workspace/apache-httpd/modules/generators -I/srv/gump/public/workspace/apache-httpd/modules/mappers -I/srv/gump/public/workspace/apache-httpd/modules/database -I/srv/gump/public/workspace/apr/dest-09042008/include/apr-1 -I/srv/gump/public/workspace/apr-util/dest-09042008/include/apr-1 -I/srv/gump/public/workspace/apache-httpd/modules/cache -I/srv
 /gump/public/workspace/apache-httpd/modules/proxy/../generators -I/srv/gump/public/workspace/apache-httpd/modules/ssl -I/srv/gump/public/workspace/apache-httpd/modules/dav/main  -prefer-non-pic -static -c modules.c && touch modules.lo
ccache gcc -g -O2 -pthread    -DLINUX=2 -D_REENTRANT -D_GNU_SOURCE -D_LARGEFILE64_SOURCE    -I/srv/gump/public/workspace/apache-httpd/srclib/pcre -I. -I/srv/gump/public/workspace/apache-httpd/os/unix -I/srv/gump/public/workspace/apache-httpd/server/mpm/prefork -I/srv/gump/public/workspace/apache-httpd/modules/http -I/srv/gump/public/workspace/apache-httpd/modules/filters -I/srv/gump/public/workspace/apache-httpd/modules/proxy -I/srv/gump/public/workspace/apache-httpd/modules/session -I/srv/gump/public/workspace/apache-httpd/include -I/srv/gump/public/workspace/apache-httpd/modules/generators -I/srv/gump/public/workspace/apache-httpd/modules/mappers -I/srv/gump/public/workspace/apache-httpd/modules/database -I/srv/gump/public/workspace/apr/dest-09042008/include/apr-1 -I/srv/gump/public/workspace/apr-util/dest-09042008/include/apr-1 -I/srv/gump/public/workspace/apache-httpd/modules/cache -I/srv/gump/public/workspace/apache-httpd/modules/proxy/../generators -I/srv/gump/public/wo
 rkspace/apache-httpd/modules/ssl -I/srv/gump/public/workspace/apache-httpd/modules/dav/main  -c /srv/gump/public/workspace/apache-httpd/server/buildmark.c
/srv/gump/public/workspace/apr/dest-09042008/build-1/libtool --silent --mode=link ccache gcc -g -O2 -pthread        -o httpd  modules.lo buildmark.o -export-dynamic server/libmain.la modules/aaa/libmod_authn_file.la modules/aaa/libmod_authn_default.la modules/aaa/libmod_authn_core.la modules/aaa/libmod_authz_host.la modules/aaa/libmod_authz_groupfile.la modules/aaa/libmod_authz_user.la modules/aaa/libmod_authz_core.la modules/aaa/libmod_authz_default.la modules/aaa/libmod_access_compat.la modules/aaa/libmod_auth_basic.la modules/aaa/libmod_auth_form.la modules/filters/libmod_include.la modules/filters/libmod_filter.la modules/loggers/libmod_log_config.la modules/metadata/libmod_env.la modules/metadata/libmod_setenvif.la modules/http/libmod_http.la modules/http/libmod_mime.la modules/generators/libmod_status.la modules/generators/libmod_autoindex.la modules/generators/libmod_asis.la modules/generators/libmod_cgi.la modules/mappers/libmod_negotiation.la modules/mappers/libmod_d
 ir.la modules/mappers/libmod_actions.la modules/mappers/libmod_userdir.la modules/mappers/libmod_alias.la modules/mappers/libmod_so.la server/mpm/prefork/libprefork.la os/unix/libos.la -lm /srv/gump/public/workspace/apache-httpd/srclib/pcre/libpcre.la                             /srv/gump/public/workspace/apr-util/dest-09042008/lib/libaprutil-1.la -lexpat /srv/gump/public/workspace/apr/dest-09042008/lib/libapr-1.la -lrt -lcrypt -lpthread -ldl 
modules/aaa/.libs/libmod_auth_form.a(mod_auth_form.o): In function `set_session_auth':
/srv/gump/public/workspace/apache-httpd/modules/aaa/mod_auth_form.c:501: undefined reference to `ap_session_set'
/srv/gump/public/workspace/apache-httpd/modules/aaa/mod_auth_form.c:502: undefined reference to `ap_session_set'
/srv/gump/public/workspace/apache-httpd/modules/aaa/mod_auth_form.c:503: undefined reference to `ap_session_set'
modules/aaa/.libs/libmod_auth_form.a(mod_auth_form.o): In function `get_session_auth':
/srv/gump/public/workspace/apache-httpd/modules/aaa/mod_auth_form.c:521: undefined reference to `ap_session_get'
/srv/gump/public/workspace/apache-httpd/modules/aaa/mod_auth_form.c:524: undefined reference to `ap_session_get'
/srv/gump/public/workspace/apache-httpd/modules/aaa/mod_auth_form.c:527: undefined reference to `ap_session_get'
collect2: ld returned 1 exit status
make[1]: *** [httpd] Error 1
make[1]: Leaving directory `/srv/gump/public/workspace/apache-httpd'
make: *** [all-recursive] Error 1
---------------------------------------------

To subscribe to this information via syndicated feeds:
- RSS: http://vmgump.apache.org/gump/public/apache-httpd/apache-httpd-make/rss.xml
- Atom: http://vmgump.apache.org/gump/public/apache-httpd/apache-httpd-make/atom.xml

============================== Gump Tracking Only ===
Produced by Gump version 2.3.
Gump Run 16000809042008, vmgump:vmgump-public:16000809042008
Gump E-mail Identifier (unique within run) #7.

*********************************************************** G U M P
[GUMP@vmgump]: Project asn1-der (in module asn1) failed
To whom it may engage...
        
This is an automated request, but not an unsolicited one. For 
more information please visit http://gump.apache.org/nagged.html, 
and/or contact the folk at general@gump.apache.org.

Project asn1-der has an issue affecting its community integration.
This issue affects 3 projects.
The current state of this project is 'Failed', with reason 'Build Failed'.
For reference only, the following projects are affected by this:
    - asn1-der :  Apache ASN.1 Tools
    - kerberos-common :  Apache Directory Project
    - kerberos-protocol :  Apache Kerberos Server


Full details are available at:
    http://vmgump.apache.org/gump/public/asn1/asn1-der/index.html

That said, some information snippets are provided here.

The following annotations (debug/informational/warning/error messages) were provided:
 -DEBUG- Sole output [asn1-der-09042008.jar] identifier set to project name
 -INFO- Making directory for Maven properties: [/srv/gump/public/workspace/asn1/der]
 -DEBUG- (Gump generated) Maven Properties in: /srv/gump/public/workspace/asn1/der/build.properties
 -INFO- Failed with reason build failed
 -INFO- Project Reports in: /srv/gump/public/workspace/asn1/der/target/test-reports
 -INFO- Failed to extract fallback artifacts from Gump Repository



The following work was performed:
http://vmgump.apache.org/gump/public/asn1/asn1-der/gump_work/build_asn1_asn1-der.html
Work Name: build_asn1_asn1-der (Type: Build)
Work ended in a state of : Failed
Elapsed: 4 secs
Command Line: maven --offline jar 
[Working Directory: /srv/gump/public/workspace/asn1/der]
CLASSPATH: /usr/lib/jvm/java-1.5.0-sun/lib/tools.jar:/srv/gump/public/workspace/junit/dist/junit-09042008.jar:/srv/gump/public/workspace/slf4j/slf4j-api/target/slf4j-api-1.5.1-SNAPSHOT.jar:/srv/gump/public/workspace/slf4j/slf4j-simple/target/slf4j-simple-1.5.1-SNAPSHOT.jar:/srv/gump/packages/maven-site-plugin/maven-site-plugin-1.6.1.jar
---------------------------------------------
 __  __
|  \/  |__ _Apache__ ___
| |\/| / _` \ V / -_) ' \  ~ intelligent projects ~
|_|  |_\__,_|\_/\___|_||_|  v. 1.0.2

build:start:

java:prepare-filesystem:
    [mkdir] Created dir: /srv/gump/public/workspace/asn1/der/target/classes

java:compile:
    [echo] Compiling to /srv/gump/public/workspace/asn1/der/target/classes
    [echo] No java source files to compile.
resources or todir was null

java:jar-resources:

test:prepare-filesystem:
    [mkdir] Created dir: /srv/gump/public/workspace/asn1/der/target/test-classes
    [mkdir] Created dir: /srv/gump/public/workspace/asn1/der/target/test-reports

test:test-resources:

test:compile:
    [echo] No test source files to compile.

test:test:
    [echo] No tests to run.

BUILD FAILED
File...... /home/gump/.maven/cache/maven-jar-plugin-1.6.1/plugin.jelly
Element... ant:fail
Line...... 53
Column.... 19
You must define currentVersion in your POM.
Total time: 3 seconds
Finished at: Wed Apr 09 10:34:33 GMT-08:00 2008

---------------------------------------------

To subscribe to this information via syndicated feeds:
- RSS: http://vmgump.apache.org/gump/public/asn1/asn1-der/rss.xml
- Atom: http://vmgump.apache.org/gump/public/asn1/asn1-der/atom.xml

============================== Gump Tracking Only ===
Produced by Gump version 2.3.
Gump Run 16000809042008, vmgump:vmgump-public:16000809042008
Gump E-mail Identifier (unique within run) #8.

*********************************************************** G U M P
[GUMP@vmgump]: Project nlog4j (in module nlog4j) failed
To whom it may engage...
        
This is an automated request, but not an unsolicited one. For 
more information please visit http://gump.apache.org/nagged.html, 
and/or contact the folk at general@gump.apache.org.

Project nlog4j has an issue affecting its community integration.
This issue affects 1 projects.
The current state of this project is 'Failed', with reason 'Build Failed'.
For reference only, the following projects are affected by this:
    - nlog4j


Full details are available at:
    http://vmgump.apache.org/gump/public/nlog4j/nlog4j/index.html

That said, some information snippets are provided here.

The following annotations (debug/informational/warning/error messages) were provided:
 -DEBUG- Sole output [nlog4j-09042008.jar] identifier set to project name
 -INFO- Failed with reason build failed
 -INFO- Failed to extract fallback artifacts from Gump Repository



The following work was performed:
http://vmgump.apache.org/gump/public/nlog4j/nlog4j/gump_work/build_nlog4j_nlog4j.html
Work Name: build_nlog4j_nlog4j (Type: Build)
Work ended in a state of : Failed
Elapsed: 6 secs
Command Line: /usr/lib/jvm/java-1.5.0-sun/bin/java -Djava.awt.headless=true -Xbootclasspath/p:/srv/gump/public/workspace/xml-commons/java/external/build/xml-apis.jar:/srv/gump/public/workspace/xml-xerces2/build/xercesImpl.jar org.apache.tools.ant.Main -Dgump.merge=/srv/gump/public/gump/work/merge.xml -Dbuild.sysclasspath=only -Dversion=09042008 nlog4j.jar 
[Working Directory: /srv/gump/public/workspace/nlog4j]
CLASSPATH: /usr/lib/jvm/java-1.5.0-sun/lib/tools.jar:/srv/gump/public/workspace/ant/dist/lib/ant-jmf.jar:/srv/gump/public/workspace/ant/dist/lib/ant-swing.jar:/srv/gump/public/workspace/ant/dist/lib/ant-apache-resolver.jar:/srv/gump/public/workspace/ant/dist/lib/ant-trax.jar:/srv/gump/public/workspace/ant/dist/lib/ant-junit.jar:/srv/gump/public/workspace/ant/dist/lib/ant-launcher.jar:/srv/gump/public/workspace/ant/dist/lib/ant-nodeps.jar:/srv/gump/public/workspace/ant/dist/lib/ant.jar:/srv/gump/public/workspace/xml-commons/java/external/build/xml-apis-ext.jar:/srv/gump/packages/jaf-1.1ea/activation.jar:/srv/gump/packages/javamail-1.4/mail.jar:/srv/gump/packages/javamail-1.4/lib/mailapi.jar:/srv/gump/packages/jms1.1/lib/jms.jar:/srv/gump/packages/jmx-1_2_1-bin/lib/jmxri.jar:/srv/gump/packages/jmx-1_2_1-bin/lib/jmxtools.jar:/srv/gump/public/workspace/slf4j/slf4j-api/target/slf4j-api-1.5.1-SNAPSHOT.jar:/srv/gump/public/workspace/slf4j/slf4j-simple/target/slf4j-simple-1.5.1-SNAPS
 HOT.jar:/srv/gump/public/workspace/slf4j/slf4j-log4j12/target/slf4j-log4j12-1.5.1-SNAPSHOT.jar:/srv/gump/public/workspace/slf4j/slf4j-jcl/target/slf4j-jcl-1.5.1-SNAPSHOT.jar:/srv/gump/public/workspace/slf4j/slf4j-jdk14/target/slf4j-jdk14-1.5.1-SNAPSHOT.jar:/srv/gump/public/workspace/slf4j/slf4j-nop/target/slf4j-nop-1.5.1-SNAPSHOT.jar:/srv/gump/public/workspace/slf4j/log4j-over-slf4j/target/log4j-over-slf4j-1.5.1-SNAPSHOT.jar:/srv/gump/public/workspace/slf4j/jcl104-over-slf4j/target/jcl104-over-slf4j-1.5.1-SNAPSHOT.jar
---------------------------------------------
    [javac] /srv/gump/public/workspace/nlog4j/src/java/org/apache/log4j/test/FQCNTest.java:75: warning: [deprecation] DEBUG in org.apache.log4j.Priority has been deprecated
    [javac]     super.log(FQCN, Priority.DEBUG, message + " world.", null);    
    [javac]                             ^
    [javac] /srv/gump/public/workspace/nlog4j/src/java/org/apache/log4j/test/FQCNTest.java:80: warning: [deprecation] DEBUG in org.apache.log4j.Priority has been deprecated
    [javac]     super.log(FQCN, Priority.DEBUG, message, null); 
    [javac]                             ^
    [javac] /srv/gump/public/workspace/nlog4j/src/java/org/apache/log4j/test/PatternTest.java:58: warning: [deprecation] FATAL in org.apache.log4j.Priority has been deprecated
    [javac]     CAT.log(Priority.FATAL, "Message " + ++i);
    [javac]                     ^
    [javac] /srv/gump/public/workspace/nlog4j/src/java/org/apache/log4j/test/PatternTest.java:59: warning: [deprecation] FATAL in org.apache.log4j.Priority has been deprecated
    [javac]     root.log(Priority.FATAL, "Message " + i);    
    [javac]                      ^
    [javac] /srv/gump/public/workspace/nlog4j/src/java/org/apache/log4j/test/PatternTest.java:74: warning: [deprecation] FATAL in org.apache.log4j.Priority has been deprecated
    [javac]     CAT.log(Priority.FATAL, "Message " + ++i, e);
    [javac]                     ^
    [javac] /srv/gump/public/workspace/nlog4j/src/java/org/apache/log4j/test/PatternTest.java:75: warning: [deprecation] FATAL in org.apache.log4j.Priority has been deprecated
    [javac]     root.log(Priority.FATAL, "Message " + i, e);    
    [javac]                      ^
    [javac] /srv/gump/public/workspace/nlog4j/src/java/org/apache/log4j/varia/FallbackErrorHandler.java:51: addElement(java.lang.Object) in java.util.Vector cannot be applied to (org.apache.log4j.Logger)
    [javac]     loggers.addElement(logger);
    [javac]            ^
    [javac] /srv/gump/public/workspace/nlog4j/src/java/org/apache/log4j/varia/FallbackErrorHandler.java:80: inconvertible types
    [javac] found   : java.lang.Object
    [javac] required: org.apache.log4j.Logger
    [javac]       Logger l = (Logger) loggers.elementAt(i);
    [javac]                                            ^
    [javac] /srv/gump/public/workspace/nlog4j/src/java/org/slf4j/impl/NLOG4JLoggerFactory.java:43: incompatible types
    [javac] found   : org.apache.log4j.Logger
    [javac] required: org.slf4j.Logger
    [javac]     return LogManager.getLogger(name);  
    [javac]                                ^
    [javac] /srv/gump/public/workspace/nlog4j/src/java/org/apache/log4j/xml/DOMConfigurator.java:334: inconvertible types
    [javac] found   : java.lang.Object
    [javac] required: org.apache.log4j.Logger
    [javac] 	 cat = (Logger) getInstanceMethod.invoke(null, new Object[] {catName});
    [javac]                                                 ^
    [javac] /srv/gump/public/workspace/nlog4j/src/java/org/apache/log4j/xml/DOMConfigurator.java:413: cannot find symbol
    [javac] symbol  : constructor PropertySetter(org.apache.log4j.Logger)
    [javac] location: class org.apache.log4j.config.PropertySetter
    [javac]     PropertySetter propSetter = new PropertySetter(cat);
    [javac]                                 ^
    [javac] Note: Some input files use unchecked or unsafe operations.
    [javac] Note: Recompile with -Xlint:unchecked for details.
    [javac] 41 errors
    [javac] 15 warnings

BUILD FAILED
/srv/gump/public/workspace/nlog4j/build.xml:195: Compile failed; see the compiler error output for details.

Total time: 5 seconds
---------------------------------------------

To subscribe to this information via syndicated feeds:
- RSS: http://vmgump.apache.org/gump/public/nlog4j/nlog4j/rss.xml
- Atom: http://vmgump.apache.org/gump/public/nlog4j/nlog4j/atom.xml

============================== Gump Tracking Only ===
Produced by Gump version 2.3.
Gump Run 16000809042008, vmgump:vmgump-public:16000809042008
Gump E-mail Identifier (unique within run) #10.

*********************************************************** G U M P
[GUMP@vmgump]: Project ws-commons-axiom (in module ws-axis2-commons) failed
To whom it may engage...
        
This is an automated request, but not an unsolicited one. For 
more information please visit http://gump.apache.org/nagged.html, 
and/or contact the folk at general@gump.apache.org.

Project ws-commons-axiom has an issue affecting its community integration.
This issue affects 2 projects.
The current state of this project is 'Failed', with reason 'Build Failed'.
For reference only, the following projects are affected by this:
    - ws-commons-axiom :  Common stuff for the WS projects.
    - ws-commons-policy :  Common stuff for the WS projects.


Full details are available at:
    http://vmgump.apache.org/gump/public/ws-axis2-commons/ws-commons-axiom/index.html

That said, some information snippets are provided here.

The following annotations (debug/informational/warning/error messages) were provided:
 -DEBUG- Dependency on stax exists, no need to add for property maven.jar.stax-api.
 -DEBUG- Dependency on javamail exists, no need to add for property maven.jar.mail.
 -DEBUG- Dependency on jaf exists, no need to add for property maven.jar.geronimo-spec-activation.
 -DEBUG- (Gump generated) Maven Properties in: /srv/gump/public/workspace/ws-axis2-commons/axiom/build.properties
 -INFO- Failed with reason build failed
 -INFO- Failed to extract fallback artifacts from Gump Repository



The following work was performed:
http://vmgump.apache.org/gump/public/ws-axis2-commons/ws-commons-axiom/gump_work/build_ws-axis2-commons_ws-commons-axiom.html
Work Name: build_ws-axis2-commons_ws-commons-axiom (Type: Build)
Work ended in a state of : Failed
Elapsed: 4 secs
Command Line: maven --offline jar 
[Working Directory: /srv/gump/public/workspace/ws-axis2-commons/axiom]
CLASSPATH: /usr/lib/jvm/java-1.5.0-sun/lib/tools.jar:/srv/gump/public/workspace/logging-log4j-12/dist/lib/log4j-09042008.jar:/srv/gump/public/workspace/xml-commons/java/external/build/xml-apis-ext.jar:/srv/gump/public/workspace/xml-security/build/xmlsec-09042008.jar:/srv/gump/public/workspace/xmlunit/build/lib/xmlunit-09042008.jar:/srv/gump/public/workspace/junit/dist/junit-09042008.jar:/srv/gump/packages/jaf-1.1ea/activation.jar:/srv/gump/packages/javamail-1.4/mail.jar:/srv/gump/packages/javamail-1.4/lib/mailapi.jar:/srv/gump/public/workspace/jaxen/target/jaxen-09042008.jar:/srv/gump/packages/jsse1.0.3/lib/jcert.jar:/srv/gump/packages/jsse1.0.3/lib/jnet.jar:/srv/gump/packages/jsse1.0.3/lib/jsse.jar:/srv/gump/packages/jms1.1/lib/jms.jar:/srv/gump/packages/stax/jsr173_1.0_ri.jar
---------------------------------------------
 __  __
|  \/  |__ _Apache__ ___
| |\/| / _` \ V / -_) ' \  ~ intelligent projects ~
|_|  |_\__,_|\_/\___|_||_|  v. 1.0.2

build:start:

java:prepare-filesystem:
    [mkdir] Created dir: /srv/gump/public/workspace/ws-axis2-commons/axiom/target/classes

java:compile:
    [echo] Compiling to /srv/gump/public/workspace/ws-axis2-commons/axiom/target/classes
    [echo] No java source files to compile.
resources or todir was null

java:jar-resources:

test:prepare-filesystem:
    [mkdir] Created dir: /srv/gump/public/workspace/ws-axis2-commons/axiom/target/test-classes
    [mkdir] Created dir: /srv/gump/public/workspace/ws-axis2-commons/axiom/target/test-reports

test:test-resources:

test:compile:
    [echo] No test source files to compile.

test:test:
    [echo] No tests to run.

BUILD FAILED
File...... /home/gump/.maven/cache/maven-jar-plugin-1.6.1/plugin.jelly
Element... ant:fail
Line...... 53
Column.... 19
You must define currentVersion in your POM.
Total time: 3 seconds
Finished at: Wed Apr 09 10:52:47 GMT-08:00 2008

---------------------------------------------

To subscribe to this information via syndicated feeds:
- RSS: http://vmgump.apache.org/gump/public/ws-axis2-commons/ws-commons-axiom/rss.xml
- Atom: http://vmgump.apache.org/gump/public/ws-axis2-commons/ws-commons-axiom/atom.xml

============================== Gump Tracking Only ===
Produced by Gump version 2.3.
Gump Run 16000809042008, vmgump:vmgump-public:16000809042008
Gump E-mail Identifier (unique within run) #12.

*********************************************************** G U M P
[GUMP@vmgump]: Project portals-pluto-portal-1.0 (in module portals-pluto-1.0) failed
To whom it may engage...
        
This is an automated request, but not an unsolicited one. For 
more information please visit http://gump.apache.org/nagged.html, 
and/or contact the folk at general@gump.apache.org.

Project portals-pluto-portal-1.0 has an issue affecting its community integration.
This issue affects 1 projects.
The current state of this project is 'Failed', with reason 'Build Failed'.
For reference only, the following projects are affected by this:
    - portals-pluto-portal-1.0 :  JSR168 Container


Full details are available at:
    http://vmgump.apache.org/gump/public/portals-pluto-1.0/portals-pluto-portal-1.0/index.html

That said, some information snippets are provided here.

The following annotations (debug/informational/warning/error messages) were provided:
 -DEBUG- Dependency on ant exists, no need to add for property env.ANT_HOME.
 -INFO- Failed with reason build failed
 -INFO- Failed to extract fallback artifacts from Gump Repository



The following work was performed:
http://vmgump.apache.org/gump/public/portals-pluto-1.0/portals-pluto-portal-1.0/gump_work/build_portals-pluto-1.0_portals-pluto-portal-1.0.html
Work Name: build_portals-pluto-1.0_portals-pluto-portal-1.0 (Type: Build)
Work ended in a state of : Failed
Elapsed: 9 secs
Command Line: /usr/lib/jvm/java-1.5.0-sun/bin/java -Djava.awt.headless=true -Xbootclasspath/p:/srv/gump/public/workspace/xml-commons/java/external/build/xml-apis.jar:/srv/gump/public/workspace/xml-xerces2/build/xercesImpl.jar org.apache.tools.ant.Main -Dgump.merge=/srv/gump/public/gump/work/merge.xml -Dbuild.sysclasspath=only -Denv.ANT_HOME=/srv/gump/public/workspace/ant/dist -Dversion=09042008 -Dfinal.portal.name=pluto-portal-impl-09042008 all 
[Working Directory: /srv/gump/public/workspace/portals-pluto-1.0]
CLASSPATH: /usr/lib/jvm/java-1.5.0-sun/lib/tools.jar:/srv/gump/public/workspace/portals-pluto-1.0/build/ant/lib/ForeachTask.jar:/srv/gump/public/workspace/ant/dist/lib/ant-jmf.jar:/srv/gump/public/workspace/ant/dist/lib/ant-swing.jar:/srv/gump/public/workspace/ant/dist/lib/ant-apache-resolver.jar:/srv/gump/public/workspace/ant/dist/lib/ant-trax.jar:/srv/gump/public/workspace/ant/dist/lib/ant-junit.jar:/srv/gump/public/workspace/ant/dist/lib/ant-launcher.jar:/srv/gump/public/workspace/ant/dist/lib/ant-nodeps.jar:/srv/gump/public/workspace/ant/dist/lib/ant.jar:/srv/gump/packages/junit3.8.1/junit.jar:/srv/gump/public/workspace/xml-commons/java/build/resolver.jar:/srv/gump/public/workspace/castor/dist/castor-09042008.jar:/srv/gump/public/workspace/castor/dist/castor-09042008-xml.jar:/srv/gump/public/workspace/apache-commons/fileupload/target/commons-fileupload-09042008.jar:/srv/gump/public/workspace/apache-commons/logging/target/commons-logging-09042008.jar:/srv/gump/public/works
 pace/apache-commons/logging/target/commons-logging-api-09042008.jar:/srv/gump/public/workspace/junit/dist/junit-09042008.jar:/srv/gump/public/workspace/jakarta-regexp/build/jakarta-regexp-09042008.jar:/srv/gump/public/workspace/jakarta-servletapi-5/jsr154/dist/lib/servlet-api.jar:/srv/gump/public/workspace/jakarta-servletapi-5/jsr152/dist/lib/jsp-api.jar:/srv/gump/public/workspace/portals-pluto-1.0/api/target/portlet-api-1.0.jar:/srv/gump/public/workspace/portals-pluto-1.0/container/target/pluto-1.0.jar:/srv/gump/public/workspace/portals-pluto-1.0/descriptors/target/pluto-descriptors-1.0.jar:/srv/gump/public/workspace/xml-commons/java/external/build/xml-apis-ext.jar
---------------------------------------------
    [javac]                                            ^
    [javac] /srv/gump/public/workspace/portals-pluto-1.0/portal/src/java/org/apache/pluto/portalImpl/core/PortalURL.java:179: warning: [deprecation] encode(java.lang.String) in java.net.URLEncoder has been deprecated
    [javac]         value = URLEncoder.encode(value);
    [javac]                           ^
    [javac] /srv/gump/public/workspace/portals-pluto-1.0/portal/src/java/org/apache/pluto/portalImpl/services/portletdefinitionregistry/PortletDefinitionRegistryServiceContextImpl.java:113: exception java.io.IOException is never thrown in body of corresponding try statement
    [javac]         } catch (IOException e) {
    [javac]           ^
    [javac] /srv/gump/public/workspace/portals-pluto-1.0/portal/src/java/org/apache/pluto/portalImpl/services/portletdefinitionregistry/PortletDefinitionRegistryServiceContextImpl.java:115: exception org.exolab.castor.mapping.MappingException is never thrown in body of corresponding try statement
    [javac]         } catch (MappingException e) {
    [javac]           ^
    [javac] /srv/gump/public/workspace/portals-pluto-1.0/portal/src/java/org/apache/pluto/portalImpl/servlet/ServletRequestImpl.java:32: warning: [deprecation] getRealPath(java.lang.String) in javax.servlet.ServletRequest has been deprecated
    [javac] public class ServletRequestImpl extends javax.servlet.http.HttpServletRequestWrapper 
    [javac]        ^
    [javac] /srv/gump/public/workspace/portals-pluto-1.0/portal/src/java/org/apache/pluto/portalImpl/servlet/ServletRequestImpl.java:32: warning: [deprecation] isRequestedSessionIdFromUrl() in javax.servlet.http.HttpServletRequest has been deprecated
    [javac] public class ServletRequestImpl extends javax.servlet.http.HttpServletRequestWrapper 
    [javac]        ^
    [javac] /srv/gump/public/workspace/portals-pluto-1.0/portal/src/java/org/apache/pluto/portalImpl/servlet/ServletRequestImpl.java:32: warning: [deprecation] getRealPath(java.lang.String) in javax.servlet.ServletRequest has been deprecated
    [javac] public class ServletRequestImpl extends javax.servlet.http.HttpServletRequestWrapper 
    [javac]        ^
    [javac] /srv/gump/public/workspace/portals-pluto-1.0/portal/src/java/org/apache/pluto/portalImpl/servlet/ServletResponseImpl.java:24: warning: [deprecation] setStatus(int,java.lang.String) in javax.servlet.http.HttpServletResponse has been deprecated
    [javac] public class ServletResponseImpl extends javax.servlet.http.HttpServletResponseWrapper 
    [javac]        ^
    [javac] /srv/gump/public/workspace/portals-pluto-1.0/portal/src/java/org/apache/pluto/portalImpl/servlet/ServletResponseImpl.java:24: warning: [deprecation] encodeRedirectUrl(java.lang.String) in javax.servlet.http.HttpServletResponse has been deprecated
    [javac] public class ServletResponseImpl extends javax.servlet.http.HttpServletResponseWrapper 
    [javac]        ^
    [javac] /srv/gump/public/workspace/portals-pluto-1.0/portal/src/java/org/apache/pluto/portalImpl/servlet/ServletResponseImpl.java:24: warning: [deprecation] encodeUrl(java.lang.String) in javax.servlet.http.HttpServletResponse has been deprecated
    [javac] public class ServletResponseImpl extends javax.servlet.http.HttpServletResponseWrapper 
    [javac]        ^
    [javac] /srv/gump/public/workspace/portals-pluto-1.0/portal/src/java/org/apache/pluto/portalImpl/servlet/StoredServletResponseImpl.java:27: warning: [deprecation] setStatus(int,java.lang.String) in javax.servlet.http.HttpServletResponse has been deprecated
    [javac] public class StoredServletResponseImpl extends ServletResponseImpl 
    [javac]        ^
    [javac] /srv/gump/public/workspace/portals-pluto-1.0/portal/src/java/org/apache/pluto/portalImpl/servlet/StoredServletResponseImpl.java:27: warning: [deprecation] encodeRedirectUrl(java.lang.String) in javax.servlet.http.HttpServletResponse has been deprecated
    [javac] public class StoredServletResponseImpl extends ServletResponseImpl 
    [javac]        ^
    [javac] /srv/gump/public/workspace/portals-pluto-1.0/portal/src/java/org/apache/pluto/portalImpl/servlet/StoredServletResponseImpl.java:27: warning: [deprecation] encodeUrl(java.lang.String) in javax.servlet.http.HttpServletResponse has been deprecated
    [javac] public class StoredServletResponseImpl extends ServletResponseImpl 
    [javac]        ^
    [javac] /srv/gump/public/workspace/portals-pluto-1.0/portal/src/java/org/apache/pluto/portlet/admin/services/DeployWarService.java:165: warning: [deprecation] org.apache.pluto.portalImpl.Deploy in org.apache.pluto.portalImpl has been deprecated
    [javac] 		            org.apache.pluto.portalImpl.Deploy.main(args);
    [javac]                                                        ^
    [javac] Note: Some input files use unchecked or unsafe operations.
    [javac] Note: Recompile with -Xlint:unchecked for details.
    [javac] 2 errors
    [javac] 17 warnings

BUILD FAILED
/srv/gump/public/workspace/portals-pluto-1.0/build.xml:51: The following error occurred while executing this line:
/srv/gump/public/workspace/portals-pluto-1.0/portal/build.xml:50: Compile failed; see the compiler error output for details.

Total time: 8 seconds
---------------------------------------------

To subscribe to this information via syndicated feeds:
- RSS: http://vmgump.apache.org/gump/public/portals-pluto-1.0/portals-pluto-portal-1.0/rss.xml
- Atom: http://vmgump.apache.org/gump/public/portals-pluto-1.0/portals-pluto-portal-1.0/atom.xml

============================== Gump Tracking Only ===
Produced by Gump version 2.3.
Gump Run 16000809042008, vmgump:vmgump-public:16000809042008
Gump E-mail Identifier (unique within run) #15.

*********************************************************** G U M P
[GUMP@vmgump]: Project xml-security-tests (in module xml-security) failed
To whom it may engage...
        
This is an automated request, but not an unsolicited one. For 
more information please visit http://gump.apache.org/nagged.html, 
and/or contact the folk at general@gump.apache.org.

Project xml-security-tests has an issue affecting its community integration.
This issue affects 1 projects.
The current state of this project is 'Failed', with reason 'Build Failed'.
For reference only, the following projects are affected by this:
    - xml-security-tests :  XML-Signature Syntax and Processing


Full details are available at:
    http://vmgump.apache.org/gump/public/xml-security/xml-security-tests/index.html

That said, some information snippets are provided here.

The following annotations (debug/informational/warning/error messages) were provided:
 -DEBUG- Dependency on jce exists, no need to add for property lib.jce.
 -INFO- Failed with reason build failed



The following work was performed:
http://vmgump.apache.org/gump/public/xml-security/xml-security-tests/gump_work/build_xml-security_xml-security-tests.html
Work Name: build_xml-security_xml-security-tests (Type: Build)
Work ended in a state of : Failed
Elapsed: 8 mins 24 secs
Command Line: /usr/lib/jvm/java-1.5.0-sun/bin/java -Djava.awt.headless=true -Dant.build.clonevm=true -Xbootclasspath/p:/srv/gump/public/workspace/xml-commons/java/external/build/xml-apis.jar:/srv/gump/public/workspace/xml-xerces2/build/xercesImpl.jar:/srv/gump/public/workspace/xml-xalan/build/serializer.jar:/srv/gump/public/workspace/xml-xalan/build/xalan-unbundled.jar org.apache.tools.ant.Main -Dgump.merge=/srv/gump/public/gump/work/merge.xml -Dbuild.sysclasspath=only -Djce.download.sha1=c1f0e975e8c8e0a0105787b249a50615b485d109 -Dlib.jce=/srv/gump/packages/jce/jce-jdk13-116.jar -Djce.download.md5=85c64cd754719a4bc8da7e9aa0e113fd test 
[Working Directory: /srv/gump/public/workspace/xml-security]
CLASSPATH: /usr/lib/jvm/java-1.5.0-sun/lib/tools.jar:/srv/gump/public/workspace/xml-security/build/test:/srv/gump/public/workspace/xml-security:/srv/gump/public/workspace/xml-security/build/xmlsec-09042008.jar:/srv/gump/public/workspace/ant/dist/lib/ant-jmf.jar:/srv/gump/public/workspace/ant/dist/lib/ant-swing.jar:/srv/gump/public/workspace/ant/dist/lib/ant-apache-resolver.jar:/srv/gump/public/workspace/ant/dist/lib/ant-trax.jar:/srv/gump/public/workspace/ant/dist/lib/ant-junit.jar:/srv/gump/public/workspace/ant/dist/lib/ant-launcher.jar:/srv/gump/public/workspace/ant/dist/lib/ant-nodeps.jar:/srv/gump/public/workspace/ant/dist/lib/ant.jar:/srv/gump/packages/junit3.8.1/junit.jar:/srv/gump/public/workspace/xml-commons/java/build/resolver.jar:/srv/gump/public/workspace/xml-commons/java/external/build/xml-apis-ext.jar:/srv/gump/packages/jce/jce-jdk13-116.jar:/srv/gump/public/workspace/apache-commons/logging/target/commons-logging-09042008.jar:/srv/gump/public/workspace/apache-com
 mons/logging/target/commons-logging-api-09042008.jar:/srv/gump/public/workspace/junit/dist/junit-09042008.jar
---------------------------------------------
    [junit] Testcase: testBug40783 took 0.031 sec
    [junit] Running org.apache.xml.security.test.utils.Base64Test
    [junit] Testsuite: org.apache.xml.security.test.utils.Base64Test
    [junit] Tests run: 3, Failures: 0, Errors: 0, Time elapsed: 0.13 sec
    [junit] Tests run: 3, Failures: 0, Errors: 0, Time elapsed: 0.13 sec
    [junit] 
    [junit] Testcase: testA1 took 0.015 sec
    [junit] Testcase: testWrap1 took 0.001 sec
    [junit] Testcase: testWrap2 took 0.001 sec
    [junit] Running org.apache.xml.security.test.utils.IdResolverTest
    [junit] Testsuite: org.apache.xml.security.test.utils.IdResolverTest
    [junit] Tests run: 3, Failures: 0, Errors: 0, Time elapsed: 0.312 sec
    [junit] Tests run: 3, Failures: 0, Errors: 0, Time elapsed: 0.312 sec
    [junit] 
    [junit] Testcase: testIdSoap took 0.071 sec
    [junit] Testcase: testIdWithOtherIdSoap took 0.005 sec
    [junit] Testcase: testANoId took 0.01 sec
    [junit] Running org.apache.xml.security.test.utils.OldApiTest
    [junit] Testsuite: org.apache.xml.security.test.utils.OldApiTest
    [junit] Tests run: 4, Failures: 0, Errors: 0, Time elapsed: 0.721 sec
    [junit] Tests run: 4, Failures: 0, Errors: 0, Time elapsed: 0.721 sec
    [junit] 
    [junit] Testcase: testOldTransformSpiApi took 0.427 sec
    [junit] Testcase: testOldResourceResolverSpi took 0.006 sec
    [junit] Testcase: testOldKeyResolverSpi took 0.011 sec
    [junit] Testcase: testOldKeyResolverSpiInKeyInfo took 0.005 sec
    [junit] Running org.apache.xml.security.test.utils.resolver.AllTests
    [junit] Testsuite: org.apache.xml.security.test.utils.resolver.AllTests
    [junit] Tests run: 3, Failures: 0, Errors: 0, Time elapsed: 0.183 sec
    [junit] Tests run: 3, Failures: 0, Errors: 0, Time elapsed: 0.183 sec
    [junit] 
    [junit] Testcase: testCustomResolver took 0.025 sec
    [junit] Testcase: testLocalFileWithEmptyBaseURI took 0.006 sec
    [junit] Testcase: testBug40783 took 0.009 sec
    [junit] Running org.apache.xml.security.test.utils.resolver.ResourceResolverTest
    [junit] Testsuite: org.apache.xml.security.test.utils.resolver.ResourceResolverTest
    [junit] Tests run: 2, Failures: 0, Errors: 0, Time elapsed: 0.092 sec
    [junit] Tests run: 2, Failures: 0, Errors: 0, Time elapsed: 0.092 sec
    [junit] 
    [junit] Testcase: testCustomResolver took 0.022 sec
    [junit] Testcase: testLocalFileWithEmptyBaseURI took 0.014 sec
[junitreport] Processing /srv/gump/public/workspace/xml-security/build/docs/xml/junit/TESTS-TestSuites.xml to /tmp/null1863904726
[junitreport] Loading stylesheet jar:file:/srv/gump/public/workspace/ant/dist/lib/ant-junit.jar!/org/apache/tools/ant/taskdefs/optional/junit/xsl/junit-frames.xsl
[junitreport] Transform time: 26930ms
[junitreport] Deleting: /tmp/null1863904726

BUILD FAILED
/srv/gump/public/workspace/xml-security/build.xml:415: Unit Tests Failed

Total time: 8 minutes 21 seconds
---------------------------------------------

To subscribe to this information via syndicated feeds:
- RSS: http://vmgump.apache.org/gump/public/xml-security/xml-security-tests/rss.xml
- Atom: http://vmgump.apache.org/gump/public/xml-security/xml-security-tests/atom.xml

============================== Gump Tracking Only ===
Produced by Gump version 2.3.
Gump Run 16000809042008, vmgump:vmgump-public:16000809042008
Gump E-mail Identifier (unique within run) #16.

*********************************************************** G U M P
[GUMP@vmgump]: Project JacORB-idllib (in module JacORB) failed
To whom it may engage...
        
This is an automated request, but not an unsolicited one. For 
more information please visit http://gump.apache.org/nagged.html, 
and/or contact the folk at general@gump.apache.org.

Project JacORB-idllib has an issue affecting its community integration.
The current state of this project is 'Failed', with reason 'Update Failed'.

Full details are available at:
    http://vmgump.apache.org/gump/public/JacORB/JacORB-idllib/index.html

That said, some information snippets are provided here.

The following annotations (debug/informational/warning/error messages) were provided:
 -DEBUG- Sole output [idl.jar] identifier set to project name
 -INFO- Failed with reason update failed
 -INFO- Failed to extract fallback artifacts from Gump Repository

To subscribe to this information via syndicated feeds:
- RSS: http://vmgump.apache.org/gump/public/JacORB/JacORB-idllib/rss.xml
- Atom: http://vmgump.apache.org/gump/public/JacORB/JacORB-idllib/atom.xml

============================== Gump Tracking Only ===
Produced by Gump version 2.3.
Gump Run 16000809042008, vmgump:vmgump-public:16000809042008
Gump E-mail Identifier (unique within run) #19.

*********************************************************** G U M P
[GUMP@vmgump]: Project jetty (in module jetty) failed
To whom it may engage...
        
This is an automated request, but not an unsolicited one. For 
more information please visit http://gump.apache.org/nagged.html, 
and/or contact the folk at general@gump.apache.org.

Project jetty has an issue affecting its community integration.
This issue affects 5 projects.
The current state of this project is 'Failed', with reason 'Build Failed'.
For reference only, the following projects are affected by this:
    - apollo :  Apollo Project
    - cargo :  Cargo provides a Java API to manipulate Java Containers
    - htmlunit :  A tool for testing web based applications
    - jetty :  Java HTTP Servlet Server
    - muse :  Muse Project


Full details are available at:
    http://vmgump.apache.org/gump/public/jetty/jetty/index.html

That said, some information snippets are provided here.

The following annotations (debug/informational/warning/error messages) were provided:
 -DEBUG- (Gump generated) Maven2 Settings in: /srv/gump/public/workspace/jetty/gump_mvn_settings.xml
 -INFO- Failed with reason build failed
 -DEBUG- Maven POM in: /srv/gump/public/workspace/jetty/pom.xml
 -INFO- Failed to extract fallback artifacts from Gump Repository



The following work was performed:
http://vmgump.apache.org/gump/public/jetty/jetty/gump_work/build_jetty_jetty.html
Work Name: build_jetty_jetty (Type: Build)
Work ended in a state of : Failed
Elapsed: 6 mins 21 secs
Command Line: mvn --settings /srv/gump/public/workspace/jetty/gump_mvn_settings.xml package 
[Working Directory: /srv/gump/public/workspace/jetty]
CLASSPATH: /usr/lib/jvm/java-1.5.0-sun/lib/tools.jar:/srv/gump/public/workspace/jetty/target/classes:/srv/gump/public/workspace/ant/dist/lib/ant-jmf.jar:/srv/gump/public/workspace/ant/dist/lib/ant-swing.jar:/srv/gump/public/workspace/ant/dist/lib/ant-apache-resolver.jar:/srv/gump/public/workspace/ant/dist/lib/ant-trax.jar:/srv/gump/public/workspace/ant/dist/lib/ant-junit.jar:/srv/gump/public/workspace/ant/dist/lib/ant-launcher.jar:/srv/gump/public/workspace/ant/dist/lib/ant-nodeps.jar:/srv/gump/public/workspace/ant/dist/lib/ant.jar:/srv/gump/public/workspace/jakarta-servletapi-5/jsr154/dist/lib/servlet-api.jar:/srv/gump/public/workspace/junit/dist/junit-09042008.jar:/srv/gump/public/workspace/slf4j/slf4j-api/target/slf4j-api-1.5.1-SNAPSHOT.jar:/srv/gump/public/workspace/slf4j/slf4j-simple/target/slf4j-simple-1.5.1-SNAPSHOT.jar:/srv/gump/public/workspace/slf4j/slf4j-log4j12/target/slf4j-log4j12-1.5.1-SNAPSHOT.jar:/srv/gump/public/workspace/slf4j/slf4j-jcl/target/slf4j-jcl-1.5.
 1-SNAPSHOT.jar:/srv/gump/public/workspace/slf4j/slf4j-jdk14/target/slf4j-jdk14-1.5.1-SNAPSHOT.jar:/srv/gump/public/workspace/slf4j/slf4j-nop/target/slf4j-nop-1.5.1-SNAPSHOT.jar:/srv/gump/public/workspace/slf4j/log4j-over-slf4j/target/log4j-over-slf4j-1.5.1-SNAPSHOT.jar:/srv/gump/public/workspace/slf4j/jcl104-over-slf4j/target/jcl104-over-slf4j-1.5.1-SNAPSHOT.jar:/srv/gump/public/workspace/mx4j/dist/lib/mx4j-impl.jar:/srv/gump/public/workspace/mx4j/dist/lib/mx4j-jmx.jar:/srv/gump/public/workspace/mx4j/dist/lib/mx4j.jar:/srv/gump/public/workspace/mx4j/tools-dist/lib/mx4j-tools.jar:/srv/gump/public/workspace/xml-commons/java/external/build/xml-apis-ext.jar:/srv/gump/packages/commons-el-1.0/commons-el.jar:/srv/gump/packages/javamail-1.4/mail.jar:/srv/gump/packages/javamail-1.4/lib/mailapi.jar:/srv/gump/packages/jaf-1.1ea/activation.jar
---------------------------------------------
Tests run: 1, Failures: 0, Errors: 1, Skipped: 0, Time elapsed: 3.239 sec <<< FAILURE!
Running org.mortbay.jetty.plus.jaas.TestJAASUserRealm
props {
org.mortbay.jetty.plus.jaas.spi.PropertyFileLoginModule required
debug="true"
file="/tmp/props6582.tmp";
};
ds {
org.mortbay.jetty.plus.jaas.spi.DataSourceLoginModule required
debug="true"
dbJNDIName="ds"
userTable="myusers"
userField="myuser"
credentialField="mypassword"
userRoleTable="myuserroles"
userRoleUserField="myuser"
userRoleRoleField="myrole";
};
2080 [main] INFO org.mortbay.log - Logging to org.slf4j.impl.SimpleLogger(org.mortbay.log) via org.mortbay.log.Slf4jLog
8863 [main] WARN org.mortbay.log - No CallbackHandler configured: using DefaultCallbackHandler
9346 [main] WARN org.mortbay.log - javax.security.auth.login.LoginException: Login Failure: all modules ignored
9351 [main] WARN org.mortbay.log - No CallbackHandler configured: using DefaultCallbackHandler
9552 [main] WARN org.mortbay.log - No CallbackHandler configured: using DefaultCallbackHandler
9554 [main] WARN org.mortbay.log - javax.security.auth.login.LoginException: Login Failure: all modules ignored
9558 [main] WARN org.mortbay.log - No CallbackHandler configured: using DefaultCallbackHandler
Tests run: 2, Failures: 0, Errors: 0, Skipped: 0, Time elapsed: 7.579 sec
Running org.mortbay.jetty.plus.naming.TestNamingEntries
org.mortbay.jetty.plus.naming.TestNamingEntries$SomeOtherObject@111ded2
Tests run: 4, Failures: 0, Errors: 0, Skipped: 0, Time elapsed: 0.027 sec

Results :

Tests in error: 
  testBindingAuth(org.mortbay.jetty.plus.jaas.spi.LdapLoginModuleTest)

Tests run: 7, Failures: 0, Errors: 1, Skipped: 0

[INFO] ------------------------------------------------------------------------
[ERROR] BUILD FAILURE
[INFO] ------------------------------------------------------------------------
[INFO] There are test failures.

Please refer to /srv/gump/public/workspace/jetty/modules/plus/jetty-plus/target/surefire-reports for the individual test results.
[INFO] ------------------------------------------------------------------------
[INFO] For more information, run Maven with the -e switch
[INFO] ------------------------------------------------------------------------
[INFO] Total time: 6 minutes 18 seconds
[INFO] Finished at: Wed Apr 09 12:47:46 GMT-08:00 2008
[INFO] Final Memory: 26M/63M
[INFO] ------------------------------------------------------------------------
---------------------------------------------

To subscribe to this information via syndicated feeds:
- RSS: http://vmgump.apache.org/gump/public/jetty/jetty/rss.xml
- Atom: http://vmgump.apache.org/gump/public/jetty/jetty/atom.xml

============================== Gump Tracking Only ===
Produced by Gump version 2.3.
Gump Run 16000809042008, vmgump:vmgump-public:16000809042008
Gump E-mail Identifier (unique within run) #20.


--
Apache Gump
http://gump.apache.org/ [Instance: vmgump]

---------------------------------------------------------------------
To unsubscribe, e-mail: general-unsubscribe@gump.apache.org
For additional commands, e-mail: general-help@gump.apache.org


Mime
View raw message