gump-general mailing list archives

Site index · List index
Message view « Date » · « Thread »
Top « Date » · « Thread »
From g...@vmgump.apache.org
Subject BATCH: All dressed up, with nowhere to go...
Date Wed, 09 Apr 2008 05:57:34 GMT
Dear Gumpmeisters,
            
The following 22 notifys should have been sent

*********************************************************** G U M P
[GUMP@vmgump]: Project woodstox (in module xstream) failed
[GUMP@vmgump]: Module commons-dormant success, but with warnings.
[GUMP@vmgump]: Project jettison (in module xstream) failed
[GUMP@vmgump]: Project cocoon (in module cocoon) failed
[GUMP@vmgump]: Project village (in module village) failed
[GUMP@vmgump]: Project gsbase (in module gsbase) failed
[GUMP@vmgump]: Project gsbase-test (in module gsbase) failed
[GUMP@vmgump]: Project maven-emma-plugin (in module maven-emma-plugin) failed
[GUMP@vmgump]: Project jmock2 (in module jmock2) failed
[GUMP@vmgump]: Module town failed
[GUMP@vmgump]: Project ws-commons-xmlschema (in module ws-axis2-commons) failed
[GUMP@vmgump]: Project derby (in module db-derby) failed
[GUMP@vmgump]: Project authx-core (in module authx) failed
[GUMP@vmgump]: Project emma (in module emma) failed
[GUMP@vmgump]: Project apache-httpd-make (in module apache-httpd) failed
[GUMP@vmgump]: Project jaxen (in module jaxen) failed
[GUMP@vmgump]: Project strutstestcase (in module strutstestcase) failed
[GUMP@vmgump]: Module beanshell failed
[GUMP@vmgump]: Module JacORB failed
[GUMP@vmgump]: Module jetty success, but with warnings.
[GUMP@vmgump]: Project lenya (in module lenya) failed
[GUMP@vmgump]: Module smartfrog success, but with warnings.
*********************************************************** G U M P
[GUMP@vmgump]: Project woodstox (in module xstream) failed
To whom it may engage...
        
This is an automated request, but not an unsolicited one. For 
more information please visit http://gump.apache.org/nagged.html, 
and/or contact the folk at general@gump.apache.org.

Project woodstox has an issue affecting its community integration.
This issue affects 12 projects.
The current state of this project is 'Failed', with reason 'Missing Build Outputs'.
For reference only, the following projects are affected by this:
    - authx-example :  Apache Authentication and Authorization Framework
    - authx-script :  Apache Authentication and Authorization Framework
    - commons-javaflow :  Commons Javaflow
    - fulcrum-quartz :  Services Framework
    - groovy :  New agile dynamic language using a Java-like syntax for the ...
    - jakarta-jmeter-svn :  Pure Java load testing and performance measurement tool.
   ...
    - jakarta-jmeter-test :  Pure Java load testing and performance measurement tool.
   ...
    - logging-log4j-chainsaw :  Chainsaw log viewer
    - portals-jetspeed-1 :  Enterprise Information Portal
    - turbine-core :  A servlet based framework.
    - woodstox :  simple library to serialize object to XML and back
    again
    - xstream :  simple library to serialize object to XML and back
    again


Full details are available at:
    http://vmgump.apache.org/gump/public/xstream/woodstox/index.html

That said, some information snippets are provided here.

The following annotations (debug/informational/warning/error messages) were provided:
 -DEBUG- Sole output [wstx-asl-3.2.3.jar] identifier set to project name
 -INFO- Failed with reason missing build outputs
 -ERROR- Missing Output: /srv/gump/public/workspace/xstream/xstream/lib/wstx-asl-3.2.3.jar
 -ERROR- See Directory Listing Work for Missing Outputs
 -INFO- Failed to extract fallback artifacts from Gump Repository

To subscribe to this information via syndicated feeds:
- RSS: http://vmgump.apache.org/gump/public/xstream/woodstox/rss.xml
- Atom: http://vmgump.apache.org/gump/public/xstream/woodstox/atom.xml

============================== Gump Tracking Only ===
Produced by Gump version 2.3.
Gump Run 59000009042008, vmgump:vmgump-public:59000009042008
Gump E-mail Identifier (unique within run) #2.

*********************************************************** G U M P
[GUMP@vmgump]: Module commons-dormant success, but with warnings.
To whom it may engage...
        
This is an automated request, but not an unsolicited one. For 
more information please visit http://gump.apache.org/nagged.html, 
and/or contact the folk at general@gump.apache.org.

Module commons-dormant contains errors.
The current state of this module is 'Success'.

Full details are available at:
    http://vmgump.apache.org/gump/public/commons-dormant/index.html

That said, some information snippets are provided here.

The following annotations (debug/informational/warning/error messages) were provided:
 -ERROR- *** Failed to update from source control. Stale contents ***



The following work was performed:
http://vmgump.apache.org/gump/public/commons-dormant/gump_work/update_commons-dormant.html
Work Name: update_commons-dormant (Type: Update)
Work ended in a state of : Failed
Elapsed: 1 min 14 secs
Command Line: svn --quiet update --non-interactive commons-dormant 
[Working Directory: /srv/gump/public/workspace/cvs]
---------------------------------------------
svn: REPORT request failed on '/repos/asf/!svn/vcc/default'
svn: Target path does not exist
---------------------------------------------

To subscribe to this information via syndicated feeds:
- RSS: http://vmgump.apache.org/gump/public/commons-dormant/rss.xml
- Atom: http://vmgump.apache.org/gump/public/commons-dormant/atom.xml

============================== Gump Tracking Only ===
Produced by Gump version 2.3.
Gump Run 59000009042008, vmgump:vmgump-public:59000009042008
Gump E-mail Identifier (unique within run) #4.

*********************************************************** G U M P
[GUMP@vmgump]: Project jettison (in module xstream) failed
To whom it may engage...
        
This is an automated request, but not an unsolicited one. For 
more information please visit http://gump.apache.org/nagged.html, 
and/or contact the folk at general@gump.apache.org.

Project jettison has an issue affecting its community integration.
This issue affects 1 projects.
The current state of this project is 'Failed', with reason 'Missing Build Outputs'.
For reference only, the following projects are affected by this:
    - jettison :  simple library to serialize object to XML and back
    again


Full details are available at:
    http://vmgump.apache.org/gump/public/xstream/jettison/index.html

That said, some information snippets are provided here.

The following annotations (debug/informational/warning/error messages) were provided:
 -DEBUG- Sole output [jettison-1.0-RC2.jar] identifier set to project name
 -INFO- Failed with reason missing build outputs
 -ERROR- Missing Output: /srv/gump/public/workspace/xstream/xstream/lib/jettison-1.0-RC2.jar
 -ERROR- See Directory Listing Work for Missing Outputs
 -INFO- Failed to extract fallback artifacts from Gump Repository

To subscribe to this information via syndicated feeds:
- RSS: http://vmgump.apache.org/gump/public/xstream/jettison/rss.xml
- Atom: http://vmgump.apache.org/gump/public/xstream/jettison/atom.xml

============================== Gump Tracking Only ===
Produced by Gump version 2.3.
Gump Run 59000009042008, vmgump:vmgump-public:59000009042008
Gump E-mail Identifier (unique within run) #7.

*********************************************************** G U M P
[GUMP@vmgump]: Project cocoon (in module cocoon) failed
To whom it may engage...
        
This is an automated request, but not an unsolicited one. For 
more information please visit http://gump.apache.org/nagged.html, 
and/or contact the folk at general@gump.apache.org.

Project cocoon has an issue affecting its community integration.
This issue affects 1 projects,
 and has been outstanding for 3 runs.
The current state of this project is 'Failed', with reason 'Build Failed'.
For reference only, the following projects are affected by this:
    - cocoon :  Java XML Framework


Full details are available at:
    http://vmgump.apache.org/gump/public/cocoon/cocoon/index.html

That said, some information snippets are provided here.

The following annotations (debug/informational/warning/error messages) were provided:
 -DEBUG- (Gump generated) Maven2 Settings in: /srv/gump/public/workspace/cocoon/gump_mvn_settings.xml
 -INFO- Failed with reason build failed
 -DEBUG- Maven POM in: /srv/gump/public/workspace/cocoon/pom.xml



The following work was performed:
http://vmgump.apache.org/gump/public/cocoon/cocoon/gump_work/build_cocoon_cocoon.html
Work Name: build_cocoon_cocoon (Type: Build)
Work ended in a state of : Failed
Elapsed: 13 mins 25 secs
Command Line: mvn --settings /srv/gump/public/workspace/cocoon/gump_mvn_settings.xml package 
[Working Directory: /srv/gump/public/workspace/cocoon]
CLASSPATH: /usr/lib/jvm/java-1.5.0-sun/lib/tools.jar:/srv/gump/public/workspace/junit/dist/junit-09042008.jar
---------------------------------------------
[INFO] [enforcer:enforce-once {execution: enforce-maven}]
[INFO] [resources:resources]
[INFO] Using default encoding to copy filtered resources.
[INFO] [compiler:compile]
[INFO] No sources to compile
[INFO] [resources:testResources]
[INFO] Using default encoding to copy filtered resources.
[INFO] snapshot org.apache.cocoon:cocoon-it-fw:1.0.0-RC1-SNAPSHOT: checking for updates from apache.snapshots
Downloading: http://people.apache.org/repo/m2-snapshot-repository/org/apache/cocoon/cocoon-it-fw/1.0.0-RC1-SNAPSHOT/cocoon-it-fw-1.0.0-RC1-SNAPSHOT.jar
Downloading: http://localhost:8192/maven2/org/apache/maven/maven-plugin-api/2.0/maven-plugin-api-2.0.jar
4/9K
8/9K
9/9K
9K downloaded
[INFO] ------------------------------------------------------------------------
[ERROR] BUILD ERROR
[INFO] ------------------------------------------------------------------------
[INFO] Failed to resolve artifact.

Missing:
----------
1) org.apache.cocoon:cocoon-it-fw:jar:1.0.0-RC1-SNAPSHOT

  Try downloading the file manually from the project website.

  Then, install it using the command: 
      mvn install:install-file -DgroupId=org.apache.cocoon -DartifactId=cocoon-it-fw -Dversion=1.0.0-RC1-SNAPSHOT -Dpackaging=jar -Dfile=/path/to/file

  Alternatively, if you host your own repository you can deploy the file there: 
      mvn deploy:deploy-file -DgroupId=org.apache.cocoon -DartifactId=cocoon-it-fw -Dversion=1.0.0-RC1-SNAPSHOT -Dpackaging=jar -Dfile=/path/to/file -Durl=[url] -DrepositoryId=[id]

  Path to dependency: 
  	1) org.apache.cocoon:cocoon-webapp:war:2.2.0-M2-SNAPSHOT
  	2) org.apache.cocoon:cocoon-it-fw:jar:1.0.0-RC1-SNAPSHOT

----------
1 required artifact is missing.

for artifact: 
  org.apache.cocoon:cocoon-webapp:war:2.2.0-M2-SNAPSHOT

from the specified remote repositories:
  central (http://repo1.maven.org/maven2),
  apache.snapshots (http://people.apache.org/repo/m2-snapshot-repository)


[INFO] ------------------------------------------------------------------------
[INFO] For more information, run Maven with the -e switch
[INFO] ------------------------------------------------------------------------
[INFO] Total time: 13 minutes 17 seconds
[INFO] Finished at: Wed Apr 09 01:50:14 GMT-08:00 2008
[INFO] Final Memory: 49M/63M
[INFO] ------------------------------------------------------------------------
---------------------------------------------

To subscribe to this information via syndicated feeds:
- RSS: http://vmgump.apache.org/gump/public/cocoon/cocoon/rss.xml
- Atom: http://vmgump.apache.org/gump/public/cocoon/cocoon/atom.xml

============================== Gump Tracking Only ===
Produced by Gump version 2.3.
Gump Run 59000009042008, vmgump:vmgump-public:59000009042008
Gump E-mail Identifier (unique within run) #8.

*********************************************************** G U M P
[GUMP@vmgump]: Project village (in module village) failed
To whom it may engage...
        
This is an automated request, but not an unsolicited one. For 
more information please visit http://gump.apache.org/nagged.html, 
and/or contact the folk at general@gump.apache.org.

Project village has an issue affecting its community integration.
This issue affects 1 projects,
 and has been outstanding for 40 runs.
The current state of this project is 'Failed', with reason 'Build Failed'.
For reference only, the following projects are affected by this:
    - village :  Database API


Full details are available at:
    http://vmgump.apache.org/gump/public/village/village/index.html

That said, some information snippets are provided here.

The following annotations (debug/informational/warning/error messages) were provided:
 -DEBUG- (Gump generated) Maven Properties in: /srv/gump/public/workspace/village/build.properties
 -INFO- Failed with reason build failed
 -DEBUG- Maven POM in: /srv/gump/public/workspace/village/project.xml
 -DEBUG- Maven project properties in: /srv/gump/public/workspace/village/project.properties
 -INFO- Failed to extract fallback artifacts from Gump Repository



The following work was performed:
http://vmgump.apache.org/gump/public/village/village/gump_work/build_village_village.html
Work Name: build_village_village (Type: Build)
Work ended in a state of : Failed
Elapsed: 7 secs
Command Line: maven --offline jar 
[Working Directory: /srv/gump/public/workspace/village]
CLASSPATH: /usr/lib/jvm/java-1.5.0-sun/lib/tools.jar:/srv/gump/public/workspace/xml-commons/java/external/build/xml-apis-ext.jar
---------------------------------------------
 __  __
|  \/  |__ _Apache__ ___
| |\/| / _` \ V / -_) ' \  ~ intelligent projects ~
|_|  |_\__,_|\_/\___|_||_|  v. 1.0.2

The build cannot continue because of the following unsatisfied dependency:

commons-jelly-1.0-RC1.jar

Total time: 6 seconds
Finished at: Wed Apr 09 01:50:26 GMT-08:00 2008

---------------------------------------------

To subscribe to this information via syndicated feeds:
- RSS: http://vmgump.apache.org/gump/public/village/village/rss.xml
- Atom: http://vmgump.apache.org/gump/public/village/village/atom.xml

============================== Gump Tracking Only ===
Produced by Gump version 2.3.
Gump Run 59000009042008, vmgump:vmgump-public:59000009042008
Gump E-mail Identifier (unique within run) #9.

*********************************************************** G U M P
[GUMP@vmgump]: Project gsbase (in module gsbase) failed
To whom it may engage...
        
This is an automated request, but not an unsolicited one. For 
more information please visit http://gump.apache.org/nagged.html, 
and/or contact the folk at general@gump.apache.org.

Project gsbase has an issue affecting its community integration.
This issue affects 1 projects,
 and has been outstanding for 40 runs.
The current state of this project is 'Failed', with reason 'Build Failed'.
For reference only, the following projects are affected by this:
    - gsbase :  A collection of java utility classes


Full details are available at:
    http://vmgump.apache.org/gump/public/gsbase/gsbase/index.html

That said, some information snippets are provided here.

The following annotations (debug/informational/warning/error messages) were provided:
 -DEBUG- Sole output [gsbase-09042008.jar] identifier set to project name
 -DEBUG- (Gump generated) Maven Properties in: /srv/gump/public/workspace/gsbase/build.properties
 -INFO- Failed with reason build failed
 -DEBUG- Maven POM in: /srv/gump/public/workspace/gsbase/project.xml
 -DEBUG- Maven project properties in: /srv/gump/public/workspace/gsbase/project.properties
 -DEBUG- Extracted fallback artifacts from Gump Repository



The following work was performed:
http://vmgump.apache.org/gump/public/gsbase/gsbase/gump_work/build_gsbase_gsbase.html
Work Name: build_gsbase_gsbase (Type: Build)
Work ended in a state of : Failed
Elapsed: 3 secs
Command Line: maven --offline jar 
[Working Directory: /srv/gump/public/workspace/gsbase]
CLASSPATH: /usr/lib/jvm/java-1.5.0-sun/lib/tools.jar:/srv/gump/public/workspace/gsbase/target/classes:/srv/gump/public/workspace/junit/dist/junit-09042008.jar:/srv/gump/packages/junitperf-1.8/lib/junitperf.jar
---------------------------------------------
 __  __
|  \/  |__ _Apache__ ___
| |\/| / _` \ V / -_) ' \  ~ intelligent projects ~
|_|  |_\__,_|\_/\___|_||_|  v. 1.0.2

The build cannot continue because of the following unsatisfied dependency:

jsch-0.1.5.jar

Total time: 2 seconds
Finished at: Wed Apr 09 01:51:10 GMT-08:00 2008

---------------------------------------------

To subscribe to this information via syndicated feeds:
- RSS: http://vmgump.apache.org/gump/public/gsbase/gsbase/rss.xml
- Atom: http://vmgump.apache.org/gump/public/gsbase/gsbase/atom.xml

============================== Gump Tracking Only ===
Produced by Gump version 2.3.
Gump Run 59000009042008, vmgump:vmgump-public:59000009042008
Gump E-mail Identifier (unique within run) #10.

*********************************************************** G U M P
[GUMP@vmgump]: Project gsbase-test (in module gsbase) failed
To whom it may engage...
        
This is an automated request, but not an unsolicited one. For 
more information please visit http://gump.apache.org/nagged.html, 
and/or contact the folk at general@gump.apache.org.

Project gsbase-test has an issue affecting its community integration.
This issue affects 1 projects,
 and has been outstanding for 40 runs.
The current state of this project is 'Failed', with reason 'Build Failed'.
For reference only, the following projects are affected by this:
    - gsbase-test :  A collection of java utility classes


Full details are available at:
    http://vmgump.apache.org/gump/public/gsbase/gsbase-test/index.html

That said, some information snippets are provided here.

The following annotations (debug/informational/warning/error messages) were provided:
 -WARNING- Overriding Maven properties: [/srv/gump/public/workspace/gsbase/build.properties]
 -DEBUG- (Gump generated) Maven Properties in: /srv/gump/public/workspace/gsbase/build.properties
 -INFO- Failed with reason build failed
 -DEBUG- Maven POM in: /srv/gump/public/workspace/gsbase/project.xml
 -DEBUG- Maven project properties in: /srv/gump/public/workspace/gsbase/project.properties



The following work was performed:
http://vmgump.apache.org/gump/public/gsbase/gsbase-test/gump_work/build_gsbase_gsbase-test.html
Work Name: build_gsbase_gsbase-test (Type: Build)
Work ended in a state of : Failed
Elapsed: 3 secs
Command Line: maven --offline jar 
[Working Directory: /srv/gump/public/workspace/gsbase]
CLASSPATH: /usr/lib/jvm/java-1.5.0-sun/lib/tools.jar:/srv/gump/public/workspace/gsbase/target/classes:/srv/gump/public/workspace/junit/dist/junit-09042008.jar:/srv/gump/packages/junitperf-1.8/lib/junitperf.jar
---------------------------------------------
 __  __
|  \/  |__ _Apache__ ___
| |\/| / _` \ V / -_) ' \  ~ intelligent projects ~
|_|  |_\__,_|\_/\___|_||_|  v. 1.0.2

The build cannot continue because of the following unsatisfied dependency:

jsch-0.1.5.jar

Total time: 2 seconds
Finished at: Wed Apr 09 02:03:39 GMT-08:00 2008

---------------------------------------------

To subscribe to this information via syndicated feeds:
- RSS: http://vmgump.apache.org/gump/public/gsbase/gsbase-test/rss.xml
- Atom: http://vmgump.apache.org/gump/public/gsbase/gsbase-test/atom.xml

============================== Gump Tracking Only ===
Produced by Gump version 2.3.
Gump Run 59000009042008, vmgump:vmgump-public:59000009042008
Gump E-mail Identifier (unique within run) #11.

*********************************************************** G U M P
[GUMP@vmgump]: Project maven-emma-plugin (in module maven-emma-plugin) failed
To whom it may engage...
        
This is an automated request, but not an unsolicited one. For 
more information please visit http://gump.apache.org/nagged.html, 
and/or contact the folk at general@gump.apache.org.

Project maven-emma-plugin has an issue affecting its community integration.
This issue affects 1 projects.
The current state of this project is 'Failed', with reason 'Build Failed'.
For reference only, the following projects are affected by this:
    - maven-emma-plugin :  Maven plugin for Emma code coverage tool


Full details are available at:
    http://vmgump.apache.org/gump/public/maven-emma-plugin/maven-emma-plugin/index.html

That said, some information snippets are provided here.

The following annotations (debug/informational/warning/error messages) were provided:
 -DEBUG- Sole output [maven-emma-plugin-09042008.jar] identifier set to project name
 -DEBUG- (Gump generated) Maven Properties in: /srv/gump/public/workspace/maven-emma-plugin/build.properties
 -INFO- Failed with reason build failed
 -DEBUG- Maven POM in: /srv/gump/public/workspace/maven-emma-plugin/project.xml
 -DEBUG- Maven project properties in: /srv/gump/public/workspace/maven-emma-plugin/project.properties
 -INFO- Failed to extract fallback artifacts from Gump Repository



The following work was performed:
http://vmgump.apache.org/gump/public/maven-emma-plugin/maven-emma-plugin/gump_work/build_maven-emma-plugin_maven-emma-plugin.html
Work Name: build_maven-emma-plugin_maven-emma-plugin (Type: Build)
Work ended in a state of : Failed
Elapsed: 3 secs
Command Line: maven --offline jar 
[Working Directory: /srv/gump/public/workspace/maven-emma-plugin]
CLASSPATH: /usr/lib/jvm/java-1.5.0-sun/lib/tools.jar:/srv/gump/public/workspace/ant/dist/lib/ant-jmf.jar:/srv/gump/public/workspace/ant/dist/lib/ant-swing.jar:/srv/gump/public/workspace/ant/dist/lib/ant-apache-resolver.jar:/srv/gump/public/workspace/ant/dist/lib/ant-trax.jar:/srv/gump/public/workspace/ant/dist/lib/ant-junit.jar:/srv/gump/public/workspace/ant/dist/lib/ant-launcher.jar:/srv/gump/public/workspace/ant/dist/lib/ant-nodeps.jar:/srv/gump/public/workspace/ant/dist/lib/ant.jar:/srv/gump/packages/emma-2.0.5312/lib/emma.jar:/srv/gump/packages/emma-2.0.5312/lib/emma_ant.jar
---------------------------------------------
 __  __
|  \/  |__ _Apache__ ___
| |\/| / _` \ V / -_) ' \  ~ intelligent projects ~
|_|  |_\__,_|\_/\___|_||_|  v. 1.0.2

The build cannot continue because of the following unsatisfied dependency:

jsch-0.1.5.jar

Total time: 2 seconds
Finished at: Wed Apr 09 02:21:14 GMT-08:00 2008

---------------------------------------------

To subscribe to this information via syndicated feeds:
- RSS: http://vmgump.apache.org/gump/public/maven-emma-plugin/maven-emma-plugin/rss.xml
- Atom: http://vmgump.apache.org/gump/public/maven-emma-plugin/maven-emma-plugin/atom.xml

============================== Gump Tracking Only ===
Produced by Gump version 2.3.
Gump Run 59000009042008, vmgump:vmgump-public:59000009042008
Gump E-mail Identifier (unique within run) #13.

*********************************************************** G U M P
[GUMP@vmgump]: Project jmock2 (in module jmock2) failed
To whom it may engage...
        
This is an automated request, but not an unsolicited one. For 
more information please visit http://gump.apache.org/nagged.html, 
and/or contact the folk at general@gump.apache.org.

Project jmock2 has an issue affecting its community integration.
This issue affects 1 projects,
 and has been outstanding for 40 runs.
The current state of this project is 'Failed', with reason 'Build Failed'.
For reference only, the following projects are affected by this:
    - jmock2 :  jMock is a library for testing Java code using mock objects.


Full details are available at:
    http://vmgump.apache.org/gump/public/jmock2/jmock2/index.html

That said, some information snippets are provided here.

The following annotations (debug/informational/warning/error messages) were provided:
 -INFO- Failed with reason build failed
 -INFO- Failed to extract fallback artifacts from Gump Repository



The following work was performed:
http://vmgump.apache.org/gump/public/jmock2/jmock2/gump_work/build_jmock2_jmock2.html
Work Name: build_jmock2_jmock2 (Type: Build)
Work ended in a state of : Failed
Elapsed: 8 secs
Command Line: /usr/lib/jvm/java-1.5.0-sun/bin/java -Djava.awt.headless=true -Xbootclasspath/p:/srv/gump/public/workspace/xml-xerces2/build/xercesImpl.jar:/srv/gump/public/workspace/xml-commons/java/external/build/xml-apis.jar org.apache.tools.ant.Main -Dgump.merge=/srv/gump/public/gump/work/merge.xml -Dbuild.sysclasspath=only -Dversion=09042008 
[Working Directory: /srv/gump/public/workspace/jmock2]
CLASSPATH: /usr/lib/jvm/java-1.5.0-sun/lib/tools.jar:/srv/gump/public/workspace/jmock2/build/classes:/srv/gump/public/workspace/jmock2/lib/hamcrest-api-1.0.jar:/srv/gump/public/workspace/jmock2/lib/hamcrest-library-1.0.jar:/srv/gump/public/workspace/jmock2/lib/objenesis-1.0.jar:/srv/gump/public/workspace/ant/dist/lib/ant-jmf.jar:/srv/gump/public/workspace/ant/dist/lib/ant-swing.jar:/srv/gump/public/workspace/ant/dist/lib/ant-apache-resolver.jar:/srv/gump/public/workspace/ant/dist/lib/ant-trax.jar:/srv/gump/public/workspace/ant/dist/lib/ant-junit.jar:/srv/gump/public/workspace/ant/dist/lib/ant-launcher.jar:/srv/gump/public/workspace/ant/dist/lib/ant-nodeps.jar:/srv/gump/public/workspace/ant/dist/lib/ant.jar:/srv/gump/packages/cglib/cglib-nodep-2.1_3.jar:/srv/gump/public/workspace/junit/dist/junit-09042008.jar:/srv/gump/packages/junit3.8.1/junit.jar:/srv/gump/public/workspace/xml-commons/java/external/build/xml-apis-ext.jar
---------------------------------------------
    [javac]             exactly(1).of (anything()).method(withName("m")).with(greaterThan(0));
    [javac]                                                                   ^
    [javac] /srv/gump/public/workspace/jmock2/test/org/jmock/test/acceptance/HamcrestTypeSafetyAcceptanceTests.java:34: incompatible types
    [javac] found   : org.jmock.internal.matcher.MethodNameMatcher
    [javac] required: org.hamcrest.Matcher<java.lang.reflect.Method>
    [javac]         return new MethodNameMatcher(nameRegex);
    [javac]                ^
    [javac] /srv/gump/public/workspace/jmock2/test/org/jmock/test/unit/support/StringContainsInOrder.java:18: method does not override a method from its superclass
    [javac]     @Override
    [javac]      ^
    [javac] /srv/gump/public/workspace/jmock2/test/org/jmock/test/unit/support/StringContainsInOrder.java:39: incompatible types
    [javac] found   : org.jmock.test.unit.support.StringContainsInOrder
    [javac] required: org.hamcrest.Matcher<java.lang.String>
    [javac]         return new StringContainsInOrder(Arrays.asList(substrings));
    [javac]                ^
    [javac] /srv/gump/public/workspace/jmock2/test/org/jmock/test/unit/support/StringContainsInOrder.java:44: incompatible types
    [javac] found   : org.jmock.test.unit.support.StringContainsInOrder
    [javac] required: org.hamcrest.Matcher<java.lang.String>
    [javac]         return new StringContainsInOrder(substrings);
    [javac]                ^
    [javac] /srv/gump/public/workspace/jmock2/test/org/jmock/test/unit/internal/InvocationExpectationTests.java:34: cannot find symbol
    [javac] symbol: method equalTo(T)
    [javac] 				           equalTo(expected).matches(actual));
    [javac]                                            ^
    [javac] /srv/gump/public/workspace/jmock2/test/org/jmock/test/unit/internal/InvocationExpectationTests.java:54: cannot find symbol
    [javac] symbol  : method sameInstance(java.lang.Object)
    [javac] location: class org.jmock.test.unit.internal.InvocationExpectationTests
    [javac] 		expectation.setObjectMatcher(sameInstance(targetObject));
    [javac]                                              ^
    [javac] /srv/gump/public/workspace/jmock2/test/org/jmock/test/unit/internal/InvocationExpectationTests.java:63: cannot find symbol
    [javac] symbol  : method equalTo(java.lang.reflect.Method)
    [javac] location: class org.jmock.test.unit.internal.InvocationExpectationTests
    [javac] 		expectation.setMethodMatcher(equalTo(method));
    [javac]                                              ^
    [javac] /srv/gump/public/workspace/jmock2/test/org/jmock/test/unit/internal/InvocationExpectationTests.java:75: cannot find symbol
    [javac] symbol  : method equalTo(java.lang.Object[])
    [javac] location: class org.jmock.test.unit.internal.InvocationExpectationTests
    [javac] 		expectation.setParametersMatcher(equalTo(args));
    [javac]                                                  ^
    [javac] /srv/gump/public/workspace/jmock2/test/org/jmock/test/unit/lib/script/ScriptedCallbackActionTests.java:78: cannot find symbol
    [javac] symbol  : method sameInstance(java.lang.Exception)
    [javac] location: class org.jmock.test.unit.lib.script.ScriptedCallbackActionTests
    [javac]             assertThat(e, sameInstance(exception));
    [javac]                           ^
    [javac] 53 errors

BUILD FAILED
/srv/gump/public/workspace/jmock2/build.xml:60: Compile failed; see the compiler error output for details.

Total time: 7 seconds
---------------------------------------------

To subscribe to this information via syndicated feeds:
- RSS: http://vmgump.apache.org/gump/public/jmock2/jmock2/rss.xml
- Atom: http://vmgump.apache.org/gump/public/jmock2/jmock2/atom.xml

============================== Gump Tracking Only ===
Produced by Gump version 2.3.
Gump Run 59000009042008, vmgump:vmgump-public:59000009042008
Gump E-mail Identifier (unique within run) #18.

*********************************************************** G U M P
[GUMP@vmgump]: Module town failed
To whom it may engage...
        
This is an automated request, but not an unsolicited one. For 
more information please visit http://gump.apache.org/nagged.html, 
and/or contact the folk at general@gump.apache.org.

Module town has an issue affecting its community integration,
 and has been outstanding for 729 runs.
The current state of this module is 'Failed', with reason 'Update Failed'.

Full details are available at:
    http://vmgump.apache.org/gump/public/town/index.html

That said, some information snippets are provided here.

The following annotations (debug/informational/warning/error messages) were provided:
 -INFO- Failed with reason update failed



The following work was performed:
http://vmgump.apache.org/gump/public/town/gump_work/update_town.html
Work Name: update_town (Type: Update)
Work ended in a state of : Failed
Elapsed: 3 mins 10 secs
Command Line: cvs -q -z3 -d :pserver:anoncvs@share.whichever.com:/home/cvspublic checkout -P -d town town 
[Working Directory: /srv/gump/public/workspace/cvs]
---------------------------------------------
cvs [checkout aborted]: connect to share.whichever.com(76.191.185.66):2401 failed: Connection timed out
---------------------------------------------

To subscribe to this information via syndicated feeds:
- RSS: http://vmgump.apache.org/gump/public/town/rss.xml
- Atom: http://vmgump.apache.org/gump/public/town/atom.xml

============================== Gump Tracking Only ===
Produced by Gump version 2.3.
Gump Run 59000009042008, vmgump:vmgump-public:59000009042008
Gump E-mail Identifier (unique within run) #19.

*********************************************************** G U M P
[GUMP@vmgump]: Project ws-commons-xmlschema (in module ws-axis2-commons) failed
To whom it may engage...
        
This is an automated request, but not an unsolicited one. For 
more information please visit http://gump.apache.org/nagged.html, 
and/or contact the folk at general@gump.apache.org.

Project ws-commons-xmlschema has an issue affecting its community integration.
This issue affects 1 projects,
 and has been outstanding for 40 runs.
The current state of this project is 'Failed', with reason 'Build Failed'.
For reference only, the following projects are affected by this:
    - ws-commons-xmlschema :  Common stuff for the WS projects.


Full details are available at:
    http://vmgump.apache.org/gump/public/ws-axis2-commons/ws-commons-xmlschema/index.html

That said, some information snippets are provided here.

The following annotations (debug/informational/warning/error messages) were provided:
 -DEBUG- Sole output [ws-commons-xmlschema-09042008.jar] identifier set to project name
 -INFO- Failed with reason build failed
 -INFO- Failed to extract fallback artifacts from Gump Repository



The following work was performed:
http://vmgump.apache.org/gump/public/ws-axis2-commons/ws-commons-xmlschema/gump_work/build_ws-axis2-commons_ws-commons-xmlschema.html
Work Name: build_ws-axis2-commons_ws-commons-xmlschema (Type: Build)
Work ended in a state of : Failed
Elapsed: 2 mins 4 secs
Command Line: /usr/lib/jvm/java-1.5.0-sun/bin/java -Djava.awt.headless=true -Xbootclasspath/p:/srv/gump/public/workspace/xml-commons/java/external/build/xml-apis.jar:/srv/gump/public/workspace/xml-xerces2/build/xercesImpl.jar:/srv/gump/public/workspace/xml-xalan/build/serializer.jar:/srv/gump/public/workspace/xml-xalan/build/xalan-unbundled.jar org.apache.tools.ant.Main -Dgump.merge=/srv/gump/public/gump/work/merge.xml -Dbuild.sysclasspath=only -Doutput.jar=ws-commons-xmlschema-09042008 -DdownloadLibs=false jar 
[Working Directory: /srv/gump/public/workspace/ws-axis2-commons/XmlSchema]
CLASSPATH: /usr/lib/jvm/java-1.5.0-sun/lib/tools.jar:/srv/gump/public/workspace/ws-axis2-commons/XmlSchema/build/classes:/srv/gump/public/workspace/ws-axis2-commons/XmlSchema/build/test-classes:/srv/gump/public/workspace/xml-commons/java/external/build/xml-apis-ext.jar:/srv/gump/public/workspace/xmlunit/build/lib/xmlunit-09042008.jar:/srv/gump/public/workspace/ant/dist/lib/ant-jmf.jar:/srv/gump/public/workspace/ant/dist/lib/ant-swing.jar:/srv/gump/public/workspace/ant/dist/lib/ant-apache-resolver.jar:/srv/gump/public/workspace/ant/dist/lib/ant-trax.jar:/srv/gump/public/workspace/ant/dist/lib/ant-junit.jar:/srv/gump/public/workspace/ant/dist/lib/ant-launcher.jar:/srv/gump/public/workspace/ant/dist/lib/ant-nodeps.jar:/srv/gump/public/workspace/ant/dist/lib/ant.jar:/srv/gump/packages/junit3.8.1/junit.jar:/srv/gump/public/workspace/xml-commons/java/build/resolver.jar:/srv/gump/packages/stax/jsr173_1.0_api.jar:/srv/gump/packages/stax/jsr173_1.0_ri.jar:/srv/gump/public/workspace/ju
 nit/dist/junit-09042008.jar
---------------------------------------------
    [junit] Tests run: 1, Failures: 0, Errors: 0, Time elapsed: 0.148 sec
    [junit] Running tests.ElementRefsTest
    [junit] Tests run: 1, Failures: 0, Errors: 0, Time elapsed: 0.108 sec
    [junit] Running tests.EncodingTest
    [junit] Tests run: 1, Failures: 0, Errors: 0, Time elapsed: 0.156 sec
    [junit] Running tests.EnumValueTest
    [junit] Tests run: 1, Failures: 0, Errors: 0, Time elapsed: 0.109 sec
    [junit] Running tests.ExternalAttTest
    [junit] Tests run: 1, Failures: 0, Errors: 0, Time elapsed: 0.094 sec
    [junit] Running tests.FacetsTest
    [junit] Tests run: 9, Failures: 0, Errors: 0, Time elapsed: 0.21 sec
    [junit] Running tests.GroupTest
    [junit] Tests run: 1, Failures: 0, Errors: 0, Time elapsed: 0.088 sec
    [junit] Running tests.ImportTest
    [junit] Tests run: 3, Failures: 0, Errors: 0, Time elapsed: 0.147 sec
    [junit] Running tests.IncludeTest
    [junit] Tests run: 4, Failures: 0, Errors: 0, Time elapsed: 0.195 sec
    [junit] Running tests.ListTest
    [junit] Tests run: 1, Failures: 0, Errors: 0, Time elapsed: 0.079 sec
    [junit] Running tests.MixedContentTest
    [junit] Tests run: 1, Failures: 0, Errors: 0, Time elapsed: 0.067 sec
    [junit] Running tests.MultipleExternalAttTest
    [junit] Tests run: 1, Failures: 0, Errors: 0, Time elapsed: 0.08 sec
    [junit] Running tests.NamespaceContextTest
    [junit] Tests run: 1, Failures: 0, Errors: 0, Time elapsed: 0.37 sec
    [junit] Running tests.NotationTest
    [junit] Tests run: 1, Failures: 0, Errors: 0, Time elapsed: 0.068 sec
    [junit] Running tests.RecursiveImportTest
    [junit] Tests run: 1, Failures: 0, Errors: 0, Time elapsed: 0.062 sec
    [junit] Running tests.RedefineTest
    [junit] Tests run: 5, Failures: 0, Errors: 0, Time elapsed: 0.129 sec
    [junit] Running tests.SequenceTest
    [junit] Tests run: 1, Failures: 0, Errors: 0, Time elapsed: 0.13 sec
    [junit] Running tests.SimpleContentExtensionTest
    [junit] Tests run: 1, Failures: 0, Errors: 0, Time elapsed: 0.07 sec
    [junit] Running tests.SimpleContentRestrictionTest
    [junit] Tests run: 1, Failures: 0, Errors: 0, Time elapsed: 0.065 sec
    [junit] Running tests.TestElementForm
    [junit] Tests run: 1, Failures: 0, Errors: 0, Time elapsed: 0.061 sec
    [junit] Running tests.TestForwardRefs
    [junit] Tests run: 1, Failures: 0, Errors: 0, Time elapsed: 0.086 sec
    [junit] Running tests.TestLocalUnnamedSimpleType
    [junit] Tests run: 1, Failures: 0, Errors: 0, Time elapsed: 0.225 sec
    [junit] Running tests.TestSimpleRestriction
    [junit] Tests run: 2, Failures: 1, Errors: 0, Time elapsed: 0.098 sec

BUILD FAILED
/srv/gump/public/workspace/ws-axis2-commons/XmlSchema/build.xml:106: Test tests.TestSimpleRestriction failed

Total time: 2 minutes 4 seconds
---------------------------------------------

To subscribe to this information via syndicated feeds:
- RSS: http://vmgump.apache.org/gump/public/ws-axis2-commons/ws-commons-xmlschema/rss.xml
- Atom: http://vmgump.apache.org/gump/public/ws-axis2-commons/ws-commons-xmlschema/atom.xml

============================== Gump Tracking Only ===
Produced by Gump version 2.3.
Gump Run 59000009042008, vmgump:vmgump-public:59000009042008
Gump E-mail Identifier (unique within run) #21.

*********************************************************** G U M P
[GUMP@vmgump]: Project derby (in module db-derby) failed
To whom it may engage...
        
This is an automated request, but not an unsolicited one. For 
more information please visit http://gump.apache.org/nagged.html, 
and/or contact the folk at general@gump.apache.org.

Project derby has an issue affecting its community integration.
This issue affects 1 projects,
 and has been outstanding for 40 runs.
The current state of this project is 'Failed', with reason 'Build Failed'.
For reference only, the following projects are affected by this:
    - derby :  Apache Derby, 100% Java relational database.


Full details are available at:
    http://vmgump.apache.org/gump/public/db-derby/derby/index.html

That said, some information snippets are provided here.

The following annotations (debug/informational/warning/error messages) were provided:
 -INFO- Failed with reason build failed
 -INFO- Failed to extract fallback artifacts from Gump Repository



The following work was performed:
http://vmgump.apache.org/gump/public/db-derby/derby/gump_work/build_db-derby_derby.html
Work Name: build_db-derby_derby (Type: Build)
Work ended in a state of : Failed
Elapsed: 4 secs
Command Line: /usr/lib/jvm/java-1.5.0-sun/bin/java -Djava.awt.headless=true -Xbootclasspath/p:/srv/gump/public/workspace/xml-commons/java/external/build/xml-apis.jar:/srv/gump/public/workspace/xml-xerces2/build/xercesImpl.jar:/srv/gump/public/workspace/xml-xalan/build/serializer.jar:/srv/gump/public/workspace/xml-xalan/build/xalan-unbundled.jar org.apache.tools.ant.Main -Dgump.merge=/srv/gump/public/gump/work/merge.xml -Dbuild.sysclasspath=only -Dsane=false gump_all 
[Working Directory: /srv/gump/public/workspace/db-derby]
CLASSPATH: /usr/lib/jvm/java-1.5.0-sun/lib/tools.jar:/srv/gump/public/workspace/db-derby/classes:/srv/gump/public/workspace/ant/dist/lib/ant-jmf.jar:/srv/gump/public/workspace/ant/dist/lib/ant-swing.jar:/srv/gump/public/workspace/ant/dist/lib/ant-apache-resolver.jar:/srv/gump/public/workspace/ant/dist/lib/ant-trax.jar:/srv/gump/public/workspace/ant/dist/lib/ant-junit.jar:/srv/gump/public/workspace/ant/dist/lib/ant-launcher.jar:/srv/gump/public/workspace/ant/dist/lib/ant-nodeps.jar:/srv/gump/public/workspace/ant/dist/lib/ant.jar:/srv/gump/public/workspace/xml-commons/java/external/build/xml-apis-ext.jar:/srv/gump/public/workspace/jakarta-servletapi-5/jsr154/dist/lib/servlet-api.jar:/srv/gump/public/workspace/jakarta-oro/jakarta-oro-09042008.jar:/srv/gump/packages/javacc-3.1/bin/lib/javacc.jar:/srv/gump/public/workspace/junit/dist/junit-09042008.jar
---------------------------------------------
[setJdkProperties] j14lib = null
[setJdkProperties] j15lib = null
[setJdkProperties] 
[setJdkProperties] Please consult BUILDING.txt for instructions on how to set the jdk-library and compiler-classpath properties.
[setJdkProperties] Don't know how to set java14compile.classpath using this environment:
[setJdkProperties] 
[setJdkProperties] java.vendor = Sun Microsystems Inc.
[setJdkProperties] java.home = /usr/lib/jvm/java-1.5.0-sun-1.5.0.11/jre
[setJdkProperties] java.version = 1.5.0_11
[setJdkProperties] os.name = Linux
[setJdkProperties] j14lib = null
[setJdkProperties] j15lib = null
[setJdkProperties] 
[setJdkProperties] Please consult BUILDING.txt for instructions on how to set the jdk-library and compiler-classpath properties.
[setJdkProperties] 	at org.apache.derbyPreBuild.PropertySetter.couldntSetProperty(PropertySetter.java:677)
[setJdkProperties] 	at org.apache.derbyPreBuild.PropertySetter.setClasspathFromLib(PropertySetter.java:484)
[setJdkProperties] 	at org.apache.derbyPreBuild.PropertySetter.defaultSetter(PropertySetter.java:461)
[setJdkProperties] 	at org.apache.derbyPreBuild.PropertySetter.setForMostJDKs(PropertySetter.java:321)
[setJdkProperties] 	at org.apache.derbyPreBuild.PropertySetter.setForSunJDKs(PropertySetter.java:293)
[setJdkProperties] 	at org.apache.derbyPreBuild.PropertySetter.execute(PropertySetter.java:223)
[setJdkProperties] 	at org.apache.tools.ant.UnknownElement.execute(UnknownElement.java:288)
[setJdkProperties] 	at sun.reflect.GeneratedMethodAccessor9.invoke(Unknown Source)
[setJdkProperties] 	at sun.reflect.DelegatingMethodAccessorImpl.invoke(DelegatingMethodAccessorImpl.java:25)
[setJdkProperties] 	at java.lang.reflect.Method.invoke(Method.java:585)
[setJdkProperties] 	at org.apache.tools.ant.dispatch.DispatchUtils.execute(DispatchUtils.java:106)
[setJdkProperties] 	at org.apache.tools.ant.Task.perform(Task.java:348)
[setJdkProperties] 	at org.apache.tools.ant.Target.execute(Target.java:354)
[setJdkProperties] 	at org.apache.tools.ant.Target.performTasks(Target.java:379)
[setJdkProperties] 	at org.apache.tools.ant.Project.executeSortedTargets(Project.java:1324)
[setJdkProperties] 	at org.apache.tools.ant.Project.executeTarget(Project.java:1293)
[setJdkProperties] 	at org.apache.tools.ant.helper.DefaultExecutor.executeTargets(DefaultExecutor.java:41)
[setJdkProperties] 	at org.apache.tools.ant.Project.executeTargets(Project.java:1176)
[setJdkProperties] 	at org.apache.tools.ant.Main.runBuild(Main.java:762)
[setJdkProperties] 	at org.apache.tools.ant.Main.startAnt(Main.java:217)
[setJdkProperties] 	at org.apache.tools.ant.Main.start(Main.java:179)
[setJdkProperties] 	at org.apache.tools.ant.Main.main(Main.java:268)

BUILD FAILED
/srv/gump/public/workspace/db-derby/build.xml:192: Don't know how to set java14compile.classpath using this environment:

java.vendor = Sun Microsystems Inc.
java.home = /usr/lib/jvm/java-1.5.0-sun-1.5.0.11/jre
java.version = 1.5.0_11
os.name = Linux
j14lib = null
j15lib = null

Please consult BUILDING.txt for instructions on how to set the jdk-library and compiler-classpath properties.

Total time: 3 seconds
---------------------------------------------

To subscribe to this information via syndicated feeds:
- RSS: http://vmgump.apache.org/gump/public/db-derby/derby/rss.xml
- Atom: http://vmgump.apache.org/gump/public/db-derby/derby/atom.xml

============================== Gump Tracking Only ===
Produced by Gump version 2.3.
Gump Run 59000009042008, vmgump:vmgump-public:59000009042008
Gump E-mail Identifier (unique within run) #24.

*********************************************************** G U M P
[GUMP@vmgump]: Project authx-core (in module authx) failed
To whom it may engage...
        
This is an automated request, but not an unsolicited one. For 
more information please visit http://gump.apache.org/nagged.html, 
and/or contact the folk at general@gump.apache.org.

Project authx-core has an issue affecting its community integration.
This issue affects 2 projects.
The current state of this project is 'Failed', with reason 'Build Failed'.
For reference only, the following projects are affected by this:
    - authx-core :  Apache Authentication and Authorization Framework
    - authx-jdbc :  Apache Authentication and Authorization Framework


Full details are available at:
    http://vmgump.apache.org/gump/public/authx/authx-core/index.html

That said, some information snippets are provided here.

The following annotations (debug/informational/warning/error messages) were provided:
 -DEBUG- Sole output [authx-core-09042008.jar] identifier set to project name
 -DEBUG- Dependency on packaged-jmock exists, no need to add for property maven.jar.jmock.
 -DEBUG- (Gump generated) Maven Properties in: /srv/gump/public/workspace/authx/core/build.properties
 -INFO- Failed with reason build failed
 -DEBUG- Maven POM in: /srv/gump/public/workspace/authx/core/project.xml
 -DEBUG- Maven project properties in: /srv/gump/public/workspace/authx/core/project.properties
 -INFO- Project Reports in: /srv/gump/public/workspace/authx/core/target/test-reports
 -WARNING- No directory [/srv/gump/public/workspace/authx/core/target/test-reports]
 -DEBUG- Extracted fallback artifacts from Gump Repository



The following work was performed:
http://vmgump.apache.org/gump/public/authx/authx-core/gump_work/build_authx_authx-core.html
Work Name: build_authx_authx-core (Type: Build)
Work ended in a state of : Failed
Elapsed: 4 secs
Command Line: maven --offline jar 
[Working Directory: /srv/gump/public/workspace/authx/core]
CLASSPATH: /usr/lib/jvm/java-1.5.0-sun/lib/tools.jar:/srv/gump/public/workspace/apache-commons/collections/build/commons-collections-09042008.jar:/srv/gump/packages/jmock/jmock-1.0.1.jar:/srv/gump/packages/maven-site-plugin/maven-site-plugin-1.6.1.jar
---------------------------------------------
 __  __
|  \/  |__ _Apache__ ___
| |\/| / _` \ V / -_) ' \  ~ intelligent projects ~
|_|  |_\__,_|\_/\___|_||_|  v. 1.0.2

The build cannot continue because of the following unsatisfied dependency:

jsch-0.1.5.jar

Total time: 3 seconds
Finished at: Wed Apr 09 03:18:36 GMT-08:00 2008

---------------------------------------------

To subscribe to this information via syndicated feeds:
- RSS: http://vmgump.apache.org/gump/public/authx/authx-core/rss.xml
- Atom: http://vmgump.apache.org/gump/public/authx/authx-core/atom.xml

============================== Gump Tracking Only ===
Produced by Gump version 2.3.
Gump Run 59000009042008, vmgump:vmgump-public:59000009042008
Gump E-mail Identifier (unique within run) #27.

*********************************************************** G U M P
[GUMP@vmgump]: Project emma (in module emma) failed
To whom it may engage...
        
This is an automated request, but not an unsolicited one. For 
more information please visit http://gump.apache.org/nagged.html, 
and/or contact the folk at general@gump.apache.org.

Project emma has an issue affecting its community integration.
This issue affects 1 projects,
 and has been outstanding for 40 runs.
The current state of this project is 'Failed', with reason 'Build Failed'.
For reference only, the following projects are affected by this:
    - emma :  code coverage tool


Full details are available at:
    http://vmgump.apache.org/gump/public/emma/emma/index.html

That said, some information snippets are provided here.

The following annotations (debug/informational/warning/error messages) were provided:
 -INFO- Failed with reason build failed
 -INFO- Failed to extract fallback artifacts from Gump Repository



The following work was performed:
http://vmgump.apache.org/gump/public/emma/emma/gump_work/build_emma_emma.html
Work Name: build_emma_emma (Type: Build)
Work ended in a state of : Failed
Elapsed: 7 secs
Command Line: /usr/lib/jvm/java-1.5.0-sun/bin/java -Djava.awt.headless=true -Xbootclasspath/p:/srv/gump/public/workspace/xml-commons/java/external/build/xml-apis.jar:/srv/gump/public/workspace/xml-xerces2/build/xercesImpl.jar org.apache.tools.ant.Main -Dgump.merge=/srv/gump/public/gump/work/merge.xml -Dbuild.sysclasspath=only -Dapp.short.name=emma-09042008 
[Working Directory: /srv/gump/public/workspace/emma]
CLASSPATH: /usr/lib/jvm/java-1.5.0-sun/lib/tools.jar:/srv/gump/public/workspace/emma/out/core/classes:/srv/gump/public/workspace/emma/out/ant/classes:/srv/gump/public/workspace/emma/lib/internal/stamptool.jar:/srv/gump/public/workspace/ant/dist/lib/ant-jmf.jar:/srv/gump/public/workspace/ant/dist/lib/ant-swing.jar:/srv/gump/public/workspace/ant/dist/lib/ant-apache-resolver.jar:/srv/gump/public/workspace/ant/dist/lib/ant-trax.jar:/srv/gump/public/workspace/ant/dist/lib/ant-junit.jar:/srv/gump/public/workspace/ant/dist/lib/ant-launcher.jar:/srv/gump/public/workspace/ant/dist/lib/ant-nodeps.jar:/srv/gump/public/workspace/ant/dist/lib/ant.jar:/srv/gump/public/workspace/xml-commons/java/external/build/xml-apis-ext.jar
---------------------------------------------
     [copy] Copying 1 file to /srv/gump/public/workspace/emma/out/temp

timestamp:

-pre-compile:

core.bootstrap.compile:
    [javac] Compiling 2 source files to /srv/gump/public/workspace/emma/out/core/classes
    [javac] 
    [javac]           WARNING
    [javac] 
    [javac] The -source switch defaults to 1.5 in JDK 1.5 and 1.6.
    [javac] If you specify -target 1.2 you now must also specify -source 1.2.
    [javac] Ant will implicitly add -source 1.2 for you.  Please change your build file.

core.java14.compile:
    [javac] Compiling 1 source file to /srv/gump/public/workspace/emma/out/core/classes
    [javac] 
    [javac]           WARNING
    [javac] 
    [javac] The -source switch defaults to 1.5 in JDK 1.5 and 1.6.
    [javac] If you specify -target 1.2 you now must also specify -source 1.2.
    [javac] Ant will implicitly add -source 1.2 for you.  Please change your build file.

core.java13.compile:
    [javac] Compiling 1 source file to /srv/gump/public/workspace/emma/out/core/classes
    [javac] 
    [javac]           WARNING
    [javac] 
    [javac] The -source switch defaults to 1.5 in JDK 1.5 and 1.6.
    [javac] If you specify -target 1.2 you now must also specify -source 1.2.
    [javac] Ant will implicitly add -source 1.2 for you.  Please change your build file.

core.compile:
    [javac] Compiling 175 source files to /srv/gump/public/workspace/emma/out/core/classes
    [javac] 
    [javac]           WARNING
    [javac] 
    [javac] The -source switch defaults to 1.5 in JDK 1.5 and 1.6.
    [javac] If you specify -target 1.2 you now must also specify -source 1.2.
    [javac] Ant will implicitly add -source 1.2 for you.  Please change your build file.
    [javac] /srv/gump/public/workspace/emma/core/java12/com/vladium/emma/run/InstrClassLoader.java:346: reference to CodeSource is ambiguous, both method CodeSource(java.net.URL,java.security.cert.Certificate[]) in java.security.CodeSource and method CodeSource(java.net.URL,java.security.CodeSigner[]) in java.security.CodeSource match
    [javac]         final CodeSource csrc = new CodeSource (srcURL, null);
    [javac]                                 ^
    [javac] 1 error

BUILD FAILED
/srv/gump/public/workspace/emma/build.xml:297: Compile failed; see the compiler error output for details.

Total time: 6 seconds
---------------------------------------------

To subscribe to this information via syndicated feeds:
- RSS: http://vmgump.apache.org/gump/public/emma/emma/rss.xml
- Atom: http://vmgump.apache.org/gump/public/emma/emma/atom.xml

============================== Gump Tracking Only ===
Produced by Gump version 2.3.
Gump Run 59000009042008, vmgump:vmgump-public:59000009042008
Gump E-mail Identifier (unique within run) #29.

*********************************************************** G U M P
[GUMP@vmgump]: Project apache-httpd-make (in module apache-httpd) failed
To whom it may engage...
        
This is an automated request, but not an unsolicited one. For 
more information please visit http://gump.apache.org/nagged.html, 
and/or contact the folk at general@gump.apache.org.

Project apache-httpd-make has an issue affecting its community integration.
This issue affects 5 projects,
 and has been outstanding for 21 runs.
The current state of this project is 'Failed', with reason 'Build Failed'.
For reference only, the following projects are affected by this:
    - apache-httpd-make :  Apache HTTP Server
    - apache-httpd-make-install :  Apache HTTP Server
    - jakarta-tomcat-jk-native :  Connectors to various web servers
    - jakarta-tomcat-jk-native-buildconf :  Connectors to various web servers
    - jakarta-tomcat-jk-native-configure :  Connectors to various web servers


Full details are available at:
    http://vmgump.apache.org/gump/public/apache-httpd/apache-httpd-make/index.html

That said, some information snippets are provided here.

The following annotations (debug/informational/warning/error messages) were provided:
 -INFO- Failed with reason build failed



The following work was performed:
http://vmgump.apache.org/gump/public/apache-httpd/apache-httpd-make/gump_work/build_apache-httpd_apache-httpd-make.html
Work Name: build_apache-httpd_apache-httpd-make (Type: Build)
Work ended in a state of : Failed
Elapsed: 4 mins 33 secs
Command Line: make 
[Working Directory: /srv/gump/public/workspace/apache-httpd]
---------------------------------------------
/srv/gump/public/workspace/apr/dest-09042008/build-1/libtool --silent --mode=compile ccache gcc -g -O2 -pthread    -DLINUX=2 -D_REENTRANT -D_GNU_SOURCE -D_LARGEFILE64_SOURCE    -I/srv/gump/public/workspace/apache-httpd/srclib/pcre -I. -I/srv/gump/public/workspace/apache-httpd/os/unix -I/srv/gump/public/workspace/apache-httpd/server/mpm/prefork -I/srv/gump/public/workspace/apache-httpd/modules/http -I/srv/gump/public/workspace/apache-httpd/modules/filters -I/srv/gump/public/workspace/apache-httpd/modules/proxy -I/srv/gump/public/workspace/apache-httpd/modules/session -I/srv/gump/public/workspace/apache-httpd/include -I/srv/gump/public/workspace/apache-httpd/modules/generators -I/srv/gump/public/workspace/apache-httpd/modules/mappers -I/srv/gump/public/workspace/apache-httpd/modules/database -I/srv/gump/public/workspace/apr/dest-09042008/include/apr-1 -I/srv/gump/public/workspace/apr-util/dest-09042008/include/apr-1 -I/srv/gump/public/workspace/apache-httpd/modules/cache -I/srv
 /gump/public/workspace/apache-httpd/modules/proxy/../generators -I/srv/gump/public/workspace/apache-httpd/modules/ssl -I/srv/gump/public/workspace/apache-httpd/modules/dav/main  -prefer-non-pic -static -c mod_userdir.c && touch mod_userdir.lo
/srv/gump/public/workspace/apr/dest-09042008/build-1/libtool --silent --mode=link ccache gcc -g -O2 -pthread   -static     -o libmod_userdir.la mod_userdir.lo 
/srv/gump/public/workspace/apr/dest-09042008/build-1/libtool --silent --mode=compile ccache gcc -g -O2 -pthread    -DLINUX=2 -D_REENTRANT -D_GNU_SOURCE -D_LARGEFILE64_SOURCE    -I/srv/gump/public/workspace/apache-httpd/srclib/pcre -I. -I/srv/gump/public/workspace/apache-httpd/os/unix -I/srv/gump/public/workspace/apache-httpd/server/mpm/prefork -I/srv/gump/public/workspace/apache-httpd/modules/http -I/srv/gump/public/workspace/apache-httpd/modules/filters -I/srv/gump/public/workspace/apache-httpd/modules/proxy -I/srv/gump/public/workspace/apache-httpd/modules/session -I/srv/gump/public/workspace/apache-httpd/include -I/srv/gump/public/workspace/apache-httpd/modules/generators -I/srv/gump/public/workspace/apache-httpd/modules/mappers -I/srv/gump/public/workspace/apache-httpd/modules/database -I/srv/gump/public/workspace/apr/dest-09042008/include/apr-1 -I/srv/gump/public/workspace/apr-util/dest-09042008/include/apr-1 -I/srv/gump/public/workspace/apache-httpd/modules/cache -I/srv
 /gump/public/workspace/apache-httpd/modules/proxy/../generators -I/srv/gump/public/workspace/apache-httpd/modules/ssl -I/srv/gump/public/workspace/apache-httpd/modules/dav/main  -prefer-non-pic -static -c mod_alias.c && touch mod_alias.lo
/srv/gump/public/workspace/apr/dest-09042008/build-1/libtool --silent --mode=link ccache gcc -g -O2 -pthread   -static     -o libmod_alias.la mod_alias.lo 
/srv/gump/public/workspace/apr/dest-09042008/build-1/libtool --silent --mode=compile ccache gcc -g -O2 -pthread    -DLINUX=2 -D_REENTRANT -D_GNU_SOURCE -D_LARGEFILE64_SOURCE    -I/srv/gump/public/workspace/apache-httpd/srclib/pcre -I. -I/srv/gump/public/workspace/apache-httpd/os/unix -I/srv/gump/public/workspace/apache-httpd/server/mpm/prefork -I/srv/gump/public/workspace/apache-httpd/modules/http -I/srv/gump/public/workspace/apache-httpd/modules/filters -I/srv/gump/public/workspace/apache-httpd/modules/proxy -I/srv/gump/public/workspace/apache-httpd/modules/session -I/srv/gump/public/workspace/apache-httpd/include -I/srv/gump/public/workspace/apache-httpd/modules/generators -I/srv/gump/public/workspace/apache-httpd/modules/mappers -I/srv/gump/public/workspace/apache-httpd/modules/database -I/srv/gump/public/workspace/apr/dest-09042008/include/apr-1 -I/srv/gump/public/workspace/apr-util/dest-09042008/include/apr-1 -I/srv/gump/public/workspace/apache-httpd/modules/cache -I/srv
 /gump/public/workspace/apache-httpd/modules/proxy/../generators -I/srv/gump/public/workspace/apache-httpd/modules/ssl -I/srv/gump/public/workspace/apache-httpd/modules/dav/main  -prefer-non-pic -static -c mod_so.c && touch mod_so.lo
/srv/gump/public/workspace/apr/dest-09042008/build-1/libtool --silent --mode=link ccache gcc -g -O2 -pthread   -static     -o libmod_so.la mod_so.lo 
make[3]: Leaving directory `/srv/gump/public/workspace/apache-httpd/modules/mappers'
make[2]: Leaving directory `/srv/gump/public/workspace/apache-httpd/modules/mappers'
make[1]: Leaving directory `/srv/gump/public/workspace/apache-httpd/modules'
Making all in support
make[1]: Entering directory `/srv/gump/public/workspace/apache-httpd/support'
make[2]: Entering directory `/srv/gump/public/workspace/apache-httpd/support'
/srv/gump/public/workspace/apr/dest-09042008/build-1/libtool --silent --mode=compile ccache gcc -g -O2 -pthread    -DLINUX=2 -D_REENTRANT -D_GNU_SOURCE -D_LARGEFILE64_SOURCE    -I/srv/gump/public/workspace/apache-httpd/srclib/pcre -I. -I/srv/gump/public/workspace/apache-httpd/os/unix -I/srv/gump/public/workspace/apache-httpd/server/mpm/prefork -I/srv/gump/public/workspace/apache-httpd/modules/http -I/srv/gump/public/workspace/apache-httpd/modules/filters -I/srv/gump/public/workspace/apache-httpd/modules/proxy -I/srv/gump/public/workspace/apache-httpd/modules/session -I/srv/gump/public/workspace/apache-httpd/include -I/srv/gump/public/workspace/apache-httpd/modules/generators -I/srv/gump/public/workspace/apache-httpd/modules/mappers -I/srv/gump/public/workspace/apache-httpd/modules/database -I/srv/gump/public/workspace/apr/dest-09042008/include/apr-1 -I/srv/gump/public/workspace/apr-util/dest-09042008/include/apr-1 -I/srv/gump/public/workspace/apache-httpd/modules/cache -I/srv
 /gump/public/workspace/apache-httpd/modules/proxy/../generators -I/srv/gump/public/workspace/apache-httpd/modules/ssl -I/srv/gump/public/workspace/apache-httpd/modules/dav/main  -prefer-non-pic -static -c htpasswd.c && touch htpasswd.lo
/srv/gump/public/workspace/apr/dest-09042008/build-1/libtool --silent --mode=link ccache gcc -g -O2 -pthread        -o htpasswd  htpasswd.lo   -lm /srv/gump/public/workspace/apache-httpd/srclib/pcre/libpcre.la                             /srv/gump/public/workspace/apr-util/dest-09042008/lib/libaprutil-1.la -lexpat /srv/gump/public/workspace/apr/dest-09042008/lib/libapr-1.la -lrt -lcrypt -lpthread -ldl
/srv/gump/public/workspace/apr/dest-09042008/build-1/libtool --silent --mode=compile ccache gcc -g -O2 -pthread    -DLINUX=2 -D_REENTRANT -D_GNU_SOURCE -D_LARGEFILE64_SOURCE    -I/srv/gump/public/workspace/apache-httpd/srclib/pcre -I. -I/srv/gump/public/workspace/apache-httpd/os/unix -I/srv/gump/public/workspace/apache-httpd/server/mpm/prefork -I/srv/gump/public/workspace/apache-httpd/modules/http -I/srv/gump/public/workspace/apache-httpd/modules/filters -I/srv/gump/public/workspace/apache-httpd/modules/proxy -I/srv/gump/public/workspace/apache-httpd/modules/session -I/srv/gump/public/workspace/apache-httpd/include -I/srv/gump/public/workspace/apache-httpd/modules/generators -I/srv/gump/public/workspace/apache-httpd/modules/mappers -I/srv/gump/public/workspace/apache-httpd/modules/database -I/srv/gump/public/workspace/apr/dest-09042008/include/apr-1 -I/srv/gump/public/workspace/apr-util/dest-09042008/include/apr-1 -I/srv/gump/public/workspace/apache-httpd/modules/cache -I/srv
 /gump/public/workspace/apache-httpd/modules/proxy/../generators -I/srv/gump/public/workspace/apache-httpd/modules/ssl -I/srv/gump/public/workspace/apache-httpd/modules/dav/main  -prefer-non-pic -static -c htdigest.c && touch htdigest.lo
/srv/gump/public/workspace/apr/dest-09042008/build-1/libtool --silent --mode=link ccache gcc -g -O2 -pthread        -o htdigest  htdigest.lo   -lm /srv/gump/public/workspace/apache-httpd/srclib/pcre/libpcre.la                             /srv/gump/public/workspace/apr-util/dest-09042008/lib/libaprutil-1.la -lexpat /srv/gump/public/workspace/apr/dest-09042008/lib/libapr-1.la -lrt -lcrypt -lpthread -ldl
/srv/gump/public/workspace/apr/dest-09042008/build-1/libtool --silent --mode=compile ccache gcc -g -O2 -pthread    -DLINUX=2 -D_REENTRANT -D_GNU_SOURCE -D_LARGEFILE64_SOURCE    -I/srv/gump/public/workspace/apache-httpd/srclib/pcre -I. -I/srv/gump/public/workspace/apache-httpd/os/unix -I/srv/gump/public/workspace/apache-httpd/server/mpm/prefork -I/srv/gump/public/workspace/apache-httpd/modules/http -I/srv/gump/public/workspace/apache-httpd/modules/filters -I/srv/gump/public/workspace/apache-httpd/modules/proxy -I/srv/gump/public/workspace/apache-httpd/modules/session -I/srv/gump/public/workspace/apache-httpd/include -I/srv/gump/public/workspace/apache-httpd/modules/generators -I/srv/gump/public/workspace/apache-httpd/modules/mappers -I/srv/gump/public/workspace/apache-httpd/modules/database -I/srv/gump/public/workspace/apr/dest-09042008/include/apr-1 -I/srv/gump/public/workspace/apr-util/dest-09042008/include/apr-1 -I/srv/gump/public/workspace/apache-httpd/modules/cache -I/srv
 /gump/public/workspace/apache-httpd/modules/proxy/../generators -I/srv/gump/public/workspace/apache-httpd/modules/ssl -I/srv/gump/public/workspace/apache-httpd/modules/dav/main  -prefer-non-pic -static -c rotatelogs.c && touch rotatelogs.lo
/srv/gump/public/workspace/apr/dest-09042008/build-1/libtool --silent --mode=link ccache gcc -g -O2 -pthread        -o rotatelogs  rotatelogs.lo   -lm /srv/gump/public/workspace/apache-httpd/srclib/pcre/libpcre.la                             /srv/gump/public/workspace/apr-util/dest-09042008/lib/libaprutil-1.la -lexpat /srv/gump/public/workspace/apr/dest-09042008/lib/libapr-1.la -lrt -lcrypt -lpthread -ldl
/srv/gump/public/workspace/apr/dest-09042008/build-1/libtool --silent --mode=compile ccache gcc -g -O2 -pthread    -DLINUX=2 -D_REENTRANT -D_GNU_SOURCE -D_LARGEFILE64_SOURCE    -I/srv/gump/public/workspace/apache-httpd/srclib/pcre -I. -I/srv/gump/public/workspace/apache-httpd/os/unix -I/srv/gump/public/workspace/apache-httpd/server/mpm/prefork -I/srv/gump/public/workspace/apache-httpd/modules/http -I/srv/gump/public/workspace/apache-httpd/modules/filters -I/srv/gump/public/workspace/apache-httpd/modules/proxy -I/srv/gump/public/workspace/apache-httpd/modules/session -I/srv/gump/public/workspace/apache-httpd/include -I/srv/gump/public/workspace/apache-httpd/modules/generators -I/srv/gump/public/workspace/apache-httpd/modules/mappers -I/srv/gump/public/workspace/apache-httpd/modules/database -I/srv/gump/public/workspace/apr/dest-09042008/include/apr-1 -I/srv/gump/public/workspace/apr-util/dest-09042008/include/apr-1 -I/srv/gump/public/workspace/apache-httpd/modules/cache -I/srv
 /gump/public/workspace/apache-httpd/modules/proxy/../generators -I/srv/gump/public/workspace/apache-httpd/modules/ssl -I/srv/gump/public/workspace/apache-httpd/modules/dav/main  -prefer-non-pic -static -c logresolve.c && touch logresolve.lo
/srv/gump/public/workspace/apr/dest-09042008/build-1/libtool --silent --mode=link ccache gcc -g -O2 -pthread        -o logresolve  logresolve.lo   -lm /srv/gump/public/workspace/apache-httpd/srclib/pcre/libpcre.la                             /srv/gump/public/workspace/apr-util/dest-09042008/lib/libaprutil-1.la -lexpat /srv/gump/public/workspace/apr/dest-09042008/lib/libapr-1.la -lrt -lcrypt -lpthread -ldl
/srv/gump/public/workspace/apr/dest-09042008/build-1/libtool --silent --mode=compile ccache gcc -g -O2 -pthread    -DLINUX=2 -D_REENTRANT -D_GNU_SOURCE -D_LARGEFILE64_SOURCE    -I/srv/gump/public/workspace/apache-httpd/srclib/pcre -I. -I/srv/gump/public/workspace/apache-httpd/os/unix -I/srv/gump/public/workspace/apache-httpd/server/mpm/prefork -I/srv/gump/public/workspace/apache-httpd/modules/http -I/srv/gump/public/workspace/apache-httpd/modules/filters -I/srv/gump/public/workspace/apache-httpd/modules/proxy -I/srv/gump/public/workspace/apache-httpd/modules/session -I/srv/gump/public/workspace/apache-httpd/include -I/srv/gump/public/workspace/apache-httpd/modules/generators -I/srv/gump/public/workspace/apache-httpd/modules/mappers -I/srv/gump/public/workspace/apache-httpd/modules/database -I/srv/gump/public/workspace/apr/dest-09042008/include/apr-1 -I/srv/gump/public/workspace/apr-util/dest-09042008/include/apr-1 -I/srv/gump/public/workspace/apache-httpd/modules/cache -I/srv
 /gump/public/workspace/apache-httpd/modules/proxy/../generators -I/srv/gump/public/workspace/apache-httpd/modules/ssl -I/srv/gump/public/workspace/apache-httpd/modules/dav/main  -prefer-non-pic -static -c ab.c && touch ab.lo
/srv/gump/public/workspace/apr/dest-09042008/build-1/libtool --silent --mode=link ccache gcc -g -O2 -pthread        -o ab  ab.lo   -lm /srv/gump/public/workspace/apache-httpd/srclib/pcre/libpcre.la                             /srv/gump/public/workspace/apr-util/dest-09042008/lib/libaprutil-1.la -lexpat /srv/gump/public/workspace/apr/dest-09042008/lib/libapr-1.la -lrt -lcrypt -lpthread -ldl 
/srv/gump/public/workspace/apr/dest-09042008/build-1/libtool --silent --mode=compile ccache gcc -g -O2 -pthread    -DLINUX=2 -D_REENTRANT -D_GNU_SOURCE -D_LARGEFILE64_SOURCE    -I/srv/gump/public/workspace/apache-httpd/srclib/pcre -I. -I/srv/gump/public/workspace/apache-httpd/os/unix -I/srv/gump/public/workspace/apache-httpd/server/mpm/prefork -I/srv/gump/public/workspace/apache-httpd/modules/http -I/srv/gump/public/workspace/apache-httpd/modules/filters -I/srv/gump/public/workspace/apache-httpd/modules/proxy -I/srv/gump/public/workspace/apache-httpd/modules/session -I/srv/gump/public/workspace/apache-httpd/include -I/srv/gump/public/workspace/apache-httpd/modules/generators -I/srv/gump/public/workspace/apache-httpd/modules/mappers -I/srv/gump/public/workspace/apache-httpd/modules/database -I/srv/gump/public/workspace/apr/dest-09042008/include/apr-1 -I/srv/gump/public/workspace/apr-util/dest-09042008/include/apr-1 -I/srv/gump/public/workspace/apache-httpd/modules/cache -I/srv
 /gump/public/workspace/apache-httpd/modules/proxy/../generators -I/srv/gump/public/workspace/apache-httpd/modules/ssl -I/srv/gump/public/workspace/apache-httpd/modules/dav/main  -prefer-non-pic -static -c checkgid.c && touch checkgid.lo
/srv/gump/public/workspace/apr/dest-09042008/build-1/libtool --silent --mode=link ccache gcc -g -O2 -pthread        -o checkgid  checkgid.lo   -lm /srv/gump/public/workspace/apache-httpd/srclib/pcre/libpcre.la                             /srv/gump/public/workspace/apr-util/dest-09042008/lib/libaprutil-1.la -lexpat /srv/gump/public/workspace/apr/dest-09042008/lib/libapr-1.la -lrt -lcrypt -lpthread -ldl
/srv/gump/public/workspace/apr/dest-09042008/build-1/libtool --silent --mode=compile ccache gcc -g -O2 -pthread    -DLINUX=2 -D_REENTRANT -D_GNU_SOURCE -D_LARGEFILE64_SOURCE    -I/srv/gump/public/workspace/apache-httpd/srclib/pcre -I. -I/srv/gump/public/workspace/apache-httpd/os/unix -I/srv/gump/public/workspace/apache-httpd/server/mpm/prefork -I/srv/gump/public/workspace/apache-httpd/modules/http -I/srv/gump/public/workspace/apache-httpd/modules/filters -I/srv/gump/public/workspace/apache-httpd/modules/proxy -I/srv/gump/public/workspace/apache-httpd/modules/session -I/srv/gump/public/workspace/apache-httpd/include -I/srv/gump/public/workspace/apache-httpd/modules/generators -I/srv/gump/public/workspace/apache-httpd/modules/mappers -I/srv/gump/public/workspace/apache-httpd/modules/database -I/srv/gump/public/workspace/apr/dest-09042008/include/apr-1 -I/srv/gump/public/workspace/apr-util/dest-09042008/include/apr-1 -I/srv/gump/public/workspace/apache-httpd/modules/cache -I/srv
 /gump/public/workspace/apache-httpd/modules/proxy/../generators -I/srv/gump/public/workspace/apache-httpd/modules/ssl -I/srv/gump/public/workspace/apache-httpd/modules/dav/main  -prefer-non-pic -static -c htdbm.c && touch htdbm.lo
/srv/gump/public/workspace/apr/dest-09042008/build-1/libtool --silent --mode=link ccache gcc -g -O2 -pthread        -o htdbm  htdbm.lo   -lm /srv/gump/public/workspace/apache-httpd/srclib/pcre/libpcre.la                             /srv/gump/public/workspace/apr-util/dest-09042008/lib/libaprutil-1.la -lexpat /srv/gump/public/workspace/apr/dest-09042008/lib/libapr-1.la -lrt -lcrypt -lpthread -ldl
/srv/gump/public/workspace/apr/dest-09042008/build-1/libtool --silent --mode=compile ccache gcc -g -O2 -pthread    -DLINUX=2 -D_REENTRANT -D_GNU_SOURCE -D_LARGEFILE64_SOURCE    -I/srv/gump/public/workspace/apache-httpd/srclib/pcre -I. -I/srv/gump/public/workspace/apache-httpd/os/unix -I/srv/gump/public/workspace/apache-httpd/server/mpm/prefork -I/srv/gump/public/workspace/apache-httpd/modules/http -I/srv/gump/public/workspace/apache-httpd/modules/filters -I/srv/gump/public/workspace/apache-httpd/modules/proxy -I/srv/gump/public/workspace/apache-httpd/modules/session -I/srv/gump/public/workspace/apache-httpd/include -I/srv/gump/public/workspace/apache-httpd/modules/generators -I/srv/gump/public/workspace/apache-httpd/modules/mappers -I/srv/gump/public/workspace/apache-httpd/modules/database -I/srv/gump/public/workspace/apr/dest-09042008/include/apr-1 -I/srv/gump/public/workspace/apr-util/dest-09042008/include/apr-1 -I/srv/gump/public/workspace/apache-httpd/modules/cache -I/srv
 /gump/public/workspace/apache-httpd/modules/proxy/../generators -I/srv/gump/public/workspace/apache-httpd/modules/ssl -I/srv/gump/public/workspace/apache-httpd/modules/dav/main  -prefer-non-pic -static -c htcacheclean.c && touch htcacheclean.lo
/srv/gump/public/workspace/apr/dest-09042008/build-1/libtool --silent --mode=link ccache gcc -g -O2 -pthread        -o htcacheclean  htcacheclean.lo   -lm /srv/gump/public/workspace/apache-httpd/srclib/pcre/libpcre.la                             /srv/gump/public/workspace/apr-util/dest-09042008/lib/libaprutil-1.la -lexpat /srv/gump/public/workspace/apr/dest-09042008/lib/libapr-1.la -lrt -lcrypt -lpthread -ldl
/srv/gump/public/workspace/apr/dest-09042008/build-1/libtool --silent --mode=compile ccache gcc -g -O2 -pthread    -DLINUX=2 -D_REENTRANT -D_GNU_SOURCE -D_LARGEFILE64_SOURCE    -I/srv/gump/public/workspace/apache-httpd/srclib/pcre -I. -I/srv/gump/public/workspace/apache-httpd/os/unix -I/srv/gump/public/workspace/apache-httpd/server/mpm/prefork -I/srv/gump/public/workspace/apache-httpd/modules/http -I/srv/gump/public/workspace/apache-httpd/modules/filters -I/srv/gump/public/workspace/apache-httpd/modules/proxy -I/srv/gump/public/workspace/apache-httpd/modules/session -I/srv/gump/public/workspace/apache-httpd/include -I/srv/gump/public/workspace/apache-httpd/modules/generators -I/srv/gump/public/workspace/apache-httpd/modules/mappers -I/srv/gump/public/workspace/apache-httpd/modules/database -I/srv/gump/public/workspace/apr/dest-09042008/include/apr-1 -I/srv/gump/public/workspace/apr-util/dest-09042008/include/apr-1 -I/srv/gump/public/workspace/apache-httpd/modules/cache -I/srv
 /gump/public/workspace/apache-httpd/modules/proxy/../generators -I/srv/gump/public/workspace/apache-httpd/modules/ssl -I/srv/gump/public/workspace/apache-httpd/modules/dav/main  -prefer-non-pic -static -c httxt2dbm.c && touch httxt2dbm.lo
/srv/gump/public/workspace/apr/dest-09042008/build-1/libtool --silent --mode=link ccache gcc -g -O2 -pthread        -o httxt2dbm  httxt2dbm.lo   -lm /srv/gump/public/workspace/apache-httpd/srclib/pcre/libpcre.la                             /srv/gump/public/workspace/apr-util/dest-09042008/lib/libaprutil-1.la -lexpat /srv/gump/public/workspace/apr/dest-09042008/lib/libapr-1.la -lrt -lcrypt -lpthread -ldl
/srv/gump/public/workspace/apr/dest-09042008/build-1/libtool --silent --mode=compile ccache gcc -g -O2 -pthread    -DLINUX=2 -D_REENTRANT -D_GNU_SOURCE -D_LARGEFILE64_SOURCE    -I/srv/gump/public/workspace/apache-httpd/srclib/pcre -I. -I/srv/gump/public/workspace/apache-httpd/os/unix -I/srv/gump/public/workspace/apache-httpd/server/mpm/prefork -I/srv/gump/public/workspace/apache-httpd/modules/http -I/srv/gump/public/workspace/apache-httpd/modules/filters -I/srv/gump/public/workspace/apache-httpd/modules/proxy -I/srv/gump/public/workspace/apache-httpd/modules/session -I/srv/gump/public/workspace/apache-httpd/include -I/srv/gump/public/workspace/apache-httpd/modules/generators -I/srv/gump/public/workspace/apache-httpd/modules/mappers -I/srv/gump/public/workspace/apache-httpd/modules/database -I/srv/gump/public/workspace/apr/dest-09042008/include/apr-1 -I/srv/gump/public/workspace/apr-util/dest-09042008/include/apr-1 -I/srv/gump/public/workspace/apache-httpd/modules/cache -I/srv
 /gump/public/workspace/apache-httpd/modules/proxy/../generators -I/srv/gump/public/workspace/apache-httpd/modules/ssl -I/srv/gump/public/workspace/apache-httpd/modules/dav/main  -prefer-non-pic -static -c fcgistarter.c && touch fcgistarter.lo
/srv/gump/public/workspace/apr/dest-09042008/build-1/libtool --silent --mode=link ccache gcc -g -O2 -pthread        -o fcgistarter  fcgistarter.lo   -lm /srv/gump/public/workspace/apache-httpd/srclib/pcre/libpcre.la                             /srv/gump/public/workspace/apr-util/dest-09042008/lib/libaprutil-1.la -lexpat /srv/gump/public/workspace/apr/dest-09042008/lib/libapr-1.la -lrt -lcrypt -lpthread -ldl
make[2]: Leaving directory `/srv/gump/public/workspace/apache-httpd/support'
make[1]: Leaving directory `/srv/gump/public/workspace/apache-httpd/support'
make[1]: Entering directory `/srv/gump/public/workspace/apache-httpd'
/srv/gump/public/workspace/apr/dest-09042008/build-1/libtool --silent --mode=compile ccache gcc -g -O2 -pthread    -DLINUX=2 -D_REENTRANT -D_GNU_SOURCE -D_LARGEFILE64_SOURCE    -I/srv/gump/public/workspace/apache-httpd/srclib/pcre -I. -I/srv/gump/public/workspace/apache-httpd/os/unix -I/srv/gump/public/workspace/apache-httpd/server/mpm/prefork -I/srv/gump/public/workspace/apache-httpd/modules/http -I/srv/gump/public/workspace/apache-httpd/modules/filters -I/srv/gump/public/workspace/apache-httpd/modules/proxy -I/srv/gump/public/workspace/apache-httpd/modules/session -I/srv/gump/public/workspace/apache-httpd/include -I/srv/gump/public/workspace/apache-httpd/modules/generators -I/srv/gump/public/workspace/apache-httpd/modules/mappers -I/srv/gump/public/workspace/apache-httpd/modules/database -I/srv/gump/public/workspace/apr/dest-09042008/include/apr-1 -I/srv/gump/public/workspace/apr-util/dest-09042008/include/apr-1 -I/srv/gump/public/workspace/apache-httpd/modules/cache -I/srv
 /gump/public/workspace/apache-httpd/modules/proxy/../generators -I/srv/gump/public/workspace/apache-httpd/modules/ssl -I/srv/gump/public/workspace/apache-httpd/modules/dav/main  -prefer-non-pic -static -c modules.c && touch modules.lo
ccache gcc -g -O2 -pthread    -DLINUX=2 -D_REENTRANT -D_GNU_SOURCE -D_LARGEFILE64_SOURCE    -I/srv/gump/public/workspace/apache-httpd/srclib/pcre -I. -I/srv/gump/public/workspace/apache-httpd/os/unix -I/srv/gump/public/workspace/apache-httpd/server/mpm/prefork -I/srv/gump/public/workspace/apache-httpd/modules/http -I/srv/gump/public/workspace/apache-httpd/modules/filters -I/srv/gump/public/workspace/apache-httpd/modules/proxy -I/srv/gump/public/workspace/apache-httpd/modules/session -I/srv/gump/public/workspace/apache-httpd/include -I/srv/gump/public/workspace/apache-httpd/modules/generators -I/srv/gump/public/workspace/apache-httpd/modules/mappers -I/srv/gump/public/workspace/apache-httpd/modules/database -I/srv/gump/public/workspace/apr/dest-09042008/include/apr-1 -I/srv/gump/public/workspace/apr-util/dest-09042008/include/apr-1 -I/srv/gump/public/workspace/apache-httpd/modules/cache -I/srv/gump/public/workspace/apache-httpd/modules/proxy/../generators -I/srv/gump/public/wo
 rkspace/apache-httpd/modules/ssl -I/srv/gump/public/workspace/apache-httpd/modules/dav/main  -c /srv/gump/public/workspace/apache-httpd/server/buildmark.c
/srv/gump/public/workspace/apr/dest-09042008/build-1/libtool --silent --mode=link ccache gcc -g -O2 -pthread        -o httpd  modules.lo buildmark.o -export-dynamic server/libmain.la modules/aaa/libmod_authn_file.la modules/aaa/libmod_authn_default.la modules/aaa/libmod_authn_core.la modules/aaa/libmod_authz_host.la modules/aaa/libmod_authz_groupfile.la modules/aaa/libmod_authz_user.la modules/aaa/libmod_authz_core.la modules/aaa/libmod_authz_default.la modules/aaa/libmod_access_compat.la modules/aaa/libmod_auth_basic.la modules/aaa/libmod_auth_form.la modules/filters/libmod_include.la modules/filters/libmod_filter.la modules/loggers/libmod_log_config.la modules/metadata/libmod_env.la modules/metadata/libmod_setenvif.la modules/http/libmod_http.la modules/http/libmod_mime.la modules/generators/libmod_status.la modules/generators/libmod_autoindex.la modules/generators/libmod_asis.la modules/generators/libmod_cgi.la modules/mappers/libmod_negotiation.la modules/mappers/libmod_d
 ir.la modules/mappers/libmod_actions.la modules/mappers/libmod_userdir.la modules/mappers/libmod_alias.la modules/mappers/libmod_so.la server/mpm/prefork/libprefork.la os/unix/libos.la -lm /srv/gump/public/workspace/apache-httpd/srclib/pcre/libpcre.la                             /srv/gump/public/workspace/apr-util/dest-09042008/lib/libaprutil-1.la -lexpat /srv/gump/public/workspace/apr/dest-09042008/lib/libapr-1.la -lrt -lcrypt -lpthread -ldl 
modules/aaa/.libs/libmod_auth_form.a(mod_auth_form.o): In function `set_session_auth':
/srv/gump/public/workspace/apache-httpd/modules/aaa/mod_auth_form.c:501: undefined reference to `ap_session_set'
/srv/gump/public/workspace/apache-httpd/modules/aaa/mod_auth_form.c:502: undefined reference to `ap_session_set'
/srv/gump/public/workspace/apache-httpd/modules/aaa/mod_auth_form.c:503: undefined reference to `ap_session_set'
modules/aaa/.libs/libmod_auth_form.a(mod_auth_form.o): In function `get_session_auth':
/srv/gump/public/workspace/apache-httpd/modules/aaa/mod_auth_form.c:521: undefined reference to `ap_session_get'
/srv/gump/public/workspace/apache-httpd/modules/aaa/mod_auth_form.c:524: undefined reference to `ap_session_get'
/srv/gump/public/workspace/apache-httpd/modules/aaa/mod_auth_form.c:527: undefined reference to `ap_session_get'
collect2: ld returned 1 exit status
make[1]: *** [httpd] Error 1
make[1]: Leaving directory `/srv/gump/public/workspace/apache-httpd'
make: *** [all-recursive] Error 1
---------------------------------------------

To subscribe to this information via syndicated feeds:
- RSS: http://vmgump.apache.org/gump/public/apache-httpd/apache-httpd-make/rss.xml
- Atom: http://vmgump.apache.org/gump/public/apache-httpd/apache-httpd-make/atom.xml

============================== Gump Tracking Only ===
Produced by Gump version 2.3.
Gump Run 59000009042008, vmgump:vmgump-public:59000009042008
Gump E-mail Identifier (unique within run) #30.

*********************************************************** G U M P
[GUMP@vmgump]: Project jaxen (in module jaxen) failed
To whom it may engage...
        
This is an automated request, but not an unsolicited one. For 
more information please visit http://gump.apache.org/nagged.html, 
and/or contact the folk at general@gump.apache.org.

Project jaxen has an issue affecting its community integration.
This issue affects 6 projects.
The current state of this project is 'Failed', with reason 'Build Failed'.
For reference only, the following projects are affected by this:
    - dom4j-HEAD :  The flexible XML framework for Java
    - dom4j-HEAD-tests :  The flexible XML framework for Java
    - jaxen :  Universal Java XPath Engine
    - jaxen-test :  Universal Java XPath Engine
    - junit-addons :  Various JUnit addons and helper classes.
    - xom :  XOM is a new XML object model.


Full details are available at:
    http://vmgump.apache.org/gump/public/jaxen/jaxen/index.html

That said, some information snippets are provided here.

The following annotations (debug/informational/warning/error messages) were provided:
 -DEBUG- Sole output [jaxen-09042008.jar] identifier set to project name
 -DEBUG- Dependency on xml-xerces exists, no need to add for property maven.jar.xercesImpl.
 -DEBUG- Dependency on xml-apis exists, no need to add for property maven.jar.xmlParserAPIs.
 -DEBUG- Dependency on packaged-xom exists, no need to add for property maven.jar.xom.
 -DEBUG- (Gump generated) Maven Properties in: /srv/gump/public/workspace/jaxen/build.properties
 -INFO- Failed with reason build failed
 -DEBUG- Maven POM in: /srv/gump/public/workspace/jaxen/project.xml
 -DEBUG- Maven project properties in: /srv/gump/public/workspace/jaxen/project.properties
 -DEBUG- Extracted fallback artifacts from Gump Repository



The following work was performed:
http://vmgump.apache.org/gump/public/jaxen/jaxen/gump_work/build_jaxen_jaxen.html
Work Name: build_jaxen_jaxen (Type: Build)
Work ended in a state of : Failed
Elapsed: 4 secs
Command Line: maven --offline jar 
[Working Directory: /srv/gump/public/workspace/jaxen]
CLASSPATH: /usr/lib/jvm/java-1.5.0-sun/lib/tools.jar:/srv/gump/public/workspace/jaxen/target/classes:/srv/gump/public/workspace/jaxen/target/test-classes:/srv/gump/public/workspace/dom4j/build/dom4j.jar:/srv/gump/public/workspace/ant/dist/lib/ant-jmf.jar:/srv/gump/public/workspace/ant/dist/lib/ant-swing.jar:/srv/gump/public/workspace/ant/dist/lib/ant-apache-resolver.jar:/srv/gump/public/workspace/ant/dist/lib/ant-trax.jar:/srv/gump/public/workspace/ant/dist/lib/ant-junit.jar:/srv/gump/public/workspace/ant/dist/lib/ant-launcher.jar:/srv/gump/public/workspace/ant/dist/lib/ant-nodeps.jar:/srv/gump/public/workspace/ant/dist/lib/ant.jar:/srv/gump/public/workspace/jdom/build/jdom.jar:/srv/gump/public/workspace/junit/dist/junit-09042008.jar:/srv/gump/packages/maven-cobertura-plugin/maven-cobertura-plugin-1.1.jar:/srv/gump/packages/maven-findbugs-plugin/maven-findbugs-plugin-0.9.1.jar:/srv/gump/public/workspace/xml-commons/java/external/build/xml-apis-ext.jar:/srv/gump/packages/xom-1
 .1/xom-1.1b3.jar
---------------------------------------------
 __  __
|  \/  |__ _Apache__ ___
| |\/| / _` \ V / -_) ' \  ~ intelligent projects ~
|_|  |_\__,_|\_/\___|_||_|  v. 1.0.2

The build cannot continue because of the following unsatisfied dependency:

jsch-0.1.5.jar

Total time: 3 seconds
Finished at: Wed Apr 09 03:36:42 GMT-08:00 2008

---------------------------------------------

To subscribe to this information via syndicated feeds:
- RSS: http://vmgump.apache.org/gump/public/jaxen/jaxen/rss.xml
- Atom: http://vmgump.apache.org/gump/public/jaxen/jaxen/atom.xml

============================== Gump Tracking Only ===
Produced by Gump version 2.3.
Gump Run 59000009042008, vmgump:vmgump-public:59000009042008
Gump E-mail Identifier (unique within run) #32.

*********************************************************** G U M P
[GUMP@vmgump]: Project strutstestcase (in module strutstestcase) failed
To whom it may engage...
        
This is an automated request, but not an unsolicited one. For 
more information please visit http://gump.apache.org/nagged.html, 
and/or contact the folk at general@gump.apache.org.

Project strutstestcase has an issue affecting its community integration.
This issue affects 1 projects,
 and has been outstanding for 4 runs.
The current state of this project is 'Failed', with reason 'Configuration Failed'.
For reference only, the following projects are affected by this:
    - strutstestcase :  An extension of the standard JUnit TestCase class that provi...


Full details are available at:
    http://vmgump.apache.org/gump/public/strutstestcase/strutstestcase/index.html

That said, some information snippets are provided here.

The following annotations (debug/informational/warning/error messages) were provided:
 -DEBUG- Sole output [strutstestcase-09042008.jar] identifier set to project name
 -INFO- Failed with reason configuration failed
 -ERROR- Bad Dependency. Project: jakarta-cactus-framework-13 : unknown to *this* workspace 
 -INFO- Failed to extract fallback artifacts from Gump Repository

To subscribe to this information via syndicated feeds:
- RSS: http://vmgump.apache.org/gump/public/strutstestcase/strutstestcase/rss.xml
- Atom: http://vmgump.apache.org/gump/public/strutstestcase/strutstestcase/atom.xml

============================== Gump Tracking Only ===
Produced by Gump version 2.3.
Gump Run 59000009042008, vmgump:vmgump-public:59000009042008
Gump E-mail Identifier (unique within run) #33.

*********************************************************** G U M P
[GUMP@vmgump]: Module beanshell failed
To whom it may engage...
        
This is an automated request, but not an unsolicited one. For 
more information please visit http://gump.apache.org/nagged.html, 
and/or contact the folk at general@gump.apache.org.

Module beanshell has an issue affecting its community integration,
 and has been outstanding for 729 runs.
The current state of this module is 'Failed', with reason 'Update Failed'.

Full details are available at:
    http://vmgump.apache.org/gump/public/beanshell/index.html

That said, some information snippets are provided here.

The following annotations (debug/informational/warning/error messages) were provided:
 -INFO- Failed with reason update failed



The following work was performed:
http://vmgump.apache.org/gump/public/beanshell/gump_work/update_beanshell.html
Work Name: update_beanshell (Type: Update)
Work ended in a state of : Failed
Elapsed: 3 mins 10 secs
Command Line: svn --quiet checkout svn://svn.ikayzo.org/beanshell/BeanShell --non-interactive beanshell 
[Working Directory: /srv/gump/public/workspace/cvs]
---------------------------------------------
svn: Can't connect to host 'svn.ikayzo.org': Connection timed out
---------------------------------------------

To subscribe to this information via syndicated feeds:
- RSS: http://vmgump.apache.org/gump/public/beanshell/rss.xml
- Atom: http://vmgump.apache.org/gump/public/beanshell/atom.xml

============================== Gump Tracking Only ===
Produced by Gump version 2.3.
Gump Run 59000009042008, vmgump:vmgump-public:59000009042008
Gump E-mail Identifier (unique within run) #34.

*********************************************************** G U M P
[GUMP@vmgump]: Module JacORB failed
To whom it may engage...
        
This is an automated request, but not an unsolicited one. For 
more information please visit http://gump.apache.org/nagged.html, 
and/or contact the folk at general@gump.apache.org.

Module JacORB has an issue affecting its community integration,
 and has been outstanding for 222 runs.
The current state of this module is 'Failed', with reason 'Update Failed'.

Full details are available at:
    http://vmgump.apache.org/gump/public/JacORB/index.html

That said, some information snippets are provided here.

The following annotations (debug/informational/warning/error messages) were provided:
 -INFO- Failed with reason update failed



The following work was performed:
http://vmgump.apache.org/gump/public/JacORB/gump_work/update_JacORB.html
Work Name: update_JacORB (Type: Update)
Work ended in a state of : Failed
Elapsed: 2 secs
Command Line: cvs -q -z3 -d :pserver:anonymous@www.jacorb.org:/cvsroot/jacorb checkout -P -d JacORB JacORB 
[Working Directory: /srv/gump/public/workspace/cvs]
---------------------------------------------
cvs [checkout aborted]: unrecognized auth response from www.jacorb.org: cvs [pserver aborted]: /cvsroot/jacorb: no such repository
---------------------------------------------

To subscribe to this information via syndicated feeds:
- RSS: http://vmgump.apache.org/gump/public/JacORB/rss.xml
- Atom: http://vmgump.apache.org/gump/public/JacORB/atom.xml

============================== Gump Tracking Only ===
Produced by Gump version 2.3.
Gump Run 59000009042008, vmgump:vmgump-public:59000009042008
Gump E-mail Identifier (unique within run) #35.

*********************************************************** G U M P
[GUMP@vmgump]: Module jetty success, but with warnings.
To whom it may engage...
        
This is an automated request, but not an unsolicited one. For 
more information please visit http://gump.apache.org/nagged.html, 
and/or contact the folk at general@gump.apache.org.

Module jetty contains errors.
The current state of this module is 'Success'.

Full details are available at:
    http://vmgump.apache.org/gump/public/jetty/index.html

That said, some information snippets are provided here.

The following annotations (debug/informational/warning/error messages) were provided:
 -ERROR- *** Failed to update from source control. Stale contents ***



The following work was performed:
http://vmgump.apache.org/gump/public/jetty/gump_work/update_jetty.html
Work Name: update_jetty (Type: Update)
Work ended in a state of : Failed
Elapsed: 1 min 19 secs
Command Line: svn --quiet update --non-interactive jetty 
[Working Directory: /srv/gump/public/workspace/cvs]
---------------------------------------------
svn: Failed to add directory 'jetty/modules/contrib/cometd/demo/src/main/webapp/examples/chat': object of the same name already exists
---------------------------------------------

To subscribe to this information via syndicated feeds:
- RSS: http://vmgump.apache.org/gump/public/jetty/rss.xml
- Atom: http://vmgump.apache.org/gump/public/jetty/atom.xml

============================== Gump Tracking Only ===
Produced by Gump version 2.3.
Gump Run 59000009042008, vmgump:vmgump-public:59000009042008
Gump E-mail Identifier (unique within run) #36.

*********************************************************** G U M P
[GUMP@vmgump]: Project lenya (in module lenya) failed
To whom it may engage...
        
This is an automated request, but not an unsolicited one. For 
more information please visit http://gump.apache.org/nagged.html, 
and/or contact the folk at general@gump.apache.org.

Project lenya has an issue affecting its community integration.
This issue affects 1 projects,
 and has been outstanding for 1594 runs.
The current state of this project is 'Failed', with reason 'Configuration Failed'.
For reference only, the following projects are affected by this:
    - lenya :  Content Management System


Full details are available at:
    http://vmgump.apache.org/gump/public/lenya/lenya/index.html

That said, some information snippets are provided here.

The following annotations (debug/informational/warning/error messages) were provided:
 -INFO- Failed with reason configuration failed
 -ERROR- Bad Dependency. Project: cocoon-block-naming : unknown to *this* workspace 
 -ERROR- Bad Dependency. Project: cocoon-block-html : unknown to *this* workspace 
 -ERROR- Bad Dependency. Project: cocoon-block-lucene : unknown to *this* workspace 
 -ERROR- Bad Dependency. Project: cocoon-block-linkrewriter : unknown to *this* workspace 
 -ERROR- Bad Dependency. Project: cocoon-block-proxy : unknown to *this* workspace 
 -ERROR- Bad Dependency. Project: cocoon-block-forms : unknown to *this* workspace 
 -ERROR- Bad Dependency. Project: cocoon-block-xsp : unknown to *this* workspace 
 -ERROR- Bad Dependency. Project: cocoon-block-session-fw : unknown to *this* workspace 

To subscribe to this information via syndicated feeds:
- RSS: http://vmgump.apache.org/gump/public/lenya/lenya/rss.xml
- Atom: http://vmgump.apache.org/gump/public/lenya/lenya/atom.xml

============================== Gump Tracking Only ===
Produced by Gump version 2.3.
Gump Run 59000009042008, vmgump:vmgump-public:59000009042008
Gump E-mail Identifier (unique within run) #38.

*********************************************************** G U M P
[GUMP@vmgump]: Module smartfrog success, but with warnings.
To whom it may engage...
        
This is an automated request, but not an unsolicited one. For 
more information please visit http://gump.apache.org/nagged.html, 
and/or contact the folk at general@gump.apache.org.

Module smartfrog contains errors.
The current state of this module is 'Success'.

Full details are available at:
    http://vmgump.apache.org/gump/public/smartfrog/index.html

That said, some information snippets are provided here.

The following annotations (debug/informational/warning/error messages) were provided:
 -ERROR- *** Failed to update from source control. Stale contents ***



The following work was performed:
http://vmgump.apache.org/gump/public/smartfrog/gump_work/update_smartfrog.html
Work Name: update_smartfrog (Type: Update)
Work ended in a state of : Failed
Elapsed: 
Command Line: svn --quiet update --non-interactive smartfrog 
[Working Directory: /srv/gump/public/workspace/cvs]
---------------------------------------------
svn: Working copy 'smartfrog' locked
svn: run 'svn cleanup' to remove locks (type 'svn help cleanup' for details)
---------------------------------------------

To subscribe to this information via syndicated feeds:
- RSS: http://vmgump.apache.org/gump/public/smartfrog/rss.xml
- Atom: http://vmgump.apache.org/gump/public/smartfrog/atom.xml

============================== Gump Tracking Only ===
Produced by Gump version 2.3.
Gump Run 59000009042008, vmgump:vmgump-public:59000009042008
Gump E-mail Identifier (unique within run) #40.


--
Apache Gump
http://gump.apache.org/ [Instance: vmgump]

---------------------------------------------------------------------
To unsubscribe, e-mail: general-unsubscribe@gump.apache.org
For additional commands, e-mail: general-help@gump.apache.org


Mime
View raw message