gump-general mailing list archives

Site index · List index
Message view « Date » · « Thread »
Top « Date » · « Thread »
From g...@vmgump.apache.org
Subject BATCH: All dressed up, with nowhere to go...
Date Thu, 24 Jan 2008 21:01:06 GMT
Dear Gumpmeisters,
            
The following 9 notifys should have been sent

*********************************************************** G U M P
[GUMP@vmgump]: Project derby (in module db-derby) failed
[GUMP@vmgump]: Project ws-commons-xmlschema (in module ws-axis2-commons) failed
[GUMP@vmgump]: Project commons-jci (in module commons-sandbox) failed
[GUMP@vmgump]: Project stub-compiler (in module asn1) failed
[GUMP@vmgump]: Project portals-pluto-portal-1.0 (in module portals-pluto-1.0) failed
[GUMP@vmgump]: Project groovy (in module groovy) failed
[GUMP@vmgump]: Project jetty (in module jetty) failed
[GUMP@vmgump]: Project maven (in module maven) failed
[GUMP@vmgump]: Project maven-bootstrap (in module maven) failed
*********************************************************** G U M P
[GUMP@vmgump]: Project derby (in module db-derby) failed
To whom it may engage...
        
This is an automated request, but not an unsolicited one. For 
more information please visit http://gump.apache.org/nagged.html, 
and/or contact the folk at general@gump.apache.org.

Project derby has an issue affecting its community integration.
This issue affects 1 projects.
The current state of this project is 'Failed', with reason 'Build Failed'.
For reference only, the following projects are affected by this:
    - derby :  Apache Derby, 100% Java relational database.


Full details are available at:
    http://vmgump.apache.org/gump/public/db-derby/derby/index.html

That said, some information snippets are provided here.

The following annotations (debug/informational/warning/error messages) were provided:
 -INFO- Failed with reason build failed
 -INFO- Failed to extract fallback artifacts from Gump Repository



The following work was performed:
http://vmgump.apache.org/gump/public/db-derby/derby/gump_work/build_db-derby_derby.html
Work Name: build_db-derby_derby (Type: Build)
Work ended in a state of : Failed
Elapsed: 4 secs
Command Line: /usr/lib/jvm/java-1.5.0-sun/bin/java -Djava.awt.headless=true -Xbootclasspath/p:/srv/gump/public/workspace/xml-commons/java/external/build/xml-apis.jar:/srv/gump/public/workspace/xml-xerces2/build/xercesImpl.jar:/srv/gump/public/workspace/xml-xalan/build/serializer.jar:/srv/gump/public/workspace/xml-xalan/build/xalan-unbundled.jar org.apache.tools.ant.Main -Dgump.merge=/srv/gump/public/gump/work/merge.xml -Dbuild.sysclasspath=only -Dsane=false gump_all 
[Working Directory: /srv/gump/public/workspace/db-derby]
CLASSPATH: /usr/lib/jvm/java-1.5.0-sun/lib/tools.jar:/srv/gump/public/workspace/db-derby/classes:/srv/gump/public/workspace/ant/dist/lib/ant-jmf.jar:/srv/gump/public/workspace/ant/dist/lib/ant-swing.jar:/srv/gump/public/workspace/ant/dist/lib/ant-apache-resolver.jar:/srv/gump/public/workspace/ant/dist/lib/ant-trax.jar:/srv/gump/public/workspace/ant/dist/lib/ant-junit.jar:/srv/gump/public/workspace/ant/dist/lib/ant-launcher.jar:/srv/gump/public/workspace/ant/dist/lib/ant-nodeps.jar:/srv/gump/public/workspace/ant/dist/lib/ant.jar:/srv/gump/public/workspace/xml-commons/java/external/build/xml-apis-ext.jar:/srv/gump/public/workspace/jakarta-servletapi-5/jsr154/dist/lib/servlet-api.jar:/srv/gump/public/workspace/jakarta-oro/jakarta-oro-24012008.jar:/srv/gump/packages/javacc-3.1/bin/lib/javacc.jar:/srv/gump/public/workspace/junit/dist/junit-24012008.jar
---------------------------------------------
[setJdkProperties] j14lib = null
[setJdkProperties] j15lib = null
[setJdkProperties] 
[setJdkProperties] Please consult BUILDING.txt for instructions on how to set the jdk-library and compiler-classpath properties.
[setJdkProperties] Don't know how to set java14compile.classpath using this environment:
[setJdkProperties] 
[setJdkProperties] java.vendor = Sun Microsystems Inc.
[setJdkProperties] java.home = /usr/lib/jvm/java-1.5.0-sun-1.5.0.11/jre
[setJdkProperties] java.version = 1.5.0_11
[setJdkProperties] os.name = Linux
[setJdkProperties] j14lib = null
[setJdkProperties] j15lib = null
[setJdkProperties] 
[setJdkProperties] Please consult BUILDING.txt for instructions on how to set the jdk-library and compiler-classpath properties.
[setJdkProperties] 	at org.apache.derbyPreBuild.PropertySetter.couldntSetProperty(PropertySetter.java:675)
[setJdkProperties] 	at org.apache.derbyPreBuild.PropertySetter.setClasspathFromLib(PropertySetter.java:482)
[setJdkProperties] 	at org.apache.derbyPreBuild.PropertySetter.defaultSetter(PropertySetter.java:459)
[setJdkProperties] 	at org.apache.derbyPreBuild.PropertySetter.setForMostJDKs(PropertySetter.java:319)
[setJdkProperties] 	at org.apache.derbyPreBuild.PropertySetter.setForSunJDKs(PropertySetter.java:291)
[setJdkProperties] 	at org.apache.derbyPreBuild.PropertySetter.execute(PropertySetter.java:221)
[setJdkProperties] 	at org.apache.tools.ant.UnknownElement.execute(UnknownElement.java:288)
[setJdkProperties] 	at sun.reflect.GeneratedMethodAccessor9.invoke(Unknown Source)
[setJdkProperties] 	at sun.reflect.DelegatingMethodAccessorImpl.invoke(DelegatingMethodAccessorImpl.java:25)
[setJdkProperties] 	at java.lang.reflect.Method.invoke(Method.java:585)
[setJdkProperties] 	at org.apache.tools.ant.dispatch.DispatchUtils.execute(DispatchUtils.java:106)
[setJdkProperties] 	at org.apache.tools.ant.Task.perform(Task.java:348)
[setJdkProperties] 	at org.apache.tools.ant.Target.execute(Target.java:354)
[setJdkProperties] 	at org.apache.tools.ant.Target.performTasks(Target.java:379)
[setJdkProperties] 	at org.apache.tools.ant.Project.executeSortedTargets(Project.java:1324)
[setJdkProperties] 	at org.apache.tools.ant.Project.executeTarget(Project.java:1293)
[setJdkProperties] 	at org.apache.tools.ant.helper.DefaultExecutor.executeTargets(DefaultExecutor.java:41)
[setJdkProperties] 	at org.apache.tools.ant.Project.executeTargets(Project.java:1176)
[setJdkProperties] 	at org.apache.tools.ant.Main.runBuild(Main.java:758)
[setJdkProperties] 	at org.apache.tools.ant.Main.startAnt(Main.java:217)
[setJdkProperties] 	at org.apache.tools.ant.Main.start(Main.java:179)
[setJdkProperties] 	at org.apache.tools.ant.Main.main(Main.java:268)

BUILD FAILED
/srv/gump/public/workspace/db-derby/build.xml:182: Don't know how to set java14compile.classpath using this environment:

java.vendor = Sun Microsystems Inc.
java.home = /usr/lib/jvm/java-1.5.0-sun-1.5.0.11/jre
java.version = 1.5.0_11
os.name = Linux
j14lib = null
j15lib = null

Please consult BUILDING.txt for instructions on how to set the jdk-library and compiler-classpath properties.

Total time: 3 seconds
---------------------------------------------

To subscribe to this information via syndicated feeds:
- RSS: http://vmgump.apache.org/gump/public/db-derby/derby/rss.xml
- Atom: http://vmgump.apache.org/gump/public/db-derby/derby/atom.xml

============================== Gump Tracking Only ===
Produced by Gump version 2.3.
Gump Run 37001624012008, vmgump:vmgump-public:37001624012008
Gump E-mail Identifier (unique within run) #1.

*********************************************************** G U M P
[GUMP@vmgump]: Project ws-commons-xmlschema (in module ws-axis2-commons) failed
To whom it may engage...
        
This is an automated request, but not an unsolicited one. For 
more information please visit http://gump.apache.org/nagged.html, 
and/or contact the folk at general@gump.apache.org.

Project ws-commons-xmlschema has an issue affecting its community integration.
This issue affects 4 projects.
The current state of this project is 'Failed', with reason 'Build Failed'.
For reference only, the following projects are affected by this:
    - ws-axis2 :  Apache Axis2 SOAP Stack
    - ws-commons-xmlschema :  Common stuff for the WS projects.
    - ws-juddi :  ws-juddi -- UDDI Toolkit/Repository
    - ws-juddi-test :  ws-juddi -- UDDI Toolkit/Repository


Full details are available at:
    http://vmgump.apache.org/gump/public/ws-axis2-commons/ws-commons-xmlschema/index.html

That said, some information snippets are provided here.

The following annotations (debug/informational/warning/error messages) were provided:
 -DEBUG- Sole output [ws-commons-xmlschema-24012008.jar] identifier set to project name
 -INFO- Failed with reason build failed
 -INFO- Failed to extract fallback artifacts from Gump Repository



The following work was performed:
http://vmgump.apache.org/gump/public/ws-axis2-commons/ws-commons-xmlschema/gump_work/build_ws-axis2-commons_ws-commons-xmlschema.html
Work Name: build_ws-axis2-commons_ws-commons-xmlschema (Type: Build)
Work ended in a state of : Failed
Elapsed: 1 min 5 secs
Command Line: /usr/lib/jvm/java-1.5.0-sun/bin/java -Djava.awt.headless=true -Xbootclasspath/p:/srv/gump/public/workspace/xml-commons/java/external/build/xml-apis.jar:/srv/gump/public/workspace/xml-xerces2/build/xercesImpl.jar:/srv/gump/public/workspace/xml-xalan/build/serializer.jar:/srv/gump/public/workspace/xml-xalan/build/xalan-unbundled.jar org.apache.tools.ant.Main -Dgump.merge=/srv/gump/public/gump/work/merge.xml -Dbuild.sysclasspath=only -Doutput.jar=ws-commons-xmlschema-24012008 -DdownloadLibs=false jar 
[Working Directory: /srv/gump/public/workspace/ws-axis2-commons/XmlSchema]
CLASSPATH: /usr/lib/jvm/java-1.5.0-sun/lib/tools.jar:/srv/gump/public/workspace/ws-axis2-commons/XmlSchema/build/classes:/srv/gump/public/workspace/ws-axis2-commons/XmlSchema/build/test-classes:/srv/gump/public/workspace/xml-commons/java/external/build/xml-apis-ext.jar:/srv/gump/public/workspace/xmlunit/build/lib/xmlunit-24012008.jar:/srv/gump/public/workspace/ant/dist/lib/ant-jmf.jar:/srv/gump/public/workspace/ant/dist/lib/ant-swing.jar:/srv/gump/public/workspace/ant/dist/lib/ant-apache-resolver.jar:/srv/gump/public/workspace/ant/dist/lib/ant-trax.jar:/srv/gump/public/workspace/ant/dist/lib/ant-junit.jar:/srv/gump/public/workspace/ant/dist/lib/ant-launcher.jar:/srv/gump/public/workspace/ant/dist/lib/ant-nodeps.jar:/srv/gump/public/workspace/ant/dist/lib/ant.jar:/srv/gump/packages/junit3.8.1/junit.jar:/srv/gump/public/workspace/xml-commons/java/build/resolver.jar:/srv/gump/packages/stax/jsr173_1.0_api.jar:/srv/gump/packages/stax/jsr173_1.0_ri.jar:/srv/gump/public/workspace/ju
 nit/dist/junit-24012008.jar
---------------------------------------------
    [junit] Tests run: 1, Failures: 0, Errors: 0, Time elapsed: 0.256 sec
    [junit] Running tests.ConstraintsTest
    [junit] Tests run: 1, Failures: 0, Errors: 0, Time elapsed: 0.23 sec
    [junit] Running tests.ElementRefs2Test
    [junit] Tests run: 1, Failures: 0, Errors: 0, Time elapsed: 0.263 sec
    [junit] Running tests.ElementRefsTest
    [junit] Tests run: 1, Failures: 0, Errors: 0, Time elapsed: 0.079 sec
    [junit] Running tests.EncodingTest
    [junit] Tests run: 1, Failures: 0, Errors: 0, Time elapsed: 0.267 sec
    [junit] Running tests.ExternalAttTest
    [junit] Tests run: 1, Failures: 0, Errors: 0, Time elapsed: 0.28 sec
    [junit] Running tests.FacetsTest
    [junit] Tests run: 9, Failures: 0, Errors: 0, Time elapsed: 0.378 sec
    [junit] Running tests.GroupTest
    [junit] Tests run: 1, Failures: 0, Errors: 0, Time elapsed: 0.175 sec
    [junit] Running tests.ImportTest
    [junit] Tests run: 3, Failures: 0, Errors: 0, Time elapsed: 0.378 sec
    [junit] Running tests.IncludeTest
    [junit] Tests run: 4, Failures: 0, Errors: 0, Time elapsed: 1.031 sec
    [junit] Running tests.ListTest
    [junit] Tests run: 1, Failures: 0, Errors: 0, Time elapsed: 0.208 sec
    [junit] Running tests.MixedContentTest
    [junit] Tests run: 1, Failures: 0, Errors: 0, Time elapsed: 0.135 sec
    [junit] Running tests.MultipleExternalAttTest
    [junit] Tests run: 1, Failures: 0, Errors: 0, Time elapsed: 0.144 sec
    [junit] Running tests.NamespaceContextTest
    [junit] Tests run: 1, Failures: 0, Errors: 0, Time elapsed: 0.486 sec
    [junit] Running tests.NotationTest
    [junit] Tests run: 1, Failures: 0, Errors: 0, Time elapsed: 0.11 sec
    [junit] Running tests.RedefineTest
    [junit] Tests run: 4, Failures: 0, Errors: 0, Time elapsed: 0.479 sec
    [junit] Running tests.SequenceTest
    [junit] Tests run: 1, Failures: 0, Errors: 0, Time elapsed: 0.056 sec
    [junit] Running tests.SimpleContentExtensionTest
    [junit] Tests run: 1, Failures: 0, Errors: 0, Time elapsed: 0.12 sec
    [junit] Running tests.SimpleContentRestrictionTest
    [junit] Tests run: 1, Failures: 0, Errors: 0, Time elapsed: 0.15 sec
    [junit] Running tests.TestElementForm
    [junit] Tests run: 1, Failures: 0, Errors: 0, Time elapsed: 0.066 sec
    [junit] Running tests.TestForwardRefs
    [junit] Tests run: 1, Failures: 0, Errors: 0, Time elapsed: 0.212 sec
    [junit] Running tests.TestLocalUnnamedSimpleType
    [junit] Tests run: 1, Failures: 0, Errors: 0, Time elapsed: 0.059 sec
    [junit] Running tests.TestSimpleRestriction
    [junit] Tests run: 2, Failures: 1, Errors: 0, Time elapsed: 0.159 sec

BUILD FAILED
/srv/gump/public/workspace/ws-axis2-commons/XmlSchema/build.xml:106: Test tests.TestSimpleRestriction failed

Total time: 1 minute 4 seconds
---------------------------------------------

To subscribe to this information via syndicated feeds:
- RSS: http://vmgump.apache.org/gump/public/ws-axis2-commons/ws-commons-xmlschema/rss.xml
- Atom: http://vmgump.apache.org/gump/public/ws-axis2-commons/ws-commons-xmlschema/atom.xml

============================== Gump Tracking Only ===
Produced by Gump version 2.3.
Gump Run 37001624012008, vmgump:vmgump-public:37001624012008
Gump E-mail Identifier (unique within run) #3.

*********************************************************** G U M P
[GUMP@vmgump]: Project commons-jci (in module commons-sandbox) failed
To whom it may engage...
        
This is an automated request, but not an unsolicited one. For 
more information please visit http://gump.apache.org/nagged.html, 
and/or contact the folk at general@gump.apache.org.

Project commons-jci has an issue affecting its community integration.
This issue affects 2 projects.
The current state of this project is 'Failed', with reason 'Build Failed'.
For reference only, the following projects are affected by this:
    - commons-javaflow :  Commons Javaflow
    - commons-jci :  Commons JCI


Full details are available at:
    http://vmgump.apache.org/gump/public/commons-sandbox/commons-jci/index.html

That said, some information snippets are provided here.

The following annotations (debug/informational/warning/error messages) were provided:
 -DEBUG- Sole output [commons-jci-24012008.jar] identifier set to project name
 -DEBUG- Dependency on packaged-groovy exists, no need to add for property maven.jar.groovy.
 -INFO- Making directory for Maven properties: [/srv/gump/public/workspace/commons-sandbox/jci]
 -DEBUG- (Gump generated) Maven Properties in: /srv/gump/public/workspace/commons-sandbox/jci/build.properties
 -INFO- Failed with reason build failed
 -INFO- Failed to extract fallback artifacts from Gump Repository



The following work was performed:
http://vmgump.apache.org/gump/public/commons-sandbox/commons-jci/gump_work/build_commons-sandbox_commons-jci.html
Work Name: build_commons-sandbox_commons-jci (Type: Build)
Work ended in a state of : Failed
Elapsed: 4 secs
Command Line: maven --offline jar 
[Working Directory: /srv/gump/public/workspace/commons-sandbox/jci]
CLASSPATH: /usr/lib/jvm/java-1.5.0-sun/lib/tools.jar:/srv/gump/public/workspace/jakarta-bcel/target/bcel-5.3-SNAPSHOT.jar:/srv/gump/public/workspace/apache-commons/collections/build/commons-collections-24012008.jar:/srv/gump/public/workspace/apache-commons/io/target/commons-io-24012008.jar:/srv/gump/public/workspace/apache-commons/lang/commons-lang-24012008.jar:/srv/gump/public/workspace/apache-commons/logging/target/commons-logging-24012008.jar:/srv/gump/public/workspace/apache-commons/logging/target/commons-logging-api-24012008.jar:/srv/gump/packages/eclipse-3.1M6/plugins/org.eclipse.jdt.core_3.1.0/jdtcore.jar:/srv/gump/packages/janino-2.3.8/lib/janino.jar:/srv/gump/packages/jarjar/jarjar-0.6.jar:/srv/gump/public/workspace/asm/output/dist/lib/asm-analysis-24012008.jar:/srv/gump/public/workspace/asm/output/dist/lib/asm-util-24012008.jar:/srv/gump/public/workspace/asm/output/dist/lib/asm-xml-24012008.jar:/srv/gump/public/workspace/asm/output/dist/lib/asm-commons-24012008.jar:
 /srv/gump/public/workspace/asm/output/dist/lib/asm-24012008.jar:/srv/gump/public/workspace/asm/output/dist/lib/asm-tree-24012008.jar:/srv/gump/packages/antlr-2.7.6/antlr.jar:/srv/gump/packages/groovy-1.0-jsr-03/groovy-1.0-jsr-03.jar:/srv/gump/packages/maven-cobertura-plugin/maven-cobertura-plugin-1.1.jar
---------------------------------------------
 __  __
|  \/  |__ _Apache__ ___
| |\/| / _` \ V / -_) ' \  ~ intelligent projects ~
|_|  |_\__,_|\_/\___|_||_|  v. 1.0.2

build:start:

java:prepare-filesystem:
    [mkdir] Created dir: /srv/gump/public/workspace/commons-sandbox/jci/target/classes

java:compile:
    [echo] Compiling to /srv/gump/public/workspace/commons-sandbox/jci/target/classes
    [echo] No java source files to compile.
resources or todir was null

java:jar-resources:

test:prepare-filesystem:
    [mkdir] Created dir: /srv/gump/public/workspace/commons-sandbox/jci/target/test-classes
    [mkdir] Created dir: /srv/gump/public/workspace/commons-sandbox/jci/target/test-reports

test:test-resources:

test:compile:
    [echo] No test source files to compile.

test:test:
    [echo] No tests to run.

BUILD FAILED
File...... /home/gump/.maven/cache/maven-jar-plugin-1.6.1/plugin.jelly
Element... ant:fail
Line...... 53
Column.... 19
You must define currentVersion in your POM.
Total time: 3 seconds
Finished at: Thu Jan 24 18:18:01 GMT-08:00 2008

---------------------------------------------

To subscribe to this information via syndicated feeds:
- RSS: http://vmgump.apache.org/gump/public/commons-sandbox/commons-jci/rss.xml
- Atom: http://vmgump.apache.org/gump/public/commons-sandbox/commons-jci/atom.xml

============================== Gump Tracking Only ===
Produced by Gump version 2.3.
Gump Run 37001624012008, vmgump:vmgump-public:37001624012008
Gump E-mail Identifier (unique within run) #6.

*********************************************************** G U M P
[GUMP@vmgump]: Project stub-compiler (in module asn1) failed
To whom it may engage...
        
This is an automated request, but not an unsolicited one. For 
more information please visit http://gump.apache.org/nagged.html, 
and/or contact the folk at general@gump.apache.org.

Project stub-compiler has an issue affecting its community integration.
This issue affects 1 projects.
The current state of this project is 'Failed', with reason 'Build Failed'.
For reference only, the following projects are affected by this:
    - stub-compiler :  Apache ASN.1 Tools


Full details are available at:
    http://vmgump.apache.org/gump/public/asn1/stub-compiler/index.html

That said, some information snippets are provided here.

The following annotations (debug/informational/warning/error messages) were provided:
 -DEBUG- Sole output [stub-compiler-24012008.jar] identifier set to project name
 -DEBUG- Dependency on velocity-engine exists, no need to add for property maven.jar.velocity-dep.
 -DEBUG- Dependency on excalibur-logkit exists, no need to add for property maven.jar.avalon-logkit.
 -INFO- Making directory for Maven properties: [/srv/gump/public/workspace/asn1/stub-compiler]
 -DEBUG- (Gump generated) Maven Properties in: /srv/gump/public/workspace/asn1/stub-compiler/build.properties
 -INFO- Failed with reason build failed
 -INFO- Project Reports in: /srv/gump/public/workspace/asn1/stub-compiler/target/test-reports
 -INFO- Failed to extract fallback artifacts from Gump Repository



The following work was performed:
http://vmgump.apache.org/gump/public/asn1/stub-compiler/gump_work/build_asn1_stub-compiler.html
Work Name: build_asn1_stub-compiler (Type: Build)
Work ended in a state of : Failed
Elapsed: 4 secs
Command Line: maven --offline jar 
[Working Directory: /srv/gump/public/workspace/asn1/stub-compiler]
CLASSPATH: /usr/lib/jvm/java-1.5.0-sun/lib/tools.jar:/srv/gump/packages/antlr-2.7.6/antlr.jar:/srv/gump/public/workspace/excalibur/containerkit/logkit/target/excalibur-logkit-24012008.jar:/srv/gump/public/workspace/apache-commons/collections/build/commons-collections-24012008.jar:/srv/gump/public/workspace/apache-commons/lang/commons-lang-24012008.jar:/srv/gump/public/workspace/apache-commons/logging/target/commons-logging-24012008.jar:/srv/gump/public/workspace/apache-commons/logging/target/commons-logging-api-24012008.jar:/srv/gump/public/workspace/velocity-engine/bin/velocity-dep-24012008.jar:/srv/gump/public/workspace/junit/dist/junit-24012008.jar:/srv/gump/public/workspace/slf4j/slf4j-simple/target/slf4j-simple-1.4.4-SNAPSHOT.jar:/srv/gump/public/workspace/slf4j/slf4j-api/target/slf4j-api-1.4.4-SNAPSHOT.jar
---------------------------------------------
 __  __
|  \/  |__ _Apache__ ___
| |\/| / _` \ V / -_) ' \  ~ intelligent projects ~
|_|  |_\__,_|\_/\___|_||_|  v. 1.0.2

build:start:

java:prepare-filesystem:
    [mkdir] Created dir: /srv/gump/public/workspace/asn1/stub-compiler/target/classes

java:compile:
    [echo] Compiling to /srv/gump/public/workspace/asn1/stub-compiler/target/classes
    [echo] No java source files to compile.
resources or todir was null

java:jar-resources:

test:prepare-filesystem:
    [mkdir] Created dir: /srv/gump/public/workspace/asn1/stub-compiler/target/test-classes
    [mkdir] Created dir: /srv/gump/public/workspace/asn1/stub-compiler/target/test-reports

test:test-resources:

test:compile:
    [echo] No test source files to compile.

test:test:
    [echo] No tests to run.

BUILD FAILED
File...... /home/gump/.maven/cache/maven-jar-plugin-1.6.1/plugin.jelly
Element... ant:fail
Line...... 53
Column.... 19
You must define currentVersion in your POM.
Total time: 3 seconds
Finished at: Thu Jan 24 18:30:16 GMT-08:00 2008

---------------------------------------------

To subscribe to this information via syndicated feeds:
- RSS: http://vmgump.apache.org/gump/public/asn1/stub-compiler/rss.xml
- Atom: http://vmgump.apache.org/gump/public/asn1/stub-compiler/atom.xml

============================== Gump Tracking Only ===
Produced by Gump version 2.3.
Gump Run 37001624012008, vmgump:vmgump-public:37001624012008
Gump E-mail Identifier (unique within run) #7.

*********************************************************** G U M P
[GUMP@vmgump]: Project portals-pluto-portal-1.0 (in module portals-pluto-1.0) failed
To whom it may engage...
        
This is an automated request, but not an unsolicited one. For 
more information please visit http://gump.apache.org/nagged.html, 
and/or contact the folk at general@gump.apache.org.

Project portals-pluto-portal-1.0 has an issue affecting its community integration.
This issue affects 1 projects.
The current state of this project is 'Failed', with reason 'Build Failed'.
For reference only, the following projects are affected by this:
    - portals-pluto-portal-1.0 :  JSR168 Container


Full details are available at:
    http://vmgump.apache.org/gump/public/portals-pluto-1.0/portals-pluto-portal-1.0/index.html

That said, some information snippets are provided here.

The following annotations (debug/informational/warning/error messages) were provided:
 -DEBUG- Dependency on ant exists, no need to add for property env.ANT_HOME.
 -INFO- Failed with reason build failed
 -INFO- Failed to extract fallback artifacts from Gump Repository



The following work was performed:
http://vmgump.apache.org/gump/public/portals-pluto-1.0/portals-pluto-portal-1.0/gump_work/build_portals-pluto-1.0_portals-pluto-portal-1.0.html
Work Name: build_portals-pluto-1.0_portals-pluto-portal-1.0 (Type: Build)
Work ended in a state of : Failed
Elapsed: 9 secs
Command Line: /usr/lib/jvm/java-1.5.0-sun/bin/java -Djava.awt.headless=true -Xbootclasspath/p:/srv/gump/public/workspace/xml-commons/java/external/build/xml-apis.jar:/srv/gump/public/workspace/xml-xerces2/build/xercesImpl.jar org.apache.tools.ant.Main -Dgump.merge=/srv/gump/public/gump/work/merge.xml -Dbuild.sysclasspath=only -Denv.ANT_HOME=/srv/gump/public/workspace/ant/dist -Dversion=24012008 -Dfinal.portal.name=pluto-portal-impl-24012008 all 
[Working Directory: /srv/gump/public/workspace/portals-pluto-1.0]
CLASSPATH: /usr/lib/jvm/java-1.5.0-sun/lib/tools.jar:/srv/gump/public/workspace/portals-pluto-1.0/build/ant/lib/ForeachTask.jar:/srv/gump/public/workspace/ant/dist/lib/ant-jmf.jar:/srv/gump/public/workspace/ant/dist/lib/ant-swing.jar:/srv/gump/public/workspace/ant/dist/lib/ant-apache-resolver.jar:/srv/gump/public/workspace/ant/dist/lib/ant-trax.jar:/srv/gump/public/workspace/ant/dist/lib/ant-junit.jar:/srv/gump/public/workspace/ant/dist/lib/ant-launcher.jar:/srv/gump/public/workspace/ant/dist/lib/ant-nodeps.jar:/srv/gump/public/workspace/ant/dist/lib/ant.jar:/srv/gump/packages/junit3.8.1/junit.jar:/srv/gump/public/workspace/xml-commons/java/build/resolver.jar:/srv/gump/public/workspace/castor/dist/castor-24012008.jar:/srv/gump/public/workspace/castor/dist/castor-24012008-xml.jar:/srv/gump/public/workspace/apache-commons/fileupload/target/commons-fileupload-24012008.jar:/srv/gump/public/workspace/apache-commons/logging/target/commons-logging-24012008.jar:/srv/gump/public/works
 pace/apache-commons/logging/target/commons-logging-api-24012008.jar:/srv/gump/public/workspace/junit/dist/junit-24012008.jar:/srv/gump/public/workspace/jakarta-regexp/build/jakarta-regexp-24012008.jar:/srv/gump/public/workspace/jakarta-servletapi-5/jsr154/dist/lib/servlet-api.jar:/srv/gump/public/workspace/jakarta-servletapi-5/jsr152/dist/lib/jsp-api.jar:/srv/gump/public/workspace/portals-pluto-1.0/api/target/portlet-api-1.0.jar:/srv/gump/public/workspace/portals-pluto-1.0/container/target/pluto-1.0.jar:/srv/gump/public/workspace/portals-pluto-1.0/descriptors/target/pluto-descriptors-1.0.jar:/srv/gump/public/workspace/xml-commons/java/external/build/xml-apis-ext.jar
---------------------------------------------
    [javac]                                            ^
    [javac] /srv/gump/public/workspace/portals-pluto-1.0/portal/src/java/org/apache/pluto/portalImpl/core/PortalURL.java:179: warning: [deprecation] encode(java.lang.String) in java.net.URLEncoder has been deprecated
    [javac]         value = URLEncoder.encode(value);
    [javac]                           ^
    [javac] /srv/gump/public/workspace/portals-pluto-1.0/portal/src/java/org/apache/pluto/portalImpl/services/portletdefinitionregistry/PortletDefinitionRegistryServiceContextImpl.java:113: exception java.io.IOException is never thrown in body of corresponding try statement
    [javac]         } catch (IOException e) {
    [javac]           ^
    [javac] /srv/gump/public/workspace/portals-pluto-1.0/portal/src/java/org/apache/pluto/portalImpl/services/portletdefinitionregistry/PortletDefinitionRegistryServiceContextImpl.java:115: exception org.exolab.castor.mapping.MappingException is never thrown in body of corresponding try statement
    [javac]         } catch (MappingException e) {
    [javac]           ^
    [javac] /srv/gump/public/workspace/portals-pluto-1.0/portal/src/java/org/apache/pluto/portalImpl/servlet/ServletRequestImpl.java:32: warning: [deprecation] getRealPath(java.lang.String) in javax.servlet.ServletRequest has been deprecated
    [javac] public class ServletRequestImpl extends javax.servlet.http.HttpServletRequestWrapper 
    [javac]        ^
    [javac] /srv/gump/public/workspace/portals-pluto-1.0/portal/src/java/org/apache/pluto/portalImpl/servlet/ServletRequestImpl.java:32: warning: [deprecation] isRequestedSessionIdFromUrl() in javax.servlet.http.HttpServletRequest has been deprecated
    [javac] public class ServletRequestImpl extends javax.servlet.http.HttpServletRequestWrapper 
    [javac]        ^
    [javac] /srv/gump/public/workspace/portals-pluto-1.0/portal/src/java/org/apache/pluto/portalImpl/servlet/ServletRequestImpl.java:32: warning: [deprecation] getRealPath(java.lang.String) in javax.servlet.ServletRequest has been deprecated
    [javac] public class ServletRequestImpl extends javax.servlet.http.HttpServletRequestWrapper 
    [javac]        ^
    [javac] /srv/gump/public/workspace/portals-pluto-1.0/portal/src/java/org/apache/pluto/portalImpl/servlet/ServletResponseImpl.java:24: warning: [deprecation] setStatus(int,java.lang.String) in javax.servlet.http.HttpServletResponse has been deprecated
    [javac] public class ServletResponseImpl extends javax.servlet.http.HttpServletResponseWrapper 
    [javac]        ^
    [javac] /srv/gump/public/workspace/portals-pluto-1.0/portal/src/java/org/apache/pluto/portalImpl/servlet/ServletResponseImpl.java:24: warning: [deprecation] encodeRedirectUrl(java.lang.String) in javax.servlet.http.HttpServletResponse has been deprecated
    [javac] public class ServletResponseImpl extends javax.servlet.http.HttpServletResponseWrapper 
    [javac]        ^
    [javac] /srv/gump/public/workspace/portals-pluto-1.0/portal/src/java/org/apache/pluto/portalImpl/servlet/ServletResponseImpl.java:24: warning: [deprecation] encodeUrl(java.lang.String) in javax.servlet.http.HttpServletResponse has been deprecated
    [javac] public class ServletResponseImpl extends javax.servlet.http.HttpServletResponseWrapper 
    [javac]        ^
    [javac] /srv/gump/public/workspace/portals-pluto-1.0/portal/src/java/org/apache/pluto/portalImpl/servlet/StoredServletResponseImpl.java:27: warning: [deprecation] setStatus(int,java.lang.String) in javax.servlet.http.HttpServletResponse has been deprecated
    [javac] public class StoredServletResponseImpl extends ServletResponseImpl 
    [javac]        ^
    [javac] /srv/gump/public/workspace/portals-pluto-1.0/portal/src/java/org/apache/pluto/portalImpl/servlet/StoredServletResponseImpl.java:27: warning: [deprecation] encodeRedirectUrl(java.lang.String) in javax.servlet.http.HttpServletResponse has been deprecated
    [javac] public class StoredServletResponseImpl extends ServletResponseImpl 
    [javac]        ^
    [javac] /srv/gump/public/workspace/portals-pluto-1.0/portal/src/java/org/apache/pluto/portalImpl/servlet/StoredServletResponseImpl.java:27: warning: [deprecation] encodeUrl(java.lang.String) in javax.servlet.http.HttpServletResponse has been deprecated
    [javac] public class StoredServletResponseImpl extends ServletResponseImpl 
    [javac]        ^
    [javac] /srv/gump/public/workspace/portals-pluto-1.0/portal/src/java/org/apache/pluto/portlet/admin/services/DeployWarService.java:165: warning: [deprecation] org.apache.pluto.portalImpl.Deploy in org.apache.pluto.portalImpl has been deprecated
    [javac] 		            org.apache.pluto.portalImpl.Deploy.main(args);
    [javac]                                                        ^
    [javac] Note: Some input files use unchecked or unsafe operations.
    [javac] Note: Recompile with -Xlint:unchecked for details.
    [javac] 2 errors
    [javac] 17 warnings

BUILD FAILED
/srv/gump/public/workspace/portals-pluto-1.0/build.xml:51: The following error occurred while executing this line:
/srv/gump/public/workspace/portals-pluto-1.0/portal/build.xml:50: Compile failed; see the compiler error output for details.

Total time: 8 seconds
---------------------------------------------

To subscribe to this information via syndicated feeds:
- RSS: http://vmgump.apache.org/gump/public/portals-pluto-1.0/portals-pluto-portal-1.0/rss.xml
- Atom: http://vmgump.apache.org/gump/public/portals-pluto-1.0/portals-pluto-portal-1.0/atom.xml

============================== Gump Tracking Only ===
Produced by Gump version 2.3.
Gump Run 37001624012008, vmgump:vmgump-public:37001624012008
Gump E-mail Identifier (unique within run) #11.

*********************************************************** G U M P
[GUMP@vmgump]: Project groovy (in module groovy) failed
To whom it may engage...
        
This is an automated request, but not an unsolicited one. For 
more information please visit http://gump.apache.org/nagged.html, 
and/or contact the folk at general@gump.apache.org.

Project groovy has an issue affecting its community integration.
This issue affects 3 projects.
The current state of this project is 'Failed', with reason 'Build Failed'.
For reference only, the following projects are affected by this:
    - authx-example :  Apache Authentication and Authorization Framework
    - authx-script :  Apache Authentication and Authorization Framework
    - groovy :  New agile dynamic language using a Java-like syntax for the ...


Full details are available at:
    http://vmgump.apache.org/gump/public/groovy/groovy/index.html

That said, some information snippets are provided here.

The following annotations (debug/informational/warning/error messages) were provided:
 -DEBUG- Sole output [1.0-beta-8-SNAPSHOT.jar] identifier set to project name
 -DEBUG- Dependency on cglib exists, no need to add for property maven.jar.cglib-nodep.
 -DEBUG- Dependency on jakarta-servletapi-5-servlet exists, no need to add for property maven.jar.servlet-api.
 -DEBUG- Dependency on jakarta-servletapi-5-jsp exists, no need to add for property maven.jar.jsp-api.
 -DEBUG- Dependency on asm exists, no need to add for property maven.jar.asm-attrs.
 -WARNING- Overriding Maven properties: [/srv/gump/public/workspace/groovy/build.properties]
 -DEBUG- (Gump generated) Maven Properties in: /srv/gump/public/workspace/groovy/build.properties
 -INFO- Failed with reason build failed
 -INFO- Failed to extract fallback artifacts from Gump Repository



The following work was performed:
http://vmgump.apache.org/gump/public/groovy/groovy/gump_work/build_groovy_groovy.html
Work Name: build_groovy_groovy (Type: Build)
Work ended in a state of : Failed
Elapsed: 4 secs
Command Line: maven --offline jar 
[Working Directory: /srv/gump/public/workspace/groovy]
CLASSPATH: /usr/lib/jvm/java-1.5.0-sun/lib/tools.jar:/srv/gump/public/workspace/ant/dist/lib/ant-jmf.jar:/srv/gump/public/workspace/ant/dist/lib/ant-swing.jar:/srv/gump/public/workspace/ant/dist/lib/ant-apache-resolver.jar:/srv/gump/public/workspace/ant/dist/lib/ant-trax.jar:/srv/gump/public/workspace/ant/dist/lib/ant-junit.jar:/srv/gump/public/workspace/ant/dist/lib/ant-launcher.jar:/srv/gump/public/workspace/ant/dist/lib/ant-nodeps.jar:/srv/gump/public/workspace/ant/dist/lib/ant.jar:/srv/gump/packages/antlr-2.7.6/antlr.jar:/srv/gump/public/workspace/asm/output/dist/lib/asm-analysis-24012008.jar:/srv/gump/public/workspace/asm/output/dist/lib/asm-util-24012008.jar:/srv/gump/public/workspace/asm/output/dist/lib/asm-xml-24012008.jar:/srv/gump/public/workspace/asm/output/dist/lib/asm-commons-24012008.jar:/srv/gump/public/workspace/asm/output/dist/lib/asm-24012008.jar:/srv/gump/public/workspace/asm/output/dist/lib/asm-tree-24012008.jar:/srv/gump/packages/axion-1.0-M2/axion-1.0-M2
 .jar:/srv/gump/packages/cglib/cglib-nodep-2.1_3.jar:/srv/gump/public/workspace/commons-cli-1.0.x/target/commons-cli-24012008.jar:/srv/gump/public/workspace/apache-commons/collections/build/commons-collections-24012008.jar:/srv/gump/public/workspace/httpcomponents/oac.hc3x/dist/commons-httpclient.jar:/srv/gump/public/workspace/apache-commons/logging/target/commons-logging-24012008.jar:/srv/gump/public/workspace/apache-commons/logging/target/commons-logging-api-24012008.jar:/srv/gump/public/workspace/apache-commons/primitives/target/commons-primitives-24012008.jar:/srv/gump/public/workspace/hsqldb/lib/hsqldb.jar:/srv/gump/public/workspace/jakarta-bsf/build/lib/bsf.jar:/srv/gump/public/workspace/jakarta-regexp/build/jakarta-regexp-24012008.jar:/srv/gump/public/workspace/jakarta-servletapi-5/jsr154/dist/lib/servlet-api.jar:/srv/gump/public/workspace/jakarta-servletapi-5/jsr152/dist/lib/jsp-api.jar:/srv/gump/packages/jarjar/jarjar-0.6.jar:/srv/gump/public/workspace/jmock/build/di
 st/jmock-core-24012008.jar:/srv/gump/public/workspace/jmock/build/dist/jmock-cglib-24012008.jar:/srv/gump/public/workspace/junit/dist/junit-24012008.jar:/srv/gump/packages/mockobjects-0.09/mockobjects-core-0.09.jar:/srv/gump/packages/mockobjects-0.09/mockobjects-jdk1.4-0.09.jar:/srv/gump/packages/mockobjects-0.09/mockobjects-alt-jdk1.4-0.09.jar:/srv/gump/public/workspace/mx4j/dist/lib/mx4j-impl.jar:/srv/gump/public/workspace/mx4j/dist/lib/mx4j-jmx.jar:/srv/gump/public/workspace/mx4j/dist/lib/mx4j.jar:/srv/gump/packages/nekohtml-0.9.5/nekohtml.jar:/srv/gump/packages/openejb-0.9.2/dist/openejb_loader-0.9.2.jar:/srv/gump/packages/openejb-0.9.2/dist/openejb_ejb_tests-0.9.2.jar:/srv/gump/packages/openejb-0.9.2/dist/openejb_server-0.9.2.jar:/srv/gump/packages/openejb-0.9.2/dist/openejb_client-0.9.2.jar:/srv/gump/packages/openejb-0.9.2/dist/openejb-0.9.2.jar:/srv/gump/packages/qdox-1.5/qdox-1.5.jar:/srv/gump/packages/radeox-1.0-BETA-2/lib/radeox-api.jar:/srv/gump/packages/radeox-1.
 0-BETA-2/lib/radeox.jar:/srv/gump/public/workspace/xml-commons/java/external/build/xml-apis-ext.jar:/srv/gump/public/workspace/xmlunit/build/lib/xmlunit-24012008.jar:/srv/gump/public/workspace/xpp/build/xpp3-24012008.jar:/srv/gump/public/workspace/xstream/xstream/target/xstream-24012008.jar
---------------------------------------------
 __  __
|  \/  |__ _Apache__ ___
| |\/| / _` \ V / -_) ' \  ~ intelligent projects ~
|_|  |_\__,_|\_/\___|_||_|  v. 1.0.2

build:start:

java:prepare-filesystem:
    [mkdir] Created dir: /srv/gump/public/workspace/groovy/target/classes

java:compile:
    [echo] Compiling to /srv/gump/public/workspace/groovy/target/classes
    [echo] No java source files to compile.
resources or todir was null

java:jar-resources:

test:prepare-filesystem:
    [mkdir] Created dir: /srv/gump/public/workspace/groovy/target/test-classes
    [mkdir] Created dir: /srv/gump/public/workspace/groovy/target/test-reports

test:test-resources:

test:compile:
    [echo] No test source files to compile.

test:test:
    [echo] No tests to run.

BUILD FAILED
File...... /home/gump/.maven/cache/maven-jar-plugin-1.6.1/plugin.jelly
Element... ant:fail
Line...... 53
Column.... 19
You must define currentVersion in your POM.
Total time: 3 seconds
Finished at: Thu Jan 24 19:19:55 GMT-08:00 2008

---------------------------------------------

To subscribe to this information via syndicated feeds:
- RSS: http://vmgump.apache.org/gump/public/groovy/groovy/rss.xml
- Atom: http://vmgump.apache.org/gump/public/groovy/groovy/atom.xml

============================== Gump Tracking Only ===
Produced by Gump version 2.3.
Gump Run 37001624012008, vmgump:vmgump-public:37001624012008
Gump E-mail Identifier (unique within run) #12.

*********************************************************** G U M P
[GUMP@vmgump]: Project jetty (in module jetty) failed
To whom it may engage...
        
This is an automated request, but not an unsolicited one. For 
more information please visit http://gump.apache.org/nagged.html, 
and/or contact the folk at general@gump.apache.org.

Project jetty has an issue affecting its community integration.
This issue affects 4 projects.
The current state of this project is 'Failed', with reason 'Build Failed'.
For reference only, the following projects are affected by this:
    - apollo :  Apollo Project
    - cargo :  Cargo provides a Java API to manipulate Java Containers
    - jetty :  Java HTTP Servlet Server
    - muse :  Muse Project


Full details are available at:
    http://vmgump.apache.org/gump/public/jetty/jetty/index.html

That said, some information snippets are provided here.

The following annotations (debug/informational/warning/error messages) were provided:
 -DEBUG- (Gump generated) Maven Properties in: /srv/gump/public/workspace/jetty/profiles.xml
 -INFO- Failed with reason build failed
 -DEBUG- Maven POM in: /srv/gump/public/workspace/jetty/pom.xml
 -INFO- Failed to extract fallback artifacts from Gump Repository



The following work was performed:
http://vmgump.apache.org/gump/public/jetty/jetty/gump_work/build_jetty_jetty.html
Work Name: build_jetty_jetty (Type: Build)
Work ended in a state of : Failed
Elapsed: 5 mins 45 secs
Command Line: mvn package 
[Working Directory: /srv/gump/public/workspace/jetty]
CLASSPATH: /usr/lib/jvm/java-1.5.0-sun/lib/tools.jar:/srv/gump/public/workspace/jetty/target/classes:/srv/gump/public/workspace/ant/dist/lib/ant-jmf.jar:/srv/gump/public/workspace/ant/dist/lib/ant-swing.jar:/srv/gump/public/workspace/ant/dist/lib/ant-apache-resolver.jar:/srv/gump/public/workspace/ant/dist/lib/ant-trax.jar:/srv/gump/public/workspace/ant/dist/lib/ant-junit.jar:/srv/gump/public/workspace/ant/dist/lib/ant-launcher.jar:/srv/gump/public/workspace/ant/dist/lib/ant-nodeps.jar:/srv/gump/public/workspace/ant/dist/lib/ant.jar:/srv/gump/public/workspace/jakarta-servletapi-5/jsr154/dist/lib/servlet-api.jar:/srv/gump/public/workspace/junit/dist/junit-24012008.jar:/srv/gump/public/workspace/slf4j/slf4j-jdk14/target/slf4j-jdk14-1.4.4-SNAPSHOT.jar:/srv/gump/public/workspace/slf4j/slf4j-simple/target/slf4j-simple-1.4.4-SNAPSHOT.jar:/srv/gump/public/workspace/slf4j/slf4j-nop/target/slf4j-nop-1.4.4-SNAPSHOT.jar:/srv/gump/public/workspace/slf4j/slf4j-api/target/slf4j-api-1.4.4-SN
 APSHOT.jar:/srv/gump/public/workspace/slf4j/slf4j-jcl/target/slf4j-jcl-1.4.4-SNAPSHOT.jar:/srv/gump/public/workspace/mx4j/dist/lib/mx4j-impl.jar:/srv/gump/public/workspace/mx4j/dist/lib/mx4j-jmx.jar:/srv/gump/public/workspace/mx4j/dist/lib/mx4j.jar:/srv/gump/public/workspace/mx4j/tools-dist/lib/mx4j-tools.jar:/srv/gump/public/workspace/xml-commons/java/external/build/xml-apis-ext.jar:/srv/gump/packages/commons-el-1.0/commons-el.jar:/srv/gump/packages/javamail-1.4/mail.jar:/srv/gump/packages/javamail-1.4/lib/mailapi.jar:/srv/gump/packages/jaf-1.1ea/activation.jar
---------------------------------------------
	at org.mortbay.jetty.Server.doStart(Server.java:222)
	at org.mortbay.component.AbstractLifeCycle.start(AbstractLifeCycle.java:40)
	at org.mortbay.jetty.SessionTest.setUp(SessionTest.java:68)
	at junit.framework.TestCase.runBare(TestCase.java:128)
	at junit.framework.TestResult$1.protect(TestResult.java:106)
	at junit.framework.TestResult.runProtected(TestResult.java:124)
	at junit.framework.TestResult.run(TestResult.java:109)
	at junit.framework.TestCase.run(TestCase.java:120)
	at junit.framework.TestSuite.runTest(TestSuite.java:230)
	at junit.framework.TestSuite.run(TestSuite.java:225)
	at sun.reflect.NativeMethodAccessorImpl.invoke0(Native Method)
	at sun.reflect.NativeMethodAccessorImpl.invoke(NativeMethodAccessorImpl.java:39)
	at sun.reflect.DelegatingMethodAccessorImpl.invoke(DelegatingMethodAccessorImpl.java:25)
	at java.lang.reflect.Method.invoke(Method.java:585)
	at org.apache.maven.surefire.junit.JUnitTestSet.execute(JUnitTestSet.java:213)
	at org.apache.maven.surefire.suite.AbstractDirectoryTestSuite.executeTestSet(AbstractDirectoryTestSuite.java:138)
	at org.apache.maven.surefire.suite.AbstractDirectoryTestSuite.execute(AbstractDirectoryTestSuite.java:125)
	at org.apache.maven.surefire.Surefire.run(Surefire.java:132)
	at sun.reflect.NativeMethodAccessorImpl.invoke0(Native Method)
	at sun.reflect.NativeMethodAccessorImpl.invoke(NativeMethodAccessorImpl.java:39)
	at sun.reflect.DelegatingMethodAccessorImpl.invoke(DelegatingMethodAccessorImpl.java:25)
	at java.lang.reflect.Method.invoke(Method.java:585)
	at org.apache.maven.surefire.booter.SurefireBooter.runSuitesInProcess(SurefireBooter.java:290)
	at org.apache.maven.surefire.booter.SurefireBooter.main(SurefireBooter.java:818)
2008-01-24 19:33:38.575::INFO:  Started SocketConnector@0.0.0.0:40406
Tests run: 1, Failures: 0, Errors: 1, Skipped: 0, Time elapsed: 0.054 sec <<< FAILURE!

Results :

Tests in error: 
  testDoGet(org.mortbay.jetty.WebAppTest)
  testSecurity(org.mortbay.jetty.WebAppTest)
  testDoPost(org.mortbay.jetty.WebAppTest)
  testWebInfAccess(org.mortbay.jetty.WebAppTest)
  testUnavailable(org.mortbay.jetty.WebAppTest)
  testSession(org.mortbay.jetty.SessionTest)

Tests run: 6, Failures: 0, Errors: 6, Skipped: 0

[INFO] ------------------------------------------------------------------------
[ERROR] BUILD FAILURE
[INFO] ------------------------------------------------------------------------
[INFO] There are test failures.
[INFO] ------------------------------------------------------------------------
[INFO] For more information, run Maven with the -e switch
[INFO] ------------------------------------------------------------------------
[INFO] Total time: 5 minutes 43 seconds
[INFO] Finished at: Thu Jan 24 19:33:39 GMT-08:00 2008
[INFO] Final Memory: 26M/56M
[INFO] ------------------------------------------------------------------------
---------------------------------------------

To subscribe to this information via syndicated feeds:
- RSS: http://vmgump.apache.org/gump/public/jetty/jetty/rss.xml
- Atom: http://vmgump.apache.org/gump/public/jetty/jetty/atom.xml

============================== Gump Tracking Only ===
Produced by Gump version 2.3.
Gump Run 37001624012008, vmgump:vmgump-public:37001624012008
Gump E-mail Identifier (unique within run) #13.

*********************************************************** G U M P
[GUMP@vmgump]: Project maven (in module maven) failed
To whom it may engage...
        
This is an automated request, but not an unsolicited one. For 
more information please visit http://gump.apache.org/nagged.html, 
and/or contact the folk at general@gump.apache.org.

Project maven has an issue affecting its community integration.
This issue affects 1 projects.
The current state of this project is 'Failed', with reason 'Build Failed'.
For reference only, the following projects are affected by this:
    - maven :  Project Management Tools


Full details are available at:
    http://vmgump.apache.org/gump/public/maven/maven/index.html

That said, some information snippets are provided here.

The following annotations (debug/informational/warning/error messages) were provided:
 -DEBUG- Sole output [maven-24012008.jar] identifier set to project name
 -INFO- Made directory [/srv/gump/public/workspace/maven/target/classes]
 -INFO- Made directory [/srv/gump/public/workspace/maven/target/test-classes]
 -DEBUG- (Gump generated) Maven Properties in: /srv/gump/public/workspace/maven/build.properties
 -INFO- Failed with reason build failed
 -DEBUG- Maven POM in: /srv/gump/public/workspace/maven/project.xml
 -DEBUG- Maven project properties in: /srv/gump/public/workspace/maven/project.properties
 -INFO- Failed to extract fallback artifacts from Gump Repository



The following work was performed:
http://vmgump.apache.org/gump/public/maven/maven/gump_work/build_maven_maven.html
Work Name: build_maven_maven (Type: Build)
Work ended in a state of : Failed
Elapsed: 3 secs
Command Line: maven --offline jar 
[Working Directory: /srv/gump/public/workspace/maven]
CLASSPATH: /usr/lib/jvm/java-1.5.0-sun/lib/tools.jar:/srv/gump/public/workspace/maven/target/classes:/srv/gump/public/workspace/maven/target/test-classes:/srv/gump/public/workspace/ant/dist/lib/ant-jmf.jar:/srv/gump/public/workspace/ant/dist/lib/ant-swing.jar:/srv/gump/public/workspace/ant/dist/lib/ant-apache-resolver.jar:/srv/gump/public/workspace/ant/dist/lib/ant-trax.jar:/srv/gump/public/workspace/ant/dist/lib/ant-junit.jar:/srv/gump/public/workspace/ant/dist/lib/ant-launcher.jar:/srv/gump/public/workspace/ant/dist/lib/ant-nodeps.jar:/srv/gump/public/workspace/ant/dist/lib/ant.jar:/srv/gump/public/workspace/apache-commons/beanutils/dist/commons-beanutils-24012008.jar:/srv/gump/public/workspace/commons-cli-1.0.x/target/commons-cli-24012008.jar:/srv/gump/public/workspace/apache-commons/collections/build/commons-collections-24012008.jar:/srv/gump/public/workspace/apache-commons/digester/dist/commons-digester.jar:/srv/gump/public/workspace/commons-dormant/graph2/target/commons
 -graph-24012008.jar:/srv/gump/public/workspace/httpcomponents/oac.hc3x/dist/commons-httpclient.jar:/srv/gump/public/workspace/apache-commons/io/target/commons-io-24012008.jar:/srv/gump/public/workspace/commons-jelly/target/commons-jelly-24012008.jar:/srv/gump/public/workspace/commons-jelly/jelly-tags/ant/target/commons-jelly-tags-ant-24012008.jar:/srv/gump/public/workspace/commons-jelly/jelly-tags/define/target/commons-jelly-tags-define-24012008.jar:/srv/gump/public/workspace/commons-jelly/jelly-tags/util/target/commons-jelly-tags-util-24012008.jar:/srv/gump/public/workspace/commons-jelly/jelly-tags/xml/target/commons-jelly-tags-xml-24012008.jar:/srv/gump/public/workspace/apache-commons/jexl/dist/commons-jexl-24012008.jar:/srv/gump/public/workspace/apache-commons/lang/commons-lang-24012008.jar:/srv/gump/public/workspace/apache-commons/logging/target/commons-logging-24012008.jar:/srv/gump/public/workspace/apache-commons/logging/target/commons-logging-api-24012008.jar:/srv/gum
 p/public/workspace/dom4j/build/dom4j.jar:/srv/gump/public/workspace/logging-log4j-12/dist/lib/log4j-24012008.jar:/srv/gump/public/workspace/xml-commons/java/external/build/xml-apis-ext.jar:/srv/gump/public/workspace/xml-commons/java/build/which.jar:/srv/gump/public/workspace/xml-commons/java/build/resolver.jar:/srv/gump/public/workspace/xpp/build/xpp3-24012008.jar
---------------------------------------------
 __  __
|  \/  |__ _Apache__ ___
| |\/| / _` \ V / -_) ' \  ~ intelligent projects ~
|_|  |_\__,_|\_/\___|_||_|  v. 1.0.2

The build cannot continue because of the following unsatisfied dependencies:

jaxen-1.1-beta-9.jar
commons-codec-1.2.jar (try downloading from http://jakarta.apache.org/commons/codec/)
xercesImpl-2.8.0.jar (try downloading from http://xerces.apache.org/xerces2-j/)
plexus-utils-1.0.5.jar
maven-model-3.0.2.jar
stax-1.2.0.jar
stax-api-1.0.1.jar
stax-utils-20060502.jar
wagon-provider-api-1.0-beta-2.jar
wagon-http-1.0-beta-2.jar
wagon-file-1.0-beta-2.jar
wagon-ssh-common-1.0-beta-2.jar
wagon-ssh-1.0-beta-2.jar
jsch-0.1.27.jar

Total time: 2 seconds
Finished at: Thu Jan 24 19:56:41 GMT-08:00 2008

---------------------------------------------

To subscribe to this information via syndicated feeds:
- RSS: http://vmgump.apache.org/gump/public/maven/maven/rss.xml
- Atom: http://vmgump.apache.org/gump/public/maven/maven/atom.xml

============================== Gump Tracking Only ===
Produced by Gump version 2.3.
Gump Run 37001624012008, vmgump:vmgump-public:37001624012008
Gump E-mail Identifier (unique within run) #14.

*********************************************************** G U M P
[GUMP@vmgump]: Project maven-bootstrap (in module maven) failed
To whom it may engage...
        
This is an automated request, but not an unsolicited one. For 
more information please visit http://gump.apache.org/nagged.html, 
and/or contact the folk at general@gump.apache.org.

Project maven-bootstrap has an issue affecting its community integration.
This issue affects 1 projects.
The current state of this project is 'Failed', with reason 'Build Failed'.
For reference only, the following projects are affected by this:
    - maven-bootstrap :  Project Management Tools


Full details are available at:
    http://vmgump.apache.org/gump/public/maven/maven-bootstrap/index.html

That said, some information snippets are provided here.

The following annotations (debug/informational/warning/error messages) were provided:
 -DEBUG- Dependency on ant exists, no need to add for property maven.jar.ant.
 -DEBUG- Dependency on xml-commons-which exists, no need to add for property maven.jar.which.
 -INFO- Failed with reason build failed



The following work was performed:
http://vmgump.apache.org/gump/public/maven/maven-bootstrap/gump_work/build_maven_maven-bootstrap.html
Work Name: build_maven_maven-bootstrap (Type: Build)
Work ended in a state of : Failed
Elapsed: 8 secs
Command Line: /usr/lib/jvm/java-1.5.0-sun/bin/java -Djava.awt.headless=true -Xbootclasspath/p:/srv/gump/public/workspace/xml-commons/java/external/build/xml-apis.jar:/srv/gump/public/workspace/xml-xerces2/build/xercesImpl.jar org.apache.tools.ant.Main -Dgump.merge=/srv/gump/public/gump/work/merge.xml -Dbuild.sysclasspath=only -Dmaven.jar.ant=/srv/gump/public/workspace/ant/dist/lib/ant.jar -Dmaven.bootstrap.dir=/srv/gump/public/workspace/maven/bootstrap -Dmaven.repo.local=/srv/gump/public/workspace/maven/bootstrap/maven.local.repo -Dmaven.bootstrap.classes=/srv/gump/public/workspace/maven/bootstrap/bootstrap-classes -Dmaven.jar.commons-logging=/srv/gump/public/workspace/apache-commons/logging/target/commons-logging-24012008.jar -Dmaven.home=/srv/gump/public/workspace/maven/bootstrap/maven.home -Dmaven.home.local=/srv/gump/public/workspace/maven/bootstrap/maven.home -Dmaven.jar.commons-cli=/srv/gump/public/workspace/commons-cli-1.0.x/target/commons-cli-24012008.jar -Dmaven.jar.
 override=true -Dmaven.jar.commons-lang=/srv/gump/public/workspace/apache-commons/lang/commons-lang-24012008.jar -Dmaven.jar.commons-httpclient=/srv/gump/public/workspace/httpcomponents/oac.hc3x/dist/commons-httpclient.jar -Dmaven.bootstrap.online=-o -Dmaven.bootstrap.phase1.classes=/srv/gump/public/workspace/maven/bootstrap/phase1-classes -Dmaven.jar.velocity=/srv/gump/public/workspace/velocity-engine/bin/velocity-24012008.jar -Dmaven.jar.which=/srv/gump/public/workspace/xml-commons/java/build/which.jar -Dmaven.jar.dom4j=/srv/gump/public/workspace/dom4j/build/dom4j.jar -f build-bootstrap.xml 
[Working Directory: /srv/gump/public/workspace/maven]
CLASSPATH: /usr/lib/jvm/java-1.5.0-sun/lib/tools.jar:/srv/gump/public/workspace/maven/bootstrap/bootstrap-classes:/srv/gump/public/workspace/ant/dist/lib/ant-jmf.jar:/srv/gump/public/workspace/ant/dist/lib/ant-swing.jar:/srv/gump/public/workspace/ant/dist/lib/ant-apache-resolver.jar:/srv/gump/public/workspace/ant/dist/lib/ant-trax.jar:/srv/gump/public/workspace/ant/dist/lib/ant-junit.jar:/srv/gump/public/workspace/ant/dist/lib/ant-launcher.jar:/srv/gump/public/workspace/ant/dist/lib/ant-nodeps.jar:/srv/gump/public/workspace/ant/dist/lib/ant.jar:/srv/gump/packages/junit3.8.1/junit.jar:/srv/gump/public/workspace/xml-commons/java/build/resolver.jar:/srv/gump/public/workspace/xml-commons/java/external/build/xml-apis-ext.jar:/srv/gump/public/workspace/apache-commons/betwixt/target/commons-betwixt-24012008.jar:/srv/gump/public/workspace/apache-commons/beanutils/dist/commons-beanutils-24012008.jar:/srv/gump/public/workspace/apache-commons/collections/build/commons-collections-240120
 08.jar:/srv/gump/public/workspace/apache-commons/digester/dist/commons-digester.jar:/srv/gump/public/workspace/apache-commons/jexl/dist/commons-jexl-24012008.jar:/srv/gump/public/workspace/commons-jelly/target/commons-jelly-24012008.jar:/srv/gump/public/workspace/commons-jelly/jelly-tags/ant/target/commons-jelly-tags-ant-24012008.jar:/srv/gump/public/workspace/commons-jelly/jelly-tags/define/target/commons-jelly-tags-define-24012008.jar:/srv/gump/public/workspace/commons-jelly/jelly-tags/util/target/commons-jelly-tags-util-24012008.jar:/srv/gump/public/workspace/commons-jelly/jelly-tags/xml/target/commons-jelly-tags-xml-24012008.jar:/srv/gump/public/workspace/commons-dormant/graph2/target/commons-graph-24012008.jar:/srv/gump/public/workspace/apache-commons/io/target/commons-io-24012008.jar:/srv/gump/packages/jdepend-2.6/lib/jdepend.jar:/srv/gump/public/workspace/logging-log4j-12/dist/lib/log4j-24012008.jar:/srv/gump/public/workspace/xml-commons/java/build/which.jar:/srv/gump
 /public/workspace/xpp/build/xpp3_xpath-24012008.jar:/srv/gump/public/workspace/xpp/build/xpp3-24012008.jar:/srv/gump/public/workspace/xpp/build/xpp3_min-24012008.jar:/srv/gump/public/workspace/commons-cli-1.0.x/target/commons-cli-24012008.jar:/srv/gump/public/workspace/apache-commons/lang/commons-lang-24012008.jar:/srv/gump/public/workspace/apache-commons/logging/target/commons-logging-24012008.jar:/srv/gump/public/workspace/httpcomponents/oac.hc3x/dist/commons-httpclient.jar:/srv/gump/public/workspace/dom4j/build/dom4j.jar:/srv/gump/public/workspace/velocity-engine/bin/velocity-24012008.jar
---------------------------------------------
    [javac] symbol  : class TransferEvent
    [javac] location: class org.apache.maven.util.ConsoleDownloadMeter
    [javac]     public void transferStarted( TransferEvent transferEvent )
    [javac]                                  ^
    [javac] /srv/gump/public/workspace/maven/src/java/org/apache/maven/util/ConsoleDownloadMeter.java:50: cannot find symbol
    [javac] symbol  : class TransferEvent
    [javac] location: class org.apache.maven.util.ConsoleDownloadMeter
    [javac]     public void transferProgress( TransferEvent transferEvent, byte[] buffer, int length )
    [javac]                                   ^
    [javac] /srv/gump/public/workspace/maven/src/java/org/apache/maven/util/ConsoleDownloadMeter.java:57: cannot find symbol
    [javac] symbol  : class TransferEvent
    [javac] location: class org.apache.maven.util.ConsoleDownloadMeter
    [javac]     public void transferCompleted( TransferEvent transferEvent )
    [javac]                                    ^
    [javac] /srv/gump/public/workspace/maven/src/java/org/apache/maven/util/ConsoleDownloadMeter.java:63: cannot find symbol
    [javac] symbol  : class TransferEvent
    [javac] location: class org.apache.maven.util.ConsoleDownloadMeter
    [javac]     public void transferError( TransferEvent transferEvent )
    [javac]                                ^
    [javac] /srv/gump/public/workspace/maven/src/java/org/apache/maven/util/DVSLPathTool.java:21: package org.codehaus.plexus.util does not exist
    [javac] import org.codehaus.plexus.util.StringUtils;
    [javac]                                 ^
    [javac] /srv/gump/public/workspace/maven/src/java/org/apache/maven/util/HttpUtils.java:28: package org.apache.maven.wagon does not exist
    [javac] import org.apache.maven.wagon.ConnectionException;
    [javac]                               ^
    [javac] /srv/gump/public/workspace/maven/src/java/org/apache/maven/util/HttpUtils.java:29: package org.apache.maven.wagon does not exist
    [javac] import org.apache.maven.wagon.Wagon;
    [javac]                               ^
    [javac] /srv/gump/public/workspace/maven/src/java/org/apache/maven/util/HttpUtils.java:30: package org.apache.maven.wagon.providers.file does not exist
    [javac] import org.apache.maven.wagon.providers.file.FileWagon;
    [javac]                                              ^
    [javac] /srv/gump/public/workspace/maven/src/java/org/apache/maven/util/HttpUtils.java:31: package org.apache.maven.wagon.providers.http does not exist
    [javac] import org.apache.maven.wagon.providers.http.HttpWagon;
    [javac]                                              ^
    [javac] /srv/gump/public/workspace/maven/src/java/org/apache/maven/util/HttpUtils.java:32: package org.apache.maven.wagon.proxy does not exist
    [javac] import org.apache.maven.wagon.proxy.ProxyInfo;
    [javac]                                     ^
    [javac] /srv/gump/public/workspace/maven/src/java/org/apache/maven/util/HttpUtils.java:33: package org.apache.maven.wagon.repository does not exist
    [javac] import org.apache.maven.wagon.repository.Repository;
    [javac]                                          ^
    [javac] Note: Some input files use or override a deprecated API.
    [javac] Note: Recompile with -Xlint:deprecation for details.
    [javac] Note: Some input files use unchecked or unsafe operations.
    [javac] Note: Recompile with -Xlint:unchecked for details.
    [javac] 100 errors

BUILD FAILED
/srv/gump/public/workspace/maven/build-bootstrap.xml:234: Compile failed; see the compiler error output for details.

Total time: 6 seconds
---------------------------------------------

To subscribe to this information via syndicated feeds:
- RSS: http://vmgump.apache.org/gump/public/maven/maven-bootstrap/rss.xml
- Atom: http://vmgump.apache.org/gump/public/maven/maven-bootstrap/atom.xml

============================== Gump Tracking Only ===
Produced by Gump version 2.3.
Gump Run 37001624012008, vmgump:vmgump-public:37001624012008
Gump E-mail Identifier (unique within run) #19.


--
Apache Gump
http://gump.apache.org/ [Instance: vmgump]

---------------------------------------------------------------------
To unsubscribe, e-mail: general-unsubscribe@gump.apache.org
For additional commands, e-mail: general-help@gump.apache.org


Mime
View raw message