gump-general mailing list archives

Site index · List index
Message view « Date » · « Thread »
Top « Date » · « Thread »
From g...@vmgump.apache.org
Subject BATCH: All dressed up, with nowhere to go...
Date Thu, 24 Jan 2008 03:56:59 GMT
Dear Gumpmeisters,
            
The following 17 notifys should have been sent

*********************************************************** G U M P
[GUMP@vmgump]: Project bcel (in module jakarta-bcel) failed
[GUMP@vmgump]: Project gsbase-test (in module gsbase) failed
[GUMP@vmgump]: Module village failed
[GUMP@vmgump]: Project village (in module village) failed
[GUMP@vmgump]: Module town failed
[GUMP@vmgump]: Project rhino (in module rhino) failed
[GUMP@vmgump]: Project emma (in module emma) failed
[GUMP@vmgump]: Project hivemind-compile (in module hivemind) failed
[GUMP@vmgump]: Project jmock2 (in module jmock2) failed
[GUMP@vmgump]: Module beanshell failed
[GUMP@vmgump]: Project jtidy-cvs (in module jtidy) failed
[GUMP@vmgump]: Project nlog4j (in module nlog4j) failed
[GUMP@vmgump]: Project asn1-codec (in module asn1) failed
[GUMP@vmgump]: Module JacORB failed
[GUMP@vmgump]: Project JacORB-idllib (in module JacORB) failed
[GUMP@vmgump]: Project lenya (in module lenya) failed
[GUMP@vmgump]: Project asn1-der (in module asn1) failed
*********************************************************** G U M P
[GUMP@vmgump]: Project bcel (in module jakarta-bcel) failed
To whom it may engage...
        
This is an automated request, but not an unsolicited one. For 
more information please visit http://gump.apache.org/nagged.html, 
and/or contact the folk at general@gump.apache.org.

Project bcel has an issue affecting its community integration.
This issue affects 278 projects,
 and has been outstanding for 114 runs.
The current state of this project is 'Failed', with reason 'Build Failed'.
For reference only, the following projects are affected by this:
    - JacORB :  The free Java implementation of the OMG's CORBA standard.
    - anakia :  Essentially an XML transformation tool, Anakia uses JDOM and...
    - ant-contrib :  Useful little Ant tasks
    - ant-contrib-test :  Useful little Ant tasks
    - ant-embed-optional :  Java based build tool
    - ant-xdocs-proposal :  Java based build tool
    - antbook-diary-core :  Examples to go with Java Development with Ant
    - antbook-sections :  Examples to go with Java Development with Ant
    - apacheds-core :  Apache Directory Server
    - apacheds-main :  Apache Directory Server
    - apollo :  Apollo Project
    - authx-example :  Apache Authentication and Authorization Framework
    - authx-script :  Apache Authentication and Authorization Framework
    - bcel :  Byte Code Engineering Library
    - bsh-cvs
    - cargo :  Cargo provides a Java API to manipulate Java Containers
    - castor :  Java to XML, SQL, LDAP bindings
    - cddlm :  Configuration and Deployment of Grid Applications and System...
    - checkstyle :  Java style checker
    - commons-chain :  GoF "Chain of Responsibility" pattern
    - commons-configuration :  Apache Commons
    - commons-fileupload :  Commons File Upload Package
    - commons-javaflow :  Commons Javaflow
    - commons-jci :  Commons JCI
    - commons-jelly :  Commons Jelly
    - commons-jelly-tags-ant :  Commons Jelly
    - commons-jelly-tags-antlr :  Commons Jelly
    - commons-jelly-tags-avalon :  Commons Jelly
    - commons-jelly-tags-bean :  Commons Jelly
    - commons-jelly-tags-beanshell :  Commons Jelly
    - commons-jelly-tags-betwixt :  Commons Jelly
    - commons-jelly-tags-bsf :  Commons Jelly
    - commons-jelly-tags-define :  Commons Jelly
    - commons-jelly-tags-define-test :  Commons Jelly
    - commons-jelly-tags-dynabean :  Commons Jelly
    - commons-jelly-tags-email :  Commons Jelly
    - commons-jelly-tags-fmt :  Commons Jelly
    - commons-jelly-tags-fmt-test :  Commons Jelly
    - commons-jelly-tags-html :  Commons Jelly
    - commons-jelly-tags-http :  Commons Jelly
    - commons-jelly-tags-interaction :  Commons Jelly
    - commons-jelly-tags-jaxme :  Commons Jelly
    - commons-jelly-tags-jetty :  Commons Jelly
    - commons-jelly-tags-jface :  Commons Jelly
    - commons-jelly-tags-jms :  Commons Jelly
    - commons-jelly-tags-jmx :  Commons Jelly
    - commons-jelly-tags-jsl :  Commons Jelly
    - commons-jelly-tags-jsl-test :  Commons Jelly
    - commons-jelly-tags-junit :  Commons Jelly
    - commons-jelly-tags-log :  Commons Jelly
    - commons-jelly-tags-memory :  Commons Jelly
    - commons-jelly-tags-ojb :  Commons Jelly
    - commons-jelly-tags-quartz :  Commons Jelly
    - commons-jelly-tags-regexp :  Commons Jelly
    - commons-jelly-tags-soap :  Commons Jelly
    - commons-jelly-tags-sql :  Commons Jelly
    - commons-jelly-tags-swing :  Commons Jelly
    - commons-jelly-tags-swt :  Commons Jelly
    - commons-jelly-tags-threads :  Commons Jelly
    - commons-jelly-tags-util :  Commons Jelly
    - commons-jelly-tags-validate :  Commons Jelly
    - commons-jelly-tags-velocity :  Commons Jelly
    - commons-jelly-tags-xml :  Commons Jelly
    - commons-jelly-tags-xml-test :  Commons Jelly
    - commons-jelly-tags-xmlunit :  Commons Jelly
    - commons-jelly-test :  Commons Jelly
    - commons-jxpath :  XPath traversal of JavaBeans
    - commons-vfs :  Apache Commons
    - commons-vfs-sandbox :  Apache Commons
    - db-ddlutils :  Easy-to-use component for working with Database Definition (...
    - db-ojb-from-packages-1-0-release :  ObjectRelationalBridge
    - db-torque :  Persistence Layer
    - db-torque-gen :  Persistence Layer
    - derby :  Apache Derby, 100% Java relational database.
    - dist-xalan2 :  Release 2.x of the Xalan-Java XSLT processor
    - dist-xerces :  Java XML Parser - the sequel with no equal
    - dist-xerces1 :  Java XML Parser
    - dom4j :  The flexible XML framework for Java
    - dom4j-HEAD :  The flexible XML framework for Java
    - dom4j-HEAD-tests :  The flexible XML framework for Java
    - dom4j-tests :  The flexible XML framework for Java
    - excalibur-component :  Repository of reusable components.
    - excalibur-cornerstone-connection-api :  Repository of reusable components.
    - excalibur-cornerstone-connection-impl :  Repository of reusable components.
    - excalibur-cornerstone-datasources-impl :  Repository of reusable components.
    - excalibur-cornerstone-scheduler-impl :  Repository of reusable components.
    - excalibur-cornerstone-sockets-impl :  Repository of reusable components.
    - excalibur-cornerstone-store-impl :  Repository of reusable components.
    - excalibur-cornerstone-threads-api :  Repository of reusable components.
    - excalibur-cornerstone-threads-impl :  Repository of reusable components.
    - excalibur-datasource :  Repository of reusable components.
    - excalibur-event :  Repository of reusable components.
    - excalibur-event-api :  Repository of reusable components.
    - excalibur-event-impl :  Repository of reusable components.
    - excalibur-fortress-bean :  Repository of reusable components.
    - excalibur-fortress-container-api :  Repository of reusable components.
    - excalibur-fortress-container-impl :  Repository of reusable components.
    - excalibur-fortress-container-test :  Repository of reusable components.
    - excalibur-fortress-examples :  Repository of reusable components.
    - excalibur-fortress-meta :  Repository of reusable components.
    - excalibur-fortress-migration :  Repository of reusable components.
    - excalibur-fortress-platform :  Repository of reusable components.
    - excalibur-fortress-testcase :  Repository of reusable components.
    - excalibur-framework-impl :  Repository of reusable components.
    - excalibur-instrument-api :  Repository of reusable components.
    - excalibur-instrument-client :  Repository of reusable components.
    - excalibur-instrument-mgr-api :  Repository of reusable components.
    - excalibur-instrument-mgr-http :  Repository of reusable components.
    - excalibur-instrument-mgr-impl :  Repository of reusable components.
    - excalibur-lifecycle-api :  Repository of reusable components.
    - excalibur-lifecycle-impl :  Repository of reusable components.
    - excalibur-logger :  Repository of reusable components.
    - excalibur-monitor :  Repository of reusable components.
    - excalibur-pool :  Repository of reusable components.
    - excalibur-pool-api :  Repository of reusable components.
    - excalibur-pool-impl :  Repository of reusable components.
    - excalibur-pool-instrumented :  Repository of reusable components.
    - excalibur-sourceresolve :  Repository of reusable components.
    - excalibur-store :  Repository of reusable components.
    - excalibur-testcase :  Repository of reusable components.
    - excalibur-thread :  Repository of reusable components.
    - excalibur-thread-api :  Repository of reusable components.
    - excalibur-thread-impl :  Repository of reusable components.
    - excalibur-thread-impl-test :  Repository of reusable components.
    - excalibur-thread-instrumented :  Repository of reusable components.
    - excalibur-xmlutil :  Repository of reusable components.
    - eyebrowse :  Web-based mail archive browsing
    - fulcrum-bsf :  Services Framework
    - fulcrum-cache :  Services Framework
    - fulcrum-configuration-impl :  Services Framework
    - fulcrum-crypto :  Services Framework
    - fulcrum-dvsl :  Services Framework
    - fulcrum-factory :  Services Framework
    - fulcrum-hsqldb :  Services Framework
    - fulcrum-intake :  Services Framework
    - fulcrum-localization :  Services Framework
    - fulcrum-mimetype :  Services Framework
    - fulcrum-naming :  Services Framework
    - fulcrum-osworkflow :  Services Framework
    - fulcrum-parser :  Services Framework
    - fulcrum-pool :  Services Framework
    - fulcrum-quartz :  Services Framework
    - fulcrum-security-api :  Services Framework
    - fulcrum-security-memory :  Services Framework
    - fulcrum-security-nt :  Services Framework
    - fulcrum-template :  Services Framework
    - fulcrum-testcontainer :  Services Framework
    - fulcrum-upload :  Services Framework
    - fulcrum-xmlrpc :  Services Framework
    - fulcrum-xslt :  Services Framework
    - fulcrum-yaafi :  Services Framework
    - groovy :  New agile dynamic language using a Java-like syntax for the ...
    - htmlparser :  HTML Parser
    - htmlparser-test :  HTML Parser
    - htmlunit :  A tool for testing web based applications
    - httpcomponents-client :  HTTP Component: Client
    - httpcomponents-core :  HTTP Component: Core
    - httpcomponents-core-tests :  Unit Tests for HTTP Component: Core
    - invicta :  Open-source build management tool.
    - ivy :  Ivy Core
    - ivy-tests :  Ivy is a tool for managing (recording, tracking, resolving a...
    - jakarta-cactus-documentation :  Cactus Documentation
    - jakarta-cactus-framework-12 :  Cactus Framework (J2EE 1.2)
    - jakarta-cactus-framework-13 :  Cactus Framework (J2EE 1.3)
    - jakarta-cactus-integration-ant-12 :  Cactus Ant Integration (J2EE 1.2)
    - jakarta-cactus-integration-ant-13 :  Cactus Ant Integration (J2EE 1.3)
    - jakarta-cactus-release-12 :  Unit test framework for server-side java code
    - jakarta-cactus-release-13 :  Unit test framework for server-side java code
    - jakarta-cactus-sample-jetty-13 :  Cactus Jetty Sample (J2EE 1.3)
    - jakarta-cactus-sample-servlet-12 :  Cactus Servlet Sample (J2EE 1.2)
    - jakarta-cactus-sample-servlet-13 :  Cactus Servlet Sample (J2EE 1.3)
    - jakarta-jmeter-svn :  Pure Java load testing and performance measurement tool.
   ...
    - jakarta-jmeter-test :  Pure Java load testing and performance measurement tool.
   ...
    - jakarta-regexp-package :  Java Regular Expression package
    - jakarta-site2 :  The Jakarta site
    - jakarta-taglibs-documentation :  JSP Taglibs
    - jakarta-taglibs-i18n :  I18N Taglib
    - jakarta-taglibs-jndi :  JNDI Taglib
    - jakarta-taglibs-log :  Log Taglib
    - jakarta-taglibs-random :  Random Taglib
    - jakarta-taglibs-regexp :  Regexp Taglib
    - jakarta-taglibs-standard :  Standard Taglib
    - jakarta-taglibs-string :  String Taglib
    - jakarta-tomcat :  Servlet 2.2 and JSP 1.1 Reference Implementation
    - jakarta-tomcat-4.0 :  Servlet 2.3 and JSP 1.2 Reference Implementation
    - jakarta-tomcat-catalina :  Servlet 2.4 Reference Implementation
    - jakarta-tomcat-coyote-tomcat3 :  Connectors to various web servers
    - jakarta-tomcat-coyote-tomcat4 :  Connectors to various web servers
    - jakarta-tomcat-jk :  Connectors to various web servers
    - jakarta-turbine-jcs :  Cache
    - jaxen :  Universal Java XPath Engine
    - jaxen-test :  Universal Java XPath Engine
    - jdom :  Java XML API
    - jetty :  Java HTTP Servlet Server
    - jgroups :  A Reliable Multicast Communication Toolkit for Java
    - junit-addons :  Various JUnit addons and helper classes.
    - logging-log4cxx-ant :  Apache log4cxx
    - logging-log4cxx-ant-no_wchar_t :  Apache log4cxx
    - logging-log4cxx-ant-static :  Apache log4cxx
    - logging-log4j-chainsaw :  Chainsaw log viewer
    - maven :  Project Management Tools
    - maven-bootstrap :  Project Management Tools
    - maven-directory-plugin :  Apache Directory Server
    - muse :  Muse Project
    - mx4j :  OpenSource implementation of a JMX agent
    - mx4j-remote :  OpenSource implementation of a JMX agent
    - mx4j-tools :  OpenSource implementation of a JMX agent
    - mx4j-tools-from-packaged-jetty :  OpenSource implementation of a JMX agent
    - naming-management :  Apache Directory Naming Component
    - opensaml :  OpenSAML 1.0.1 is a set of open source Java and C++ librarie...
    - poi :  POI
    - portals-bridges-common :  Support for JSR168 compliant Portlet development
    - portals-bridges-frameworks :  Support for JSR168 compliant Portlet development
    - portals-bridges-struts :  Support for JSR168 compliant Portlet development
    - portals-bridges-velocity :  Support for JSR168 compliant Portlet development
    - portals-jetspeed-1 :  Enterprise Information Portal
    - portals-pluto-api-1.0 :  JSR168 Container
    - portals-pluto-container-1.0 :  JSR168 Container
    - portals-pluto-deploy-1.0 :  JSR168 Container
    - portals-pluto-descriptors-1.0 :  JSR168 Container
    - portals-pluto-portal-1.0 :  JSR168 Container
    - slide-webdavclient :  Content Management System based on WebDAV technology
    - smartfrog :  Smartfrog: Application Deployment from HP Laboratories
    - smartfrog-components :  Smartfrog: Application Deployment from HP Laboratories
    - smartfrog-tasks :  Smartfrog: Application Deployment from HP Laboratories
    - smartfrog-tasks-test :  Smartfrog: Application Deployment from HP Laboratories
    - smartfrog-test :  Smartfrog: Application Deployment from HP Laboratories
    - smartfrog-testharness :  Smartfrog: Application Deployment from HP Laboratories
    - strutstestcase :  An extension of the standard JUnit TestCase class that provi...
    - stub-compiler :  Apache ASN.1 Tools
    - tapestry :  Component-based web application framework organized around i...
    - test-ojb-from-packages-1-0-release :  ObjectRelationalBridge
    - tomcat-catalina :  Servlet 2.3 and JSP 1.2 Reference Implementation
    - turbine-core :  A servlet based framework.
    - velocity-anakia :  Anakia uses Apache Velocity to generate documents based on X...
    - velocity-anakia-test :  Anakia uses Apache Velocity to generate documents based on X...
    - velocity-dvsl :  Template engine
    - velocity-engine :  Velocity Templating engine
    - velocity-engine-test :  Velocity Templating engine
    - velocity-texen :  Texen is a general purpose text generating utility based on ...
    - velocity-texen-test :  Texen is a general purpose text generating utility based on ...
    - velocity-tools :  VelocityTools project
    - ws-axis-test :  Apache eXtensible Interaction System
    - ws-axis2 :  Apache Axis2 SOAP Stack
    - ws-commons-axiom :  Common stuff for the WS projects.
    - ws-commons-policy :  Common stuff for the WS projects.
    - ws-commons-xmlschema :  Common stuff for the WS projects.
    - ws-juddi :  ws-juddi -- UDDI Toolkit/Repository
    - ws-juddi-test :  ws-juddi -- UDDI Toolkit/Repository
    - wss4j :  WS-FX Project
    - xalan :  Release 2.x of the Xalan-Java XSLT processor
    - xdoclet :  Enhanced Doclet engine.
    - xdoclet-apache-module-prepare :  Intermediate target that prepares xdoclet's
    apache modul...
    - xdoclet-bea-module-prepare :  Intermediate target that prepares xdoclet's
    bea module
    - xdoclet-compile-core :  Intermediate target that compiles xdoclet's core
    classes
    - xdoclet-ejb-module-prepare :  Intermediate target that prepares xdoclet's
    ejb module
    - xdoclet-hibernate-module-prepare :  Intermediate target that prepares xdoclet's
    hibernate mo...
    - xdoclet-jdo-module-prepare :  Intermediate target that prepares xdoclet's
    jdo module
    - xdoclet-libelis-module-prepare :  Intermediate target that prepares xdoclet's
    libelis modu...
    - xdoclet-objectweb-module-prepare :  Intermediate target that prepares xdoclet's
    objectweb mo...
    - xdoclet-oracle-module-prepare :  Intermediate target that prepares xdoclet's
    oracle modul...
    - xdoclet-orion-module-prepare :  Intermediate target that prepares xdoclet's
    orion module
    - xdoclet-tjdo-module-prepare :  Intermediate target that prepares xdoclet's
    tjdo module
    - xdoclet-web-module-prepare :  Intermediate target that prepares xdoclet's
    web module
    - xdoclet-xdoclet-module-prepare :  Intermediate target that prepares xdoclet's
    xdoclet modu...
    - xml-batik :  Scalable Vector Graphics
    - xml-batik-rasterizer :  Scalable Vector Graphics
    - xml-fop :  XSL-FO (Formatting Objects) processor
    - xml-fop-maintenance :  XSL-FO (Formatting Objects) processor (Maintenance branch)
    - xml-security :  XML-Signature Syntax and Processing
    - xml-security-tests :  XML-Signature Syntax and Processing
    - xml-stylebook2 :  Style book
    - xml-xalan2 :  Release 2.x of the Xalan-Java XSLT processor
    - xml-xindice :  native XML database
    - xmlunit :  JUnit extension for XML unit tests.
    - xom :  XOM is a new XML object model.
    - xsltc :  Release 2.x of the Xalan-Java XSLT processor
    - xstream :  simple library to serialize object to XML and back
    again


Full details are available at:
    http://vmgump.apache.org/gump/public/jakarta-bcel/bcel/index.html

That said, some information snippets are provided here.

The following annotations (debug/informational/warning/error messages) were provided:
 -DEBUG- Sole output [bcel-5.3-SNAPSHOT.jar] identifier set to project name
 -DEBUG- (Gump generated) Maven Properties in: /srv/gump/public/workspace/jakarta-bcel/profiles.xml
 -INFO- Failed with reason build failed
 -DEBUG- Maven POM in: /srv/gump/public/workspace/jakarta-bcel/pom.xml
 -DEBUG- Extracted fallback artifacts from Gump Repository



The following work was performed:
http://vmgump.apache.org/gump/public/jakarta-bcel/bcel/gump_work/build_jakarta-bcel_bcel.html
Work Name: build_jakarta-bcel_bcel (Type: Build)
Work ended in a state of : Failed
Elapsed: 11 secs
Command Line: mvn package 
[Working Directory: /srv/gump/public/workspace/jakarta-bcel]
CLASSPATH: /usr/lib/jvm/java-1.5.0-sun/lib/tools.jar:/srv/gump/public/workspace/junit/dist/junit-24012008.jar
---------------------------------------------
@CombinedAnnotation( { @SimpleAnnotation(id = 4) })

/srv/gump/public/workspace/jakarta-bcel/src/test/java/org/apache/bcel/data/AnnotatedWithEnumClass.java:[3,1] annotations are not supported in -source 1.4
(try -source 1.5 to enable annotations)
@AnnotationEnumElement(enumval = SimpleEnum.Red)

/srv/gump/public/workspace/jakarta-bcel/src/test/java/org/apache/bcel/data/MarkerAnnotationInvisible.java:[5,1] annotations are not supported in -source 1.4
(try -source 1.5 to enable annotations)
@Retention(RetentionPolicy.CLASS)

/srv/gump/public/workspace/jakarta-bcel/src/test/java/org/apache/bcel/data/SimpleAnnotatedClass.java:[3,1] annotations are not supported in -source 1.4
(try -source 1.5 to enable annotations)
@SimpleAnnotation(id = 4)

/srv/gump/public/workspace/jakarta-bcel/src/test/java/org/apache/bcel/data/MarkerAnnotation.java:[5,1] annotations are not supported in -source 1.4
(try -source 1.5 to enable annotations)
@Retention(RetentionPolicy.RUNTIME)

/srv/gump/public/workspace/jakarta-bcel/src/test/java/org/apache/bcel/data/SimpleAnnotation.java:[5,1] annotations are not supported in -source 1.4
(try -source 1.5 to enable annotations)
@Retention(RetentionPolicy.RUNTIME)

/srv/gump/public/workspace/jakarta-bcel/src/test/java/org/apache/bcel/data/ComplexAnnotatedClass.java:[3,1] annotations are not supported in -source 1.4
(try -source 1.5 to enable annotations)
@ComplexAnnotation(ival = 4, bval = 2, cval = '5', fval = 3.0f, dval = 33.4, zval = false, jval = 56, sval = 99)

/srv/gump/public/workspace/jakarta-bcel/src/test/java/org/apache/bcel/data/AnnotatedFields.java:[4,3] annotations are not supported in -source 1.4
(try -source 1.5 to enable annotations)
  @SimpleAnnotation(id=1) int i;

/srv/gump/public/workspace/jakarta-bcel/src/test/java/org/apache/bcel/InstructionFinderTestCase.java:[20,30] for-each loops are not supported in -source 1.4
(try -source 1.5 to enable for-each loops)
		for (Method m : methods)

/srv/gump/public/workspace/jakarta-bcel/src/test/java/org/apache/bcel/data/MarkedType.java:[3,1] annotations are not supported in -source 1.4
(try -source 1.5 to enable annotations)
@MarkerAnnotationInvisible

/srv/gump/public/workspace/jakarta-bcel/src/test/java/org/apache/bcel/data/AnnotationEnumElement.java:[6,1] annotations are not supported in -source 1.4
(try -source 1.5 to enable annotations)
@Retention(RetentionPolicy.RUNTIME)


[INFO] ------------------------------------------------------------------------
[INFO] For more information, run Maven with the -e switch
[INFO] ------------------------------------------------------------------------
[INFO] Total time: 10 seconds
[INFO] Finished at: Thu Jan 24 00:44:40 GMT-08:00 2008
[INFO] Final Memory: 4M/30M
[INFO] ------------------------------------------------------------------------
---------------------------------------------

To subscribe to this information via syndicated feeds:
- RSS: http://vmgump.apache.org/gump/public/jakarta-bcel/bcel/rss.xml
- Atom: http://vmgump.apache.org/gump/public/jakarta-bcel/bcel/atom.xml

============================== Gump Tracking Only ===
Produced by Gump version 2.3.
Gump Run 15000024012008, vmgump:vmgump-public:15000024012008
Gump E-mail Identifier (unique within run) #2.

*********************************************************** G U M P
[GUMP@vmgump]: Project gsbase-test (in module gsbase) failed
To whom it may engage...
        
This is an automated request, but not an unsolicited one. For 
more information please visit http://gump.apache.org/nagged.html, 
and/or contact the folk at general@gump.apache.org.

Project gsbase-test has an issue affecting its community integration.
This issue affects 1 projects,
 and has been outstanding for 114 runs.
The current state of this project is 'Failed', with reason 'Build Failed'.
For reference only, the following projects are affected by this:
    - gsbase-test :  A collection of java utility classes


Full details are available at:
    http://vmgump.apache.org/gump/public/gsbase/gsbase-test/index.html

That said, some information snippets are provided here.

The following annotations (debug/informational/warning/error messages) were provided:
 -WARNING- Overriding Maven properties: [/srv/gump/public/workspace/gsbase/build.properties]
 -DEBUG- (Gump generated) Maven Properties in: /srv/gump/public/workspace/gsbase/build.properties
 -INFO- Failed with reason build failed
 -DEBUG- Maven POM in: /srv/gump/public/workspace/gsbase/project.xml
 -DEBUG- Maven project properties in: /srv/gump/public/workspace/gsbase/project.properties



The following work was performed:
http://vmgump.apache.org/gump/public/gsbase/gsbase-test/gump_work/build_gsbase_gsbase-test.html
Work Name: build_gsbase_gsbase-test (Type: Build)
Work ended in a state of : Failed
Elapsed: 1 min 18 secs
Command Line: maven --offline jar 
[Working Directory: /srv/gump/public/workspace/gsbase]
CLASSPATH: /usr/lib/jvm/java-1.5.0-sun/lib/tools.jar:/srv/gump/public/workspace/gsbase/target/classes:/srv/gump/public/workspace/junit/dist/junit-24012008.jar:/srv/gump/packages/junitperf-1.8/lib/junitperf.jar
---------------------------------------------
    [junit] Running com.gargoylesoftware.base.testing.EqualsTesterTest
    [junit] Tests run: 6, Failures: 0, Errors: 0, Time elapsed: 0.414 sec
    [junit] Testsuite: com.gargoylesoftware.base.testing.EqualsTesterTest
    [junit] Tests run: 6, Failures: 0, Errors: 0, Time elapsed: 0.414 sec
    [junit] 
    [junit] Running com.gargoylesoftware.base.collections.NotificationListTest
    [junit] Tests run: 9, Failures: 0, Errors: 0, Time elapsed: 0.389 sec
    [junit] Testsuite: com.gargoylesoftware.base.collections.NotificationListTest
    [junit] Tests run: 9, Failures: 0, Errors: 0, Time elapsed: 0.389 sec
    [junit] 
    [junit] Running com.gargoylesoftware.base.objectstore.DispatchingObjectStoreTest
    [junit] Tests run: 4, Failures: 0, Errors: 0, Time elapsed: 0.375 sec
    [junit] Testsuite: com.gargoylesoftware.base.objectstore.DispatchingObjectStoreTest
    [junit] Tests run: 4, Failures: 0, Errors: 0, Time elapsed: 0.375 sec
    [junit] 
    [junit] Running com.gargoylesoftware.base.objectstore.ObjectStoreExceptionTest
    [junit] Tests run: 3, Failures: 0, Errors: 0, Time elapsed: 0.505 sec
    [junit] Testsuite: com.gargoylesoftware.base.objectstore.ObjectStoreExceptionTest
    [junit] Tests run: 3, Failures: 0, Errors: 0, Time elapsed: 0.505 sec
    [junit] 
    [junit] Running com.gargoylesoftware.base.objectstore.ObjectStoreTest
    [junit] Tests run: 9, Failures: 0, Errors: 0, Time elapsed: 0.434 sec
    [junit] Testsuite: com.gargoylesoftware.base.objectstore.ObjectStoreTest
    [junit] Tests run: 9, Failures: 0, Errors: 0, Time elapsed: 0.434 sec
    [junit] 
    [junit] Running com.gargoylesoftware.base.objectstore.ReflectedObjectStoreTest
    [junit] Tests run: 5, Failures: 0, Errors: 0, Time elapsed: 0.321 sec
    [junit] Testsuite: com.gargoylesoftware.base.objectstore.ReflectedObjectStoreTest
    [junit] Tests run: 5, Failures: 0, Errors: 0, Time elapsed: 0.321 sec
    [junit] 
    [junit] Running com.gargoylesoftware.base.objectstore.ObjectStoreCommandNotSupportedExceptionTest
    [junit] Tests run: 2, Failures: 0, Errors: 0, Time elapsed: 0.312 sec
    [junit] Testsuite: com.gargoylesoftware.base.objectstore.ObjectStoreCommandNotSupportedExceptionTest
    [junit] Tests run: 2, Failures: 0, Errors: 0, Time elapsed: 0.312 sec
    [junit] 
    [junit] Running com.gargoylesoftware.base.objectstore.ObjectStoreCommandTest
    [junit] Tests run: 1, Failures: 0, Errors: 0, Time elapsed: 0.401 sec
    [junit] Testsuite: com.gargoylesoftware.base.objectstore.ObjectStoreCommandTest
    [junit] Tests run: 1, Failures: 0, Errors: 0, Time elapsed: 0.401 sec
    [junit] 

BUILD FAILED
File...... /home/gump/.maven/cache/maven-test-plugin-1.6.2/plugin.jelly
Element... fail
Line...... 181
Column.... 54
There were test failures.
Total time: 1 minutes 17 seconds
Finished at: Thu Jan 24 00:56:28 GMT-08:00 2008

---------------------------------------------

To subscribe to this information via syndicated feeds:
- RSS: http://vmgump.apache.org/gump/public/gsbase/gsbase-test/rss.xml
- Atom: http://vmgump.apache.org/gump/public/gsbase/gsbase-test/atom.xml

============================== Gump Tracking Only ===
Produced by Gump version 2.3.
Gump Run 15000024012008, vmgump:vmgump-public:15000024012008
Gump E-mail Identifier (unique within run) #3.

*********************************************************** G U M P
[GUMP@vmgump]: Module village failed
To whom it may engage...
        
This is an automated request, but not an unsolicited one. For 
more information please visit http://gump.apache.org/nagged.html, 
and/or contact the folk at general@gump.apache.org.

Module village has an issue affecting its community integration,
 and has been outstanding for 525 runs.
The current state of this module is 'Failed', with reason 'Update Failed'.

Full details are available at:
    http://vmgump.apache.org/gump/public/village/index.html

That said, some information snippets are provided here.

The following annotations (debug/informational/warning/error messages) were provided:
 -INFO- Failed with reason update failed



The following work was performed:
http://vmgump.apache.org/gump/public/village/gump_work/update_village.html
Work Name: update_village (Type: Update)
Work ended in a state of : Failed
Elapsed: 
Command Line: cvs -q -z3 -d :pserver:anoncvs@share.whichever.com:/home/cvspublic checkout -P -d village village 
[Working Directory: /srv/gump/public/workspace/cvs]
---------------------------------------------
cvs [checkout aborted]: connect to share.whichever.com(76.191.185.66):2401 failed: Connection refused
---------------------------------------------

To subscribe to this information via syndicated feeds:
- RSS: http://vmgump.apache.org/gump/public/village/rss.xml
- Atom: http://vmgump.apache.org/gump/public/village/atom.xml

============================== Gump Tracking Only ===
Produced by Gump version 2.3.
Gump Run 15000024012008, vmgump:vmgump-public:15000024012008
Gump E-mail Identifier (unique within run) #5.

*********************************************************** G U M P
[GUMP@vmgump]: Project village (in module village) failed
To whom it may engage...
        
This is an automated request, but not an unsolicited one. For 
more information please visit http://gump.apache.org/nagged.html, 
and/or contact the folk at general@gump.apache.org.

Project village has an issue affecting its community integration,
 and has been outstanding for 525 runs.
The current state of this project is 'Failed', with reason 'Update Failed'.

Full details are available at:
    http://vmgump.apache.org/gump/public/village/village/index.html

That said, some information snippets are provided here.

The following annotations (debug/informational/warning/error messages) were provided:
 -INFO- Failed with reason update failed
 -INFO- Failed to extract fallback artifacts from Gump Repository

To subscribe to this information via syndicated feeds:
- RSS: http://vmgump.apache.org/gump/public/village/village/rss.xml
- Atom: http://vmgump.apache.org/gump/public/village/village/atom.xml

============================== Gump Tracking Only ===
Produced by Gump version 2.3.
Gump Run 15000024012008, vmgump:vmgump-public:15000024012008
Gump E-mail Identifier (unique within run) #6.

*********************************************************** G U M P
[GUMP@vmgump]: Module town failed
To whom it may engage...
        
This is an automated request, but not an unsolicited one. For 
more information please visit http://gump.apache.org/nagged.html, 
and/or contact the folk at general@gump.apache.org.

Module town has an issue affecting its community integration,
 and has been outstanding for 525 runs.
The current state of this module is 'Failed', with reason 'Update Failed'.

Full details are available at:
    http://vmgump.apache.org/gump/public/town/index.html

That said, some information snippets are provided here.

The following annotations (debug/informational/warning/error messages) were provided:
 -INFO- Failed with reason update failed



The following work was performed:
http://vmgump.apache.org/gump/public/town/gump_work/update_town.html
Work Name: update_town (Type: Update)
Work ended in a state of : Failed
Elapsed: 1 sec
Command Line: cvs -q -z3 -d :pserver:anoncvs@share.whichever.com:/home/cvspublic checkout -P -d town town 
[Working Directory: /srv/gump/public/workspace/cvs]
---------------------------------------------
cvs [checkout aborted]: connect to share.whichever.com(76.191.185.66):2401 failed: Connection refused
---------------------------------------------

To subscribe to this information via syndicated feeds:
- RSS: http://vmgump.apache.org/gump/public/town/rss.xml
- Atom: http://vmgump.apache.org/gump/public/town/atom.xml

============================== Gump Tracking Only ===
Produced by Gump version 2.3.
Gump Run 15000024012008, vmgump:vmgump-public:15000024012008
Gump E-mail Identifier (unique within run) #7.

*********************************************************** G U M P
[GUMP@vmgump]: Project rhino (in module rhino) failed
To whom it may engage...
        
This is an automated request, but not an unsolicited one. For 
more information please visit http://gump.apache.org/nagged.html, 
and/or contact the folk at general@gump.apache.org.

Project rhino has an issue affecting its community integration.
This issue affects 2 projects,
 and has been outstanding for 48 runs.
The current state of this project is 'Failed', with reason 'Build Failed'.
For reference only, the following projects are affected by this:
    - httpunit :  framework for unit testing web sites
    - rhino :  JavaScript for Java


Full details are available at:
    http://vmgump.apache.org/gump/public/rhino/rhino/index.html

That said, some information snippets are provided here.

The following annotations (debug/informational/warning/error messages) were provided:
 -DEBUG- Sole output [js.jar] identifier set to project name
 -INFO- Made directory [/srv/gump/public/workspace/rhino/build/classes]
 -INFO- Failed with reason build failed
 -INFO- Failed to extract fallback artifacts from Gump Repository



The following work was performed:
http://vmgump.apache.org/gump/public/rhino/rhino/gump_work/build_rhino_rhino.html
Work Name: build_rhino_rhino (Type: Build)
Work ended in a state of : Failed
Elapsed: 19 secs
Command Line: /usr/lib/jvm/java-1.5.0-sun/bin/java -Djava.awt.headless=true -Dant.build.clonevm=true -Xbootclasspath/p:/srv/gump/public/workspace/xml-commons/java/external/build/xml-apis.jar:/srv/gump/public/workspace/xml-xerces2/build/xercesImpl.jar org.apache.tools.ant.Main -Dgump.merge=/srv/gump/public/gump/work/merge.xml -Dbuild.sysclasspath=only -Dversion=_24012008 dist 
[Working Directory: /srv/gump/public/workspace/rhino]
CLASSPATH: /usr/lib/jvm/java-1.5.0-sun/lib/tools.jar:/srv/gump/public/workspace/rhino/build/classes:/srv/gump/public/workspace/ant/dist/lib/ant-jmf.jar:/srv/gump/public/workspace/ant/dist/lib/ant-swing.jar:/srv/gump/public/workspace/ant/dist/lib/ant-apache-resolver.jar:/srv/gump/public/workspace/ant/dist/lib/ant-trax.jar:/srv/gump/public/workspace/ant/dist/lib/ant-junit.jar:/srv/gump/public/workspace/ant/dist/lib/ant-launcher.jar:/srv/gump/public/workspace/ant/dist/lib/ant-nodeps.jar:/srv/gump/public/workspace/ant/dist/lib/ant.jar:/srv/gump/packages/junit3.8.1/junit.jar:/srv/gump/public/workspace/xml-commons/java/build/resolver.jar:/srv/gump/public/workspace/xml-xmlbeans/build/lib/xbean_xpath.jar:/srv/gump/public/workspace/xml-xmlbeans/build/lib/xmlpublic.jar:/srv/gump/public/workspace/xml-xmlbeans/build/lib/xbean.jar:/srv/gump/public/workspace/xml-commons/java/external/build/xml-apis-ext.jar
---------------------------------------------
    [javac]                                  ^
    [javac] Note: Some input files use unchecked or unsafe operations.
    [javac] Note: Recompile with -Xlint:unchecked for details.
    [javac] 31 warnings

no-e4x-compile:

old-e4x:

xmlbeans-unzip:

xmlbeans-get:
    [mkdir] Created dir: /srv/gump/public/workspace/rhino/build/tmp-xbean
      [get] Getting: http://www.apache.org/dist/xmlbeans/binaries/xmlbeans-2.2.0.zip
      [get] To: /srv/gump/public/workspace/rhino/build/tmp-xbean/xbean.zip
    [unzip] Expanding: /srv/gump/public/workspace/rhino/build/tmp-xbean/xbean.zip into /srv/gump/public/workspace/rhino/build/tmp-xbean
     [copy] Copying 1 file to /srv/gump/public/workspace/rhino/lib
     [copy] Copying 1 file to /srv/gump/public/workspace/rhino/lib
   [delete] Deleting directory /srv/gump/public/workspace/rhino/build/tmp-xbean

old-e4x-compile:
     [echo] Compiling XMLBeans E4X implementation using ./lib/xbean.jar and ./lib/jsr173_1.0_api.jar
    [javac] Compiling 11 source files to /srv/gump/public/workspace/rhino/build/classes
    [javac] Note: Some input files use unchecked or unsafe operations.
    [javac] Note: Recompile with -Xlint:unchecked for details.

no-old-e4x-compile:

compile-all:

compile:
    [javac] Compiling 3 source files to /srv/gump/public/workspace/rhino/build/classes

jar:
      [jar] Building jar: /srv/gump/public/workspace/rhino/build/rhino_24012008/js.jar

retrotranslator-check:

retrotranslator-download:
    [mkdir] Created dir: /srv/gump/public/workspace/rhino/build/download
      [get] Getting: http://downloads.sourceforge.net/retrotranslator/Retrotranslator-1.2.3-bin.zip
      [get] To: /srv/gump/public/workspace/rhino/build/download/Retrotranslator-1.2.3-bin.zip
    [unzip] Expanding: /srv/gump/public/workspace/rhino/build/download/Retrotranslator-1.2.3-bin.zip into /srv/gump/public/workspace/rhino/build/download

retrotranslator:

BUILD FAILED
/srv/gump/public/workspace/rhino/build.xml:118: taskdef class net.sf.retrotranslator.transformer.RetrotranslatorTask cannot be found

Total time: 18 seconds
---------------------------------------------

To subscribe to this information via syndicated feeds:
- RSS: http://vmgump.apache.org/gump/public/rhino/rhino/rss.xml
- Atom: http://vmgump.apache.org/gump/public/rhino/rhino/atom.xml

============================== Gump Tracking Only ===
Produced by Gump version 2.3.
Gump Run 15000024012008, vmgump:vmgump-public:15000024012008
Gump E-mail Identifier (unique within run) #9.

*********************************************************** G U M P
[GUMP@vmgump]: Project emma (in module emma) failed
To whom it may engage...
        
This is an automated request, but not an unsolicited one. For 
more information please visit http://gump.apache.org/nagged.html, 
and/or contact the folk at general@gump.apache.org.

Project emma has an issue affecting its community integration.
This issue affects 1 projects,
 and has been outstanding for 634 runs.
The current state of this project is 'Failed', with reason 'Build Failed'.
For reference only, the following projects are affected by this:
    - emma :  code coverage tool


Full details are available at:
    http://vmgump.apache.org/gump/public/emma/emma/index.html

That said, some information snippets are provided here.

The following annotations (debug/informational/warning/error messages) were provided:
 -INFO- Failed with reason build failed
 -INFO- Failed to extract fallback artifacts from Gump Repository



The following work was performed:
http://vmgump.apache.org/gump/public/emma/emma/gump_work/build_emma_emma.html
Work Name: build_emma_emma (Type: Build)
Work ended in a state of : Failed
Elapsed: 7 secs
Command Line: /usr/lib/jvm/java-1.5.0-sun/bin/java -Djava.awt.headless=true -Xbootclasspath/p:/srv/gump/public/workspace/xml-commons/java/external/build/xml-apis.jar:/srv/gump/public/workspace/xml-xerces2/build/xercesImpl.jar org.apache.tools.ant.Main -Dgump.merge=/srv/gump/public/gump/work/merge.xml -Dbuild.sysclasspath=only -Dapp.short.name=emma-24012008 
[Working Directory: /srv/gump/public/workspace/emma]
CLASSPATH: /usr/lib/jvm/java-1.5.0-sun/lib/tools.jar:/srv/gump/public/workspace/emma/out/core/classes:/srv/gump/public/workspace/emma/out/ant/classes:/srv/gump/public/workspace/emma/lib/internal/stamptool.jar:/srv/gump/public/workspace/ant/dist/lib/ant-jmf.jar:/srv/gump/public/workspace/ant/dist/lib/ant-swing.jar:/srv/gump/public/workspace/ant/dist/lib/ant-apache-resolver.jar:/srv/gump/public/workspace/ant/dist/lib/ant-trax.jar:/srv/gump/public/workspace/ant/dist/lib/ant-junit.jar:/srv/gump/public/workspace/ant/dist/lib/ant-launcher.jar:/srv/gump/public/workspace/ant/dist/lib/ant-nodeps.jar:/srv/gump/public/workspace/ant/dist/lib/ant.jar:/srv/gump/public/workspace/xml-commons/java/external/build/xml-apis-ext.jar
---------------------------------------------
     [copy] Copying 1 file to /srv/gump/public/workspace/emma/out/temp

timestamp:

-pre-compile:

core.bootstrap.compile:
    [javac] Compiling 2 source files to /srv/gump/public/workspace/emma/out/core/classes
    [javac] 
    [javac]           WARNING
    [javac] 
    [javac] The -source switch defaults to 1.5 in JDK 1.5 and 1.6.
    [javac] If you specify -target 1.2 you now must also specify -source 1.2.
    [javac] Ant will implicitly add -source 1.2 for you.  Please change your build file.

core.java14.compile:
    [javac] Compiling 1 source file to /srv/gump/public/workspace/emma/out/core/classes
    [javac] 
    [javac]           WARNING
    [javac] 
    [javac] The -source switch defaults to 1.5 in JDK 1.5 and 1.6.
    [javac] If you specify -target 1.2 you now must also specify -source 1.2.
    [javac] Ant will implicitly add -source 1.2 for you.  Please change your build file.

core.java13.compile:
    [javac] Compiling 1 source file to /srv/gump/public/workspace/emma/out/core/classes
    [javac] 
    [javac]           WARNING
    [javac] 
    [javac] The -source switch defaults to 1.5 in JDK 1.5 and 1.6.
    [javac] If you specify -target 1.2 you now must also specify -source 1.2.
    [javac] Ant will implicitly add -source 1.2 for you.  Please change your build file.

core.compile:
    [javac] Compiling 175 source files to /srv/gump/public/workspace/emma/out/core/classes
    [javac] 
    [javac]           WARNING
    [javac] 
    [javac] The -source switch defaults to 1.5 in JDK 1.5 and 1.6.
    [javac] If you specify -target 1.2 you now must also specify -source 1.2.
    [javac] Ant will implicitly add -source 1.2 for you.  Please change your build file.
    [javac] /srv/gump/public/workspace/emma/core/java12/com/vladium/emma/run/InstrClassLoader.java:346: reference to CodeSource is ambiguous, both method CodeSource(java.net.URL,java.security.cert.Certificate[]) in java.security.CodeSource and method CodeSource(java.net.URL,java.security.CodeSigner[]) in java.security.CodeSource match
    [javac]         final CodeSource csrc = new CodeSource (srcURL, null);
    [javac]                                 ^
    [javac] 1 error

BUILD FAILED
/srv/gump/public/workspace/emma/build.xml:297: Compile failed; see the compiler error output for details.

Total time: 6 seconds
---------------------------------------------

To subscribe to this information via syndicated feeds:
- RSS: http://vmgump.apache.org/gump/public/emma/emma/rss.xml
- Atom: http://vmgump.apache.org/gump/public/emma/emma/atom.xml

============================== Gump Tracking Only ===
Produced by Gump version 2.3.
Gump Run 15000024012008, vmgump:vmgump-public:15000024012008
Gump E-mail Identifier (unique within run) #13.

*********************************************************** G U M P
[GUMP@vmgump]: Project hivemind-compile (in module hivemind) failed
To whom it may engage...
        
This is an automated request, but not an unsolicited one. For 
more information please visit http://gump.apache.org/nagged.html, 
and/or contact the folk at general@gump.apache.org.

Project hivemind-compile has an issue affecting its community integration.
This issue affects 5 projects,
 and has been outstanding for 19 runs.
The current state of this project is 'Failed', with reason 'Build Failed'.
For reference only, the following projects are affected by this:
    - hivemind :  HiveMind is a services and configuration
    microkernel
    - hivemind-compile :  HiveMind is a services and configuration
    microkernel
    - hivemind-library :  HiveMind is a services and configuration
    microkernel
    - jakarta-lucene :  Java Based Search Engine
    - lucene-java :  Java Based Search Engine


Full details are available at:
    http://vmgump.apache.org/gump/public/hivemind/hivemind-compile/index.html

That said, some information snippets are provided here.

The following annotations (debug/informational/warning/error messages) were provided:
 -INFO- Failed with reason build failed



The following work was performed:
http://vmgump.apache.org/gump/public/hivemind/hivemind-compile/gump_work/build_hivemind_hivemind-compile.html
Work Name: build_hivemind_hivemind-compile (Type: Build)
Work ended in a state of : Failed
Elapsed: 1 sec
Command Line: /usr/lib/jvm/java-1.5.0-sun/bin/java -Djava.awt.headless=true -Xbootclasspath/p:/srv/gump/public/workspace/xml-commons/java/external/build/xml-apis.jar:/srv/gump/public/workspace/xml-xerces2/build/xercesImpl.jar org.apache.tools.ant.Main -Dgump.merge=/srv/gump/public/gump/work/merge.xml -Dbuild.sysclasspath=only -Ddownload-warning-marker-displayed=true -Dtest.classes.dir=target/test-classes -Djunit-available=true -Djavacc.home=/srv/gump/packages/javacc-3.1 -Djava.classes.dir=target/classes compile-tests 
[Working Directory: /srv/gump/public/workspace/hivemind/framework]
CLASSPATH: /usr/lib/jvm/java-1.5.0-sun/lib/tools.jar:/srv/gump/public/workspace/hivemind/hivemind/target/classes:/srv/gump/public/workspace/hivemind/hivebuild/target/classes:/srv/gump/public/workspace/hivemind/framework/target/classes:/srv/gump/public/workspace/ant/dist/lib/ant-jmf.jar:/srv/gump/public/workspace/ant/dist/lib/ant-swing.jar:/srv/gump/public/workspace/ant/dist/lib/ant-apache-resolver.jar:/srv/gump/public/workspace/ant/dist/lib/ant-trax.jar:/srv/gump/public/workspace/ant/dist/lib/ant-junit.jar:/srv/gump/public/workspace/ant/dist/lib/ant-launcher.jar:/srv/gump/public/workspace/ant/dist/lib/ant-nodeps.jar:/srv/gump/public/workspace/ant/dist/lib/ant.jar:/srv/gump/public/workspace/apache-commons/logging/target/commons-logging-24012008.jar:/srv/gump/public/workspace/apache-commons/logging/target/commons-logging-api-24012008.jar:/srv/gump/packages/easymock1.2_Java1.3/easymock.jar:/srv/gump/packages/easymockclassextension1.2/easymockclassextension.jar:/srv/gump/public/w
 orkspace/jakarta-oro/jakarta-oro-24012008.jar:/srv/gump/public/workspace/jakarta-servletapi-4/lib/servlet.jar:/srv/gump/public/workspace/javassist/javassist.jar:/srv/gump/public/workspace/junit/dist/junit-24012008.jar:/srv/gump/public/workspace/logging-log4j-12/dist/lib/log4j-24012008.jar:/srv/gump/public/workspace/xml-commons/java/external/build/xml-apis-ext.jar
---------------------------------------------
Buildfile: build.xml does not exist!
Build failed
---------------------------------------------

To subscribe to this information via syndicated feeds:
- RSS: http://vmgump.apache.org/gump/public/hivemind/hivemind-compile/rss.xml
- Atom: http://vmgump.apache.org/gump/public/hivemind/hivemind-compile/atom.xml

============================== Gump Tracking Only ===
Produced by Gump version 2.3.
Gump Run 15000024012008, vmgump:vmgump-public:15000024012008
Gump E-mail Identifier (unique within run) #14.

*********************************************************** G U M P
[GUMP@vmgump]: Project jmock2 (in module jmock2) failed
To whom it may engage...
        
This is an automated request, but not an unsolicited one. For 
more information please visit http://gump.apache.org/nagged.html, 
and/or contact the folk at general@gump.apache.org.

Project jmock2 has an issue affecting its community integration.
This issue affects 1 projects,
 and has been outstanding for 114 runs.
The current state of this project is 'Failed', with reason 'Build Failed'.
For reference only, the following projects are affected by this:
    - jmock2 :  jMock is a library for testing Java code using mock objects.


Full details are available at:
    http://vmgump.apache.org/gump/public/jmock2/jmock2/index.html

That said, some information snippets are provided here.

The following annotations (debug/informational/warning/error messages) were provided:
 -INFO- Failed with reason build failed
 -INFO- Failed to extract fallback artifacts from Gump Repository



The following work was performed:
http://vmgump.apache.org/gump/public/jmock2/jmock2/gump_work/build_jmock2_jmock2.html
Work Name: build_jmock2_jmock2 (Type: Build)
Work ended in a state of : Failed
Elapsed: 5 secs
Command Line: /usr/lib/jvm/java-1.5.0-sun/bin/java -Djava.awt.headless=true -Xbootclasspath/p:/srv/gump/public/workspace/xml-xerces2/build/xercesImpl.jar:/srv/gump/public/workspace/xml-commons/java/external/build/xml-apis.jar org.apache.tools.ant.Main -Dgump.merge=/srv/gump/public/gump/work/merge.xml -Dbuild.sysclasspath=only -Dversion=24012008 
[Working Directory: /srv/gump/public/workspace/jmock2]
CLASSPATH: /usr/lib/jvm/java-1.5.0-sun/lib/tools.jar:/srv/gump/public/workspace/jmock2/build/classes:/srv/gump/public/workspace/jmock2/lib/hamcrest-api-1.0.jar:/srv/gump/public/workspace/jmock2/lib/hamcrest-library-1.0.jar:/srv/gump/public/workspace/jmock2/lib/objenesis-1.0.jar:/srv/gump/public/workspace/ant/dist/lib/ant-jmf.jar:/srv/gump/public/workspace/ant/dist/lib/ant-swing.jar:/srv/gump/public/workspace/ant/dist/lib/ant-apache-resolver.jar:/srv/gump/public/workspace/ant/dist/lib/ant-trax.jar:/srv/gump/public/workspace/ant/dist/lib/ant-junit.jar:/srv/gump/public/workspace/ant/dist/lib/ant-launcher.jar:/srv/gump/public/workspace/ant/dist/lib/ant-nodeps.jar:/srv/gump/public/workspace/ant/dist/lib/ant.jar:/srv/gump/packages/cglib/cglib-nodep-2.1_3.jar:/srv/gump/public/workspace/junit/dist/junit-24012008.jar:/srv/gump/packages/junit3.8.1/junit.jar:/srv/gump/public/workspace/xml-commons/java/external/build/xml-apis-ext.jar
---------------------------------------------
    [javac]             exactly(1).of (anything()).method(withName("m")).with(greaterThan(0));
    [javac]                                                                   ^
    [javac] /srv/gump/public/workspace/jmock2/test/org/jmock/test/acceptance/HamcrestTypeSafetyAcceptanceTests.java:34: incompatible types
    [javac] found   : org.jmock.internal.matcher.MethodNameMatcher
    [javac] required: org.hamcrest.Matcher<java.lang.reflect.Method>
    [javac]         return new MethodNameMatcher(nameRegex);
    [javac]                ^
    [javac] /srv/gump/public/workspace/jmock2/test/org/jmock/test/unit/support/StringContainsInOrder.java:18: method does not override a method from its superclass
    [javac]     @Override
    [javac]      ^
    [javac] /srv/gump/public/workspace/jmock2/test/org/jmock/test/unit/support/StringContainsInOrder.java:39: incompatible types
    [javac] found   : org.jmock.test.unit.support.StringContainsInOrder
    [javac] required: org.hamcrest.Matcher<java.lang.String>
    [javac]         return new StringContainsInOrder(Arrays.asList(substrings));
    [javac]                ^
    [javac] /srv/gump/public/workspace/jmock2/test/org/jmock/test/unit/support/StringContainsInOrder.java:44: incompatible types
    [javac] found   : org.jmock.test.unit.support.StringContainsInOrder
    [javac] required: org.hamcrest.Matcher<java.lang.String>
    [javac]         return new StringContainsInOrder(substrings);
    [javac]                ^
    [javac] /srv/gump/public/workspace/jmock2/test/org/jmock/test/unit/internal/InvocationExpectationTests.java:34: cannot find symbol
    [javac] symbol: method equalTo(T)
    [javac] 				           equalTo(expected).matches(actual));
    [javac]                                            ^
    [javac] /srv/gump/public/workspace/jmock2/test/org/jmock/test/unit/internal/InvocationExpectationTests.java:54: cannot find symbol
    [javac] symbol  : method sameInstance(java.lang.Object)
    [javac] location: class org.jmock.test.unit.internal.InvocationExpectationTests
    [javac] 		expectation.setObjectMatcher(sameInstance(targetObject));
    [javac]                                              ^
    [javac] /srv/gump/public/workspace/jmock2/test/org/jmock/test/unit/internal/InvocationExpectationTests.java:63: cannot find symbol
    [javac] symbol  : method equalTo(java.lang.reflect.Method)
    [javac] location: class org.jmock.test.unit.internal.InvocationExpectationTests
    [javac] 		expectation.setMethodMatcher(equalTo(method));
    [javac]                                              ^
    [javac] /srv/gump/public/workspace/jmock2/test/org/jmock/test/unit/internal/InvocationExpectationTests.java:75: cannot find symbol
    [javac] symbol  : method equalTo(java.lang.Object[])
    [javac] location: class org.jmock.test.unit.internal.InvocationExpectationTests
    [javac] 		expectation.setParametersMatcher(equalTo(args));
    [javac]                                                  ^
    [javac] /srv/gump/public/workspace/jmock2/test/org/jmock/test/unit/lib/script/ScriptedCallbackActionTests.java:78: cannot find symbol
    [javac] symbol  : method sameInstance(java.lang.Exception)
    [javac] location: class org.jmock.test.unit.lib.script.ScriptedCallbackActionTests
    [javac]             assertThat(e, sameInstance(exception));
    [javac]                           ^
    [javac] 53 errors

BUILD FAILED
/srv/gump/public/workspace/jmock2/build.xml:60: Compile failed; see the compiler error output for details.

Total time: 4 seconds
---------------------------------------------

To subscribe to this information via syndicated feeds:
- RSS: http://vmgump.apache.org/gump/public/jmock2/jmock2/rss.xml
- Atom: http://vmgump.apache.org/gump/public/jmock2/jmock2/atom.xml

============================== Gump Tracking Only ===
Produced by Gump version 2.3.
Gump Run 15000024012008, vmgump:vmgump-public:15000024012008
Gump E-mail Identifier (unique within run) #15.

*********************************************************** G U M P
[GUMP@vmgump]: Module beanshell failed
To whom it may engage...
        
This is an automated request, but not an unsolicited one. For 
more information please visit http://gump.apache.org/nagged.html, 
and/or contact the folk at general@gump.apache.org.

Module beanshell has an issue affecting its community integration,
 and has been outstanding for 525 runs.
The current state of this module is 'Failed', with reason 'Update Failed'.

Full details are available at:
    http://vmgump.apache.org/gump/public/beanshell/index.html

That said, some information snippets are provided here.

The following annotations (debug/informational/warning/error messages) were provided:
 -INFO- Failed with reason update failed



The following work was performed:
http://vmgump.apache.org/gump/public/beanshell/gump_work/update_beanshell.html
Work Name: update_beanshell (Type: Update)
Work ended in a state of : Failed
Elapsed: 1 sec
Command Line: svn --quiet checkout svn://svn.ikayzo.org/beanshell/BeanShell --non-interactive beanshell 
[Working Directory: /srv/gump/public/workspace/cvs]
---------------------------------------------
svn: Can't connect to host 'svn.ikayzo.org': Connection refused
---------------------------------------------

To subscribe to this information via syndicated feeds:
- RSS: http://vmgump.apache.org/gump/public/beanshell/rss.xml
- Atom: http://vmgump.apache.org/gump/public/beanshell/atom.xml

============================== Gump Tracking Only ===
Produced by Gump version 2.3.
Gump Run 15000024012008, vmgump:vmgump-public:15000024012008
Gump E-mail Identifier (unique within run) #16.

*********************************************************** G U M P
[GUMP@vmgump]: Project jtidy-cvs (in module jtidy) failed
To whom it may engage...
        
This is an automated request, but not an unsolicited one. For 
more information please visit http://gump.apache.org/nagged.html, 
and/or contact the folk at general@gump.apache.org.

Project jtidy-cvs has an issue affecting its community integration.
This issue affects 1 projects,
 and has been outstanding for 19 runs.
The current state of this project is 'Failed', with reason 'Build Failed'.
For reference only, the following projects are affected by this:
    - jtidy-cvs :  HTML Templates


Full details are available at:
    http://vmgump.apache.org/gump/public/jtidy/jtidy-cvs/index.html

That said, some information snippets are provided here.

The following annotations (debug/informational/warning/error messages) were provided:
 -DEBUG- Sole output [jtidy-24012008.jar] identifier set to project name
 -DEBUG- Dependency on xml-apis exists, no need to add for property maven.jar.dom3-xml-apis.
 -DEBUG- (Gump generated) Maven Properties in: /srv/gump/public/workspace/jtidy/build.properties
 -INFO- Failed with reason build failed
 -DEBUG- Maven POM in: /srv/gump/public/workspace/jtidy/project.xml
 -DEBUG- Maven project properties in: /srv/gump/public/workspace/jtidy/project.properties
 -INFO- Failed to extract fallback artifacts from Gump Repository



The following work was performed:
http://vmgump.apache.org/gump/public/jtidy/jtidy-cvs/gump_work/build_jtidy_jtidy-cvs.html
Work Name: build_jtidy_jtidy-cvs (Type: Build)
Work ended in a state of : Failed
Elapsed: 3 secs
Command Line: maven --offline jar 
[Working Directory: /srv/gump/public/workspace/jtidy]
CLASSPATH: /usr/lib/jvm/java-1.5.0-sun/lib/tools.jar:/srv/gump/public/workspace/ant/dist/lib/ant-jmf.jar:/srv/gump/public/workspace/ant/dist/lib/ant-swing.jar:/srv/gump/public/workspace/ant/dist/lib/ant-apache-resolver.jar:/srv/gump/public/workspace/ant/dist/lib/ant-trax.jar:/srv/gump/public/workspace/ant/dist/lib/ant-junit.jar:/srv/gump/public/workspace/ant/dist/lib/ant-launcher.jar:/srv/gump/public/workspace/ant/dist/lib/ant-nodeps.jar:/srv/gump/public/workspace/ant/dist/lib/ant.jar:/srv/gump/packages/junit3.8.1/junit.jar:/srv/gump/public/workspace/xml-commons/java/build/resolver.jar:/srv/gump/public/workspace/xml-commons/java/external/build/xml-apis-ext.jar:/srv/gump/public/workspace/apache-commons/logging/target/commons-logging-24012008.jar:/srv/gump/public/workspace/apache-commons/logging/target/commons-logging-api-24012008.jar
---------------------------------------------
[MethodExpression] Cannot evaluate expression
java.lang.reflect.InvocationTargetException
	at sun.reflect.NativeMethodAccessorImpl.invoke0(Native Method)
	at sun.reflect.NativeMethodAccessorImpl.invoke(NativeMethodAccessorImpl.java:39)
	at sun.reflect.DelegatingMethodAccessorImpl.invoke(DelegatingMethodAccessorImpl.java:25)
	at java.lang.reflect.Method.invoke(Method.java:585)
	at org.apache.commons.betwixt.expression.MethodExpression.evaluate(MethodExpression.java:96)
	at org.apache.commons.betwixt.io.AbstractBeanWriter.writeContent(AbstractBeanWriter.java:658)
	at org.apache.commons.betwixt.io.AbstractBeanWriter.writeRestOfElement(AbstractBeanWriter.java:539)
	at org.apache.commons.betwixt.io.AbstractBeanWriter.write(AbstractBeanWriter.java:481)
	at org.apache.commons.betwixt.io.AbstractBeanWriter.writeContent(AbstractBeanWriter.java:643)
	at org.apache.commons.betwixt.io.AbstractBeanWriter.writeRestOfElement(AbstractBeanWriter.java:539)
	at org.apache.commons.betwixt.io.AbstractBeanWriter.write(AbstractBeanWriter.java:513)
	at org.apache.commons.betwixt.io.AbstractBeanWriter.write(AbstractBeanWriter.java:233)
	at org.apache.commons.betwixt.io.AbstractBeanWriter.writeContent(AbstractBeanWriter.java:630)
	at org.apache.commons.betwixt.io.AbstractBeanWriter.writeRestOfElement(AbstractBeanWriter.java:539)
	at org.apache.commons.betwixt.io.AbstractBeanWriter.write(AbstractBeanWriter.java:513)
	at org.apache.commons.betwixt.io.AbstractBeanWriter.write(AbstractBeanWriter.java:233)
	at org.apache.commons.betwixt.io.AbstractBeanWriter.write(AbstractBeanWriter.java:162)
	at org.apache.commons.betwixt.io.BeanWriter.write(BeanWriter.java:217)
	at org.apache.maven.MavenUtils.getProjectString(MavenUtils.java:432)
	at org.apache.maven.MavenUtils.getInterpolatedPOM(MavenUtils.java:383)
	at org.apache.maven.MavenUtils.getJellyProject(MavenUtils.java:360)
	at org.apache.maven.MavenUtils.getProject(MavenUtils.java:144)
	at org.apache.maven.MavenUtils.getProject(MavenUtils.java:122)
	at org.apache.maven.MavenSession.initializeRootProject(MavenSession.java:232)
	at org.apache.maven.MavenSession.initialize(MavenSession.java:172)
	at org.apache.maven.cli.App.doMain(App.java:475)
	at org.apache.maven.cli.App.main(App.java:1239)
	at sun.reflect.NativeMethodAccessorImpl.invoke0(Native Method)
	at sun.reflect.NativeMethodAccessorImpl.invoke(NativeMethodAccessorImpl.java:39)
	at sun.reflect.DelegatingMethodAccessorImpl.invoke(DelegatingMethodAccessorImpl.java:25)
	at java.lang.reflect.Method.invoke(Method.java:585)
	at com.werken.forehead.Forehead.run(Forehead.java:551)
	at com.werken.forehead.Forehead.main(Forehead.java:581)
Caused by: java.lang.IllegalArgumentException: cvs repository connection string doesn't contain six tokens
	at org.apache.maven.project.Repository.splitSCMConnection(Repository.java:258)
	at org.apache.maven.project.Repository.getScmType(Repository.java:115)
	... 33 more
The build cannot continue because of the following unsatisfied dependencies:

maven-sourceforge-plugin-1.0.jar (try downloading from http://maven-plugins.sourceforge.net)
maven-statcvs-plugin-2.7.jar
maven-findbugs-plugin-0.9.2.jar
maven-xhtml-plugin-1.2.jar (try downloading from http://maven-validator.sourceforge.net)
maven-checkstyle-plugin-2.4.1.jar (try downloading from http://maven.apache.org/reference/plugins/checkstyle)

Total time: 2 seconds
Finished at: Thu Jan 24 02:20:14 GMT-08:00 2008

---------------------------------------------

To subscribe to this information via syndicated feeds:
- RSS: http://vmgump.apache.org/gump/public/jtidy/jtidy-cvs/rss.xml
- Atom: http://vmgump.apache.org/gump/public/jtidy/jtidy-cvs/atom.xml

============================== Gump Tracking Only ===
Produced by Gump version 2.3.
Gump Run 15000024012008, vmgump:vmgump-public:15000024012008
Gump E-mail Identifier (unique within run) #17.

*********************************************************** G U M P
[GUMP@vmgump]: Project nlog4j (in module nlog4j) failed
To whom it may engage...
        
This is an automated request, but not an unsolicited one. For 
more information please visit http://gump.apache.org/nagged.html, 
and/or contact the folk at general@gump.apache.org.

Project nlog4j has an issue affecting its community integration.
This issue affects 1 projects.
The current state of this project is 'Failed', with reason 'Build Failed'.
For reference only, the following projects are affected by this:
    - nlog4j


Full details are available at:
    http://vmgump.apache.org/gump/public/nlog4j/nlog4j/index.html

That said, some information snippets are provided here.

The following annotations (debug/informational/warning/error messages) were provided:
 -DEBUG- Sole output [nlog4j-24012008.jar] identifier set to project name
 -INFO- Failed with reason build failed
 -INFO- Failed to extract fallback artifacts from Gump Repository



The following work was performed:
http://vmgump.apache.org/gump/public/nlog4j/nlog4j/gump_work/build_nlog4j_nlog4j.html
Work Name: build_nlog4j_nlog4j (Type: Build)
Work ended in a state of : Failed
Elapsed: 5 secs
Command Line: /usr/lib/jvm/java-1.5.0-sun/bin/java -Djava.awt.headless=true -Xbootclasspath/p:/srv/gump/public/workspace/xml-commons/java/external/build/xml-apis.jar:/srv/gump/public/workspace/xml-xerces2/build/xercesImpl.jar org.apache.tools.ant.Main -Dgump.merge=/srv/gump/public/gump/work/merge.xml -Dbuild.sysclasspath=only -Dversion=24012008 nlog4j.jar 
[Working Directory: /srv/gump/public/workspace/nlog4j]
CLASSPATH: /usr/lib/jvm/java-1.5.0-sun/lib/tools.jar:/srv/gump/public/workspace/ant/dist/lib/ant-jmf.jar:/srv/gump/public/workspace/ant/dist/lib/ant-swing.jar:/srv/gump/public/workspace/ant/dist/lib/ant-apache-resolver.jar:/srv/gump/public/workspace/ant/dist/lib/ant-trax.jar:/srv/gump/public/workspace/ant/dist/lib/ant-junit.jar:/srv/gump/public/workspace/ant/dist/lib/ant-launcher.jar:/srv/gump/public/workspace/ant/dist/lib/ant-nodeps.jar:/srv/gump/public/workspace/ant/dist/lib/ant.jar:/srv/gump/public/workspace/xml-commons/java/external/build/xml-apis-ext.jar:/srv/gump/packages/jaf-1.1ea/activation.jar:/srv/gump/packages/javamail-1.4/mail.jar:/srv/gump/packages/javamail-1.4/lib/mailapi.jar:/srv/gump/packages/jms1.1/lib/jms.jar:/srv/gump/packages/jmx-1_2_1-bin/lib/jmxri.jar:/srv/gump/packages/jmx-1_2_1-bin/lib/jmxtools.jar:/srv/gump/public/workspace/slf4j/slf4j-jdk14/target/slf4j-jdk14-1.4.4-SNAPSHOT.jar:/srv/gump/public/workspace/slf4j/slf4j-simple/target/slf4j-simple-1.4.4-S
 NAPSHOT.jar:/srv/gump/public/workspace/slf4j/slf4j-nop/target/slf4j-nop-1.4.4-SNAPSHOT.jar:/srv/gump/public/workspace/slf4j/slf4j-api/target/slf4j-api-1.4.4-SNAPSHOT.jar:/srv/gump/public/workspace/slf4j/slf4j-jcl/target/slf4j-jcl-1.4.4-SNAPSHOT.jar
---------------------------------------------
    [javac] /srv/gump/public/workspace/nlog4j/src/java/org/apache/log4j/test/FQCNTest.java:75: warning: [deprecation] DEBUG in org.apache.log4j.Priority has been deprecated
    [javac]     super.log(FQCN, Priority.DEBUG, message + " world.", null);    
    [javac]                             ^
    [javac] /srv/gump/public/workspace/nlog4j/src/java/org/apache/log4j/test/FQCNTest.java:80: warning: [deprecation] DEBUG in org.apache.log4j.Priority has been deprecated
    [javac]     super.log(FQCN, Priority.DEBUG, message, null); 
    [javac]                             ^
    [javac] /srv/gump/public/workspace/nlog4j/src/java/org/apache/log4j/test/PatternTest.java:58: warning: [deprecation] FATAL in org.apache.log4j.Priority has been deprecated
    [javac]     CAT.log(Priority.FATAL, "Message " + ++i);
    [javac]                     ^
    [javac] /srv/gump/public/workspace/nlog4j/src/java/org/apache/log4j/test/PatternTest.java:59: warning: [deprecation] FATAL in org.apache.log4j.Priority has been deprecated
    [javac]     root.log(Priority.FATAL, "Message " + i);    
    [javac]                      ^
    [javac] /srv/gump/public/workspace/nlog4j/src/java/org/apache/log4j/test/PatternTest.java:74: warning: [deprecation] FATAL in org.apache.log4j.Priority has been deprecated
    [javac]     CAT.log(Priority.FATAL, "Message " + ++i, e);
    [javac]                     ^
    [javac] /srv/gump/public/workspace/nlog4j/src/java/org/apache/log4j/test/PatternTest.java:75: warning: [deprecation] FATAL in org.apache.log4j.Priority has been deprecated
    [javac]     root.log(Priority.FATAL, "Message " + i, e);    
    [javac]                      ^
    [javac] /srv/gump/public/workspace/nlog4j/src/java/org/apache/log4j/varia/FallbackErrorHandler.java:51: addElement(java.lang.Object) in java.util.Vector cannot be applied to (org.apache.log4j.Logger)
    [javac]     loggers.addElement(logger);
    [javac]            ^
    [javac] /srv/gump/public/workspace/nlog4j/src/java/org/apache/log4j/varia/FallbackErrorHandler.java:80: inconvertible types
    [javac] found   : java.lang.Object
    [javac] required: org.apache.log4j.Logger
    [javac]       Logger l = (Logger) loggers.elementAt(i);
    [javac]                                            ^
    [javac] /srv/gump/public/workspace/nlog4j/src/java/org/slf4j/impl/NLOG4JLoggerFactory.java:43: incompatible types
    [javac] found   : org.apache.log4j.Logger
    [javac] required: org.slf4j.Logger
    [javac]     return LogManager.getLogger(name);  
    [javac]                                ^
    [javac] /srv/gump/public/workspace/nlog4j/src/java/org/apache/log4j/xml/DOMConfigurator.java:334: inconvertible types
    [javac] found   : java.lang.Object
    [javac] required: org.apache.log4j.Logger
    [javac] 	 cat = (Logger) getInstanceMethod.invoke(null, new Object[] {catName});
    [javac]                                                 ^
    [javac] /srv/gump/public/workspace/nlog4j/src/java/org/apache/log4j/xml/DOMConfigurator.java:413: cannot find symbol
    [javac] symbol  : constructor PropertySetter(org.apache.log4j.Logger)
    [javac] location: class org.apache.log4j.config.PropertySetter
    [javac]     PropertySetter propSetter = new PropertySetter(cat);
    [javac]                                 ^
    [javac] Note: Some input files use unchecked or unsafe operations.
    [javac] Note: Recompile with -Xlint:unchecked for details.
    [javac] 41 errors
    [javac] 15 warnings

BUILD FAILED
/srv/gump/public/workspace/nlog4j/build.xml:195: Compile failed; see the compiler error output for details.

Total time: 5 seconds
---------------------------------------------

To subscribe to this information via syndicated feeds:
- RSS: http://vmgump.apache.org/gump/public/nlog4j/nlog4j/rss.xml
- Atom: http://vmgump.apache.org/gump/public/nlog4j/nlog4j/atom.xml

============================== Gump Tracking Only ===
Produced by Gump version 2.3.
Gump Run 15000024012008, vmgump:vmgump-public:15000024012008
Gump E-mail Identifier (unique within run) #18.

*********************************************************** G U M P
[GUMP@vmgump]: Project asn1-codec (in module asn1) failed
To whom it may engage...
        
This is an automated request, but not an unsolicited one. For 
more information please visit http://gump.apache.org/nagged.html, 
and/or contact the folk at general@gump.apache.org.

Project asn1-codec has an issue affecting its community integration.
This issue affects 9 projects.
The current state of this project is 'Failed', with reason 'Build Failed'.
For reference only, the following projects are affected by this:
    - apache-ldapber-provider :  Apache Directory Project
    - apacheds-shared :  Apache Directory Server
    - asn1-ber :  Apache ASN.1 Tools
    - asn1-codec :  Apache ASN.1 Tools
    - kerberos-common :  Apache Directory Project
    - kerberos-protocol :  Apache Kerberos Server
    - ldap-common :  Apache Directory Project
    - ldap-protocol :  Apache Directory Server
    - ldap-snacc-provider :  Apache Directory Project


Full details are available at:
    http://vmgump.apache.org/gump/public/asn1/asn1-codec/index.html

That said, some information snippets are provided here.

The following annotations (debug/informational/warning/error messages) were provided:
 -DEBUG- Sole output [asn1-codec-24012008.jar] identifier set to project name
 -INFO- Making directory for Maven properties: [/srv/gump/public/workspace/asn1/codec]
 -DEBUG- (Gump generated) Maven Properties in: /srv/gump/public/workspace/asn1/codec/build.properties
 -INFO- Failed with reason build failed
 -INFO- Project Reports in: /srv/gump/public/workspace/asn1/codec/target/test-reports
 -INFO- Failed to extract fallback artifacts from Gump Repository



The following work was performed:
http://vmgump.apache.org/gump/public/asn1/asn1-codec/gump_work/build_asn1_asn1-codec.html
Work Name: build_asn1_asn1-codec (Type: Build)
Work ended in a state of : Failed
Elapsed: 4 secs
Command Line: maven --offline jar 
[Working Directory: /srv/gump/public/workspace/asn1/codec]
CLASSPATH: /usr/lib/jvm/java-1.5.0-sun/lib/tools.jar:/srv/gump/public/workspace/junit/dist/junit-24012008.jar:/srv/gump/public/workspace/mina/transport-serial/target/mina-transport-serial-2.0.0-M1-SNAPSHOT.jar:/srv/gump/public/workspace/mina/integration-jmx/target/mina-integration-jmx-2.0.0-M1-SNAPSHOT.jar:/srv/gump/public/workspace/mina/core/target/mina-core-2.0.0-M1-SNAPSHOT.jar:/srv/gump/public/workspace/mina/filter-codec-netty/target/mina-filter-codec-netty-2.0.0-M1-SNAPSHOT.jar:/srv/gump/public/workspace/mina/filter-compression/target/mina-filter-compression-2.0.0-M1-SNAPSHOT.jar
---------------------------------------------
 __  __
|  \/  |__ _Apache__ ___
| |\/| / _` \ V / -_) ' \  ~ intelligent projects ~
|_|  |_\__,_|\_/\___|_||_|  v. 1.0.2

build:start:

java:prepare-filesystem:
    [mkdir] Created dir: /srv/gump/public/workspace/asn1/codec/target/classes

java:compile:
    [echo] Compiling to /srv/gump/public/workspace/asn1/codec/target/classes
    [echo] No java source files to compile.
resources or todir was null

java:jar-resources:

test:prepare-filesystem:
    [mkdir] Created dir: /srv/gump/public/workspace/asn1/codec/target/test-classes
    [mkdir] Created dir: /srv/gump/public/workspace/asn1/codec/target/test-reports

test:test-resources:

test:compile:
    [echo] No test source files to compile.

test:test:
    [echo] No tests to run.

BUILD FAILED
File...... /home/gump/.maven/cache/maven-jar-plugin-1.6.1/plugin.jelly
Element... ant:fail
Line...... 53
Column.... 19
You must define currentVersion in your POM.
Total time: 4 seconds
Finished at: Thu Jan 24 02:35:03 GMT-08:00 2008

---------------------------------------------

To subscribe to this information via syndicated feeds:
- RSS: http://vmgump.apache.org/gump/public/asn1/asn1-codec/rss.xml
- Atom: http://vmgump.apache.org/gump/public/asn1/asn1-codec/atom.xml

============================== Gump Tracking Only ===
Produced by Gump version 2.3.
Gump Run 15000024012008, vmgump:vmgump-public:15000024012008
Gump E-mail Identifier (unique within run) #19.

*********************************************************** G U M P
[GUMP@vmgump]: Module JacORB failed
To whom it may engage...
        
This is an automated request, but not an unsolicited one. For 
more information please visit http://gump.apache.org/nagged.html, 
and/or contact the folk at general@gump.apache.org.

Module JacORB has an issue affecting its community integration,
 and has been outstanding for 18 runs.
The current state of this module is 'Failed', with reason 'Update Failed'.

Full details are available at:
    http://vmgump.apache.org/gump/public/JacORB/index.html

That said, some information snippets are provided here.

The following annotations (debug/informational/warning/error messages) were provided:
 -INFO- Failed with reason update failed



The following work was performed:
http://vmgump.apache.org/gump/public/JacORB/gump_work/update_JacORB.html
Work Name: update_JacORB (Type: Update)
Work ended in a state of : Failed
Elapsed: 3 mins 10 secs
Command Line: cvs -q -z3 -d :pserver:anonymous@www.jacorb.org:/cvsroot/jacorb checkout -P -d JacORB JacORB 
[Working Directory: /srv/gump/public/workspace/cvs]
---------------------------------------------
cvs [checkout aborted]: connect to www.jacorb.org(160.45.117.86):2401 failed: Connection timed out
---------------------------------------------

To subscribe to this information via syndicated feeds:
- RSS: http://vmgump.apache.org/gump/public/JacORB/rss.xml
- Atom: http://vmgump.apache.org/gump/public/JacORB/atom.xml

============================== Gump Tracking Only ===
Produced by Gump version 2.3.
Gump Run 15000024012008, vmgump:vmgump-public:15000024012008
Gump E-mail Identifier (unique within run) #20.

*********************************************************** G U M P
[GUMP@vmgump]: Project JacORB-idllib (in module JacORB) failed
To whom it may engage...
        
This is an automated request, but not an unsolicited one. For 
more information please visit http://gump.apache.org/nagged.html, 
and/or contact the folk at general@gump.apache.org.

Project JacORB-idllib has an issue affecting its community integration,
 and has been outstanding for 19 runs.
The current state of this project is 'Failed', with reason 'Update Failed'.

Full details are available at:
    http://vmgump.apache.org/gump/public/JacORB/JacORB-idllib/index.html

That said, some information snippets are provided here.

The following annotations (debug/informational/warning/error messages) were provided:
 -DEBUG- Sole output [idl.jar] identifier set to project name
 -INFO- Failed with reason update failed
 -INFO- Failed to extract fallback artifacts from Gump Repository

To subscribe to this information via syndicated feeds:
- RSS: http://vmgump.apache.org/gump/public/JacORB/JacORB-idllib/rss.xml
- Atom: http://vmgump.apache.org/gump/public/JacORB/JacORB-idllib/atom.xml

============================== Gump Tracking Only ===
Produced by Gump version 2.3.
Gump Run 15000024012008, vmgump:vmgump-public:15000024012008
Gump E-mail Identifier (unique within run) #21.

*********************************************************** G U M P
[GUMP@vmgump]: Project lenya (in module lenya) failed
To whom it may engage...
        
This is an automated request, but not an unsolicited one. For 
more information please visit http://gump.apache.org/nagged.html, 
and/or contact the folk at general@gump.apache.org.

Project lenya has an issue affecting its community integration.
This issue affects 1 projects,
 and has been outstanding for 1390 runs.
The current state of this project is 'Failed', with reason 'Configuration Failed'.
For reference only, the following projects are affected by this:
    - lenya :  Content Management System


Full details are available at:
    http://vmgump.apache.org/gump/public/lenya/lenya/index.html

That said, some information snippets are provided here.

The following annotations (debug/informational/warning/error messages) were provided:
 -INFO- Failed with reason configuration failed
 -ERROR- Bad Dependency. Project: cocoon : unknown to *this* workspace 
 -ERROR- Bad Dependency. Project: cocoon-block-naming : unknown to *this* workspace 
 -ERROR- Bad Dependency. Project: cocoon-block-html : unknown to *this* workspace 
 -ERROR- Bad Dependency. Project: cocoon-block-lucene : unknown to *this* workspace 
 -ERROR- Bad Dependency. Project: cocoon-block-linkrewriter : unknown to *this* workspace 
 -ERROR- Bad Dependency. Project: cocoon-block-proxy : unknown to *this* workspace 
 -ERROR- Bad Dependency. Project: cocoon-block-forms : unknown to *this* workspace 
 -ERROR- Bad Dependency. Project: cocoon-block-xsp : unknown to *this* workspace 
 -ERROR- Bad Dependency. Project: cocoon-block-session-fw : unknown to *this* workspace 

To subscribe to this information via syndicated feeds:
- RSS: http://vmgump.apache.org/gump/public/lenya/lenya/rss.xml
- Atom: http://vmgump.apache.org/gump/public/lenya/lenya/atom.xml

============================== Gump Tracking Only ===
Produced by Gump version 2.3.
Gump Run 15000024012008, vmgump:vmgump-public:15000024012008
Gump E-mail Identifier (unique within run) #23.

*********************************************************** G U M P
[GUMP@vmgump]: Project asn1-der (in module asn1) failed
To whom it may engage...
        
This is an automated request, but not an unsolicited one. For 
more information please visit http://gump.apache.org/nagged.html, 
and/or contact the folk at general@gump.apache.org.

Project asn1-der has an issue affecting its community integration.
This issue affects 1 projects.
The current state of this project is 'Failed', with reason 'Build Failed'.
For reference only, the following projects are affected by this:
    - asn1-der :  Apache ASN.1 Tools


Full details are available at:
    http://vmgump.apache.org/gump/public/asn1/asn1-der/index.html

That said, some information snippets are provided here.

The following annotations (debug/informational/warning/error messages) were provided:
 -DEBUG- Sole output [asn1-der-24012008.jar] identifier set to project name
 -INFO- Making directory for Maven properties: [/srv/gump/public/workspace/asn1/der]
 -DEBUG- (Gump generated) Maven Properties in: /srv/gump/public/workspace/asn1/der/build.properties
 -INFO- Failed with reason build failed
 -INFO- Project Reports in: /srv/gump/public/workspace/asn1/der/target/test-reports
 -INFO- Failed to extract fallback artifacts from Gump Repository



The following work was performed:
http://vmgump.apache.org/gump/public/asn1/asn1-der/gump_work/build_asn1_asn1-der.html
Work Name: build_asn1_asn1-der (Type: Build)
Work ended in a state of : Failed
Elapsed: 7 secs
Command Line: maven --offline jar 
[Working Directory: /srv/gump/public/workspace/asn1/der]
CLASSPATH: /usr/lib/jvm/java-1.5.0-sun/lib/tools.jar:/srv/gump/public/workspace/junit/dist/junit-24012008.jar:/srv/gump/public/workspace/slf4j/slf4j-simple/target/slf4j-simple-1.4.4-SNAPSHOT.jar:/srv/gump/public/workspace/slf4j/slf4j-api/target/slf4j-api-1.4.4-SNAPSHOT.jar:/srv/gump/packages/maven-site-plugin/maven-site-plugin-1.6.1.jar
---------------------------------------------
 __  __
|  \/  |__ _Apache__ ___
| |\/| / _` \ V / -_) ' \  ~ intelligent projects ~
|_|  |_\__,_|\_/\___|_||_|  v. 1.0.2

build:start:

java:prepare-filesystem:
    [mkdir] Created dir: /srv/gump/public/workspace/asn1/der/target/classes

java:compile:
    [echo] Compiling to /srv/gump/public/workspace/asn1/der/target/classes
    [echo] No java source files to compile.
resources or todir was null

java:jar-resources:

test:prepare-filesystem:
    [mkdir] Created dir: /srv/gump/public/workspace/asn1/der/target/test-classes
    [mkdir] Created dir: /srv/gump/public/workspace/asn1/der/target/test-reports

test:test-resources:

test:compile:
    [echo] No test source files to compile.

test:test:
    [echo] No tests to run.

BUILD FAILED
File...... /home/gump/.maven/cache/maven-jar-plugin-1.6.1/plugin.jelly
Element... ant:fail
Line...... 53
Column.... 19
You must define currentVersion in your POM.
Total time: 6 seconds
Finished at: Thu Jan 24 03:20:50 GMT-08:00 2008

---------------------------------------------

To subscribe to this information via syndicated feeds:
- RSS: http://vmgump.apache.org/gump/public/asn1/asn1-der/rss.xml
- Atom: http://vmgump.apache.org/gump/public/asn1/asn1-der/atom.xml

============================== Gump Tracking Only ===
Produced by Gump version 2.3.
Gump Run 15000024012008, vmgump:vmgump-public:15000024012008
Gump E-mail Identifier (unique within run) #25.


--
Apache Gump
http://gump.apache.org/ [Instance: vmgump]

---------------------------------------------------------------------
To unsubscribe, e-mail: general-unsubscribe@gump.apache.org
For additional commands, e-mail: general-help@gump.apache.org


Mime
View raw message