gump-general mailing list archives

Site index · List index
Message view « Date » · « Thread »
Top « Date » · « Thread »
From g...@vmgump.apache.org
Subject BATCH: All dressed up, with nowhere to go...
Date Sat, 20 Oct 2007 13:28:09 GMT
Dear Gumpmeisters,
            
The following 1 notifys should have been sent

*********************************************************** G U M P
[GUMP@vmgump]: Project mina (in module mina) failed
*********************************************************** G U M P
[GUMP@vmgump]: Project mina (in module mina) failed
To whom it may engage...
        
This is an automated request, but not an unsolicited one. For 
more information please visit http://gump.apache.org/nagged.html, 
and/or contact the folk at general@gump.apache.org.

Project mina has an issue affecting its community integration.
This issue affects 13 projects.
The current state of this project is 'Failed', with reason 'Build Failed'.
For reference only, the following projects are affected by this:
    - apache-ldapber-provider :  Apache Directory Project
    - apacheds-core :  Apache Directory Server
    - apacheds-main :  Apache Directory Server
    - apacheds-shared :  Apache Directory Server
    - asn1-ber :  Apache ASN.1 Tools
    - asn1-codec :  Apache ASN.1 Tools
    - kerberos-common :  Apache Directory Project
    - kerberos-protocol :  Apache Kerberos Server
    - ldap-common :  Apache Directory Project
    - ldap-protocol :  Apache Directory Server
    - ldap-snacc-provider :  Apache Directory Project
    - maven-directory-plugin :  Apache Directory Server
    - mina :  A Multipurpose Infrastrusture for Network Applications


Full details are available at:
    http://vmgump.apache.org/gump/public/mina/mina/index.html

That said, some information snippets are provided here.

The following annotations (debug/informational/warning/error messages) were provided:
 -DEBUG- (Gump generated) Maven Properties in: /srv/gump/public/workspace/mina/profiles.xml
 -INFO- Failed with reason build failed
 -DEBUG- Maven POM in: /srv/gump/public/workspace/mina/pom.xml
 -INFO- Project Reports in: /srv/gump/public/workspace/mina/target/test-reports
 -WARNING- No directory [/srv/gump/public/workspace/mina/target/test-reports]
 -DEBUG- Extracted fallback artifacts from Gump Repository



The following work was performed:
http://vmgump.apache.org/gump/public/mina/mina/gump_work/build_mina_mina.html
Work Name: build_mina_mina (Type: Build)
Work ended in a state of : Failed
Elapsed: 1 min 38 secs
Command Line: mvn package 
[Working Directory: /srv/gump/public/workspace/mina]
CLASSPATH: /usr/lib/jvm/java-1.5.0-sun/lib/tools.jar:/srv/gump/public/workspace/ant/dist/lib/ant-jmf.jar:/srv/gump/public/workspace/ant/dist/lib/ant-swing.jar:/srv/gump/public/workspace/ant/dist/lib/ant-apache-resolver.jar:/srv/gump/public/workspace/ant/dist/lib/ant-trax.jar:/srv/gump/public/workspace/ant/dist/lib/ant-junit.jar:/srv/gump/public/workspace/ant/dist/lib/ant-launcher.jar:/srv/gump/public/workspace/ant/dist/lib/ant-nodeps.jar:/srv/gump/public/workspace/ant/dist/lib/ant.jar:/srv/gump/packages/cglib/cglib-nodep-2.1_3.jar:/srv/gump/public/workspace/apache-commons/net/dist/commons-net-20102007.jar:/srv/gump/packages/easymock1.2_Java1.3/easymock.jar:/srv/gump/packages/easymockclassextension1.2/easymockclassextension.jar:/srv/gump/packages/emma-2.0.5312/lib/emma.jar:/srv/gump/packages/emma-2.0.5312/lib/emma_ant.jar:/srv/gump/public/workspace/junit/dist/junit-20102007.jar:/srv/gump/public/workspace/maven-emma-plugin/target/maven-emma-plugin-20102007.jar:/srv/gump/package
 s/maven-site-plugin/maven-site-plugin-1.6.1.jar:/srv/gump/public/workspace/slf4j/slf4j-simple/target/slf4j-simple-1.4.4-SNAPSHOT.jar:/srv/gump/packages/spring-framework-1.2.6/dist/spring-beans.jar:/srv/gump/packages/spring-framework-1.2.6/dist/spring-core.jar:/srv/gump/packages/jsse1.0.3/lib/jcert.jar:/srv/gump/packages/jsse1.0.3/lib/jnet.jar:/srv/gump/packages/jsse1.0.3/lib/jsse.jar
---------------------------------------------
Using port 1024 for testing.
* Without localAddress
[09:30:39] INFO [org.apache.mina.example.echoserver.ConnectorTest$EchoConnectorHandler.IoSessionLogger]
- [localhost/127.0.0.1:1024] readBuf: HeapBuffer[pos=0 lim=160 cap=1024: 00 01 02 03 04 05
06 07 08 09 0A 0B 0C 0D 0E 0F...]
-------------------------------------------------------------------------------
[09:30:39] INFO [org.apache.mina.example.echoserver.ConnectorTest$EchoConnectorHandler.IoSessionLogger]
- [localhost/127.0.0.1:1024] readBuf: HeapBuffer[pos=0 lim=160 cap=1024: 00 01 02 03 04 05
06 07 08 09 0A 0B 0C 0D 0E 0F...]
-------------------------------------------------------------------------------
[09:30:39] INFO [org.apache.mina.example.echoserver.AbstractTest$1.IoSessionLogger] - [/127.0.0.1:32948]
TLS Reentrance
[09:30:39] INFO [org.apache.mina.example.echoserver.ConnectorTest$EchoConnectorHandler.IoSessionLogger]
- [localhost/127.0.0.1:1024] readBuf: HeapBuffer[pos=0 lim=160 cap=1024: 00 01 02 03 04 05
06 07 08 09 0A 0B 0C 0D 0E 0F...]
* With localAddress
Using port 1024 for testing.
* Without localAddress
[09:30:39] INFO [org.apache.mina.example.echoserver.ConnectorTest$EchoConnectorHandler.IoSessionLogger]
- [localhost/127.0.0.1:1024] readBuf: HeapBuffer[pos=0 lim=160 cap=1024: 00 01 02 03 04 05
06 07 08 09 0A 0B 0C 0D 0E 0F...]
* With localAddress
Tests run: 3, Failures: 0, Errors: 3, Skipped: 0, Time elapsed: 2.37 sec <<< FAILURE!
Running org.apache.mina.example.echoserver.ssl.SslFilterTest
MINA server started.
test-1
test-2
handler: [test-1, test-2]
MINA server started.
test-1
test-2
handler: [test-1, test-2]
Tests run: 2, Failures: 0, Errors: 0, Skipped: 0, Time elapsed: 0.508 sec
Running org.apache.mina.example.echoserver.AcceptorTest
Using port 1024 for testing.
Using port 1024 for testing.
Using port 1024 for testing.
Tests run: 3, Failures: 0, Errors: 0, Skipped: 0, Time elapsed: 2.073 sec

Results :

Tests in error: 
  testTCP(org.apache.mina.example.echoserver.ConnectorTest)
  testTCPWithSSL(org.apache.mina.example.echoserver.ConnectorTest)
  testUDP(org.apache.mina.example.echoserver.ConnectorTest)

Tests run: 8, Failures: 0, Errors: 3, Skipped: 0

[INFO] ------------------------------------------------------------------------
[ERROR] BUILD FAILURE
[INFO] ------------------------------------------------------------------------
[INFO] There are test failures.
[INFO] ------------------------------------------------------------------------
[INFO] For more information, run Maven with the -e switch
[INFO] ------------------------------------------------------------------------
[INFO] Total time: 1 minute 36 seconds
[INFO] Finished at: Sat Oct 20 09:30:42 GMT-08:00 2007
[INFO] Final Memory: 15M/36M
[INFO] ------------------------------------------------------------------------
---------------------------------------------

To subscribe to this information via syndicated feeds:
- RSS: http://vmgump.apache.org/gump/public/mina/mina/rss.xml
- Atom: http://vmgump.apache.org/gump/public/mina/mina/atom.xml

============================== Gump Tracking Only ===
Produced by Gump version 2.3.
Gump Run 17000820102007, vmgump:vmgump-public:17000820102007
Gump E-mail Identifier (unique within run) #1.


--
Apache Gump
http://gump.apache.org/ [Instance: vmgump]

---------------------------------------------------------------------
To unsubscribe, e-mail: general-unsubscribe@gump.apache.org
For additional commands, e-mail: general-help@gump.apache.org


Mime
View raw message