gump-general mailing list archives

Site index · List index
Message view « Date » · « Thread »
Top « Date » · « Thread »
From "Adam R. B. Jack" <aj...@apache.org>
Subject Re: BATCH: All dressed up, with nowhere to go...
Date Thu, 23 Jun 2005 19:43:21 GMT
I also use it as you use it, a sanity check that it ran (and these days -- 
on vmgump -- didn't stall.)

That said, I also often eyeball it for candidates that I can go bug. When
Gump is stable, sending notifications as needed, it annoys me if ASF
projects don't accept notification. I also go and (politely) as other
projects if they'll accept notification. That, I could do that w/ or w/o
this e-mail.

The other one like this (i.e. failed to send, not nowhere to send) is more
interesting, e.g. when the host (vmgump) isn't allowed to relay:

    http://issues.apache.org/jira/browse/INFRA-365

regards,

Adam
----- Original Message ----- 
From: "Leo Simons" <mail@leosimons.com>
To: "Gump code and data" <general@gump.apache.org>
Sent: Thursday, June 23, 2005 1:26 PM
Subject: Re: BATCH: All dressed up, with nowhere to go...


> Hi gang,
>
> Does anyone ever do anything with the content of these messages? I tend to
> use them as a gauge of "gump ran and it sent e-mail", but as the actual
> content I would much rather have something like a list of
> failures/successes, i.e. a condensed version of log.html.
>
> Do you agree? Just planning for the future here...
>
> Cheers,
>
> LSD
>
> On 23-06-2005 12:57, "gump@vmgump.apache.org" <gump@vmgump.apache.org>
> wrote:
>
> > Dear Gumpmeisters,
> >
> > The following 7 notifys should have been sent
> >
> > *********************************************************** G U M P
> > [GUMP@vmgump]: Module castor success, but with warnings.
> > [GUMP@vmgump]: Project nant (in module nant) failed
> > [GUMP@vmgump]: Module jaxen success, but with warnings.
> > [GUMP@vmgump]: Project txt2html-task (in module jakarta-servletapi-5)
success,
> > but with warnings.
> > [GUMP@vmgump]: Project httpunit (in module httpunit) failed
> > [GUMP@vmgump]: Project derby-split-2 (in module db-derby) failed
> > [GUMP@vmgump]: Project jaxen (in module jaxen) failed
> > *********************************************************** G U M P
> > [GUMP@vmgump]: Module castor success, but with warnings.
> > To whom it may engage...
> >
> > This is an automated request, but not an unsolicited one. For
> > more information please visit http://gump.apache.org/nagged.html,
> > and/or contact the folk at general@gump.apache.org.
> >
> > Module castor contains errors.
> > The current state of this module is 'Success'.
> >
> > Full details are available at:
> >     http://vmgump.apache.org/gump/public/castor/index.html
> >
> > That said, some information snippets are provided here.
> >
> > The following annotations (debug/informational/warning/error messages)
were
> > provided:
> >  -ERROR- *** Failed to update from source control. Stale contents ***
> >
> >
> >
> > The following work was performed:
> > http://vmgump.apache.org/gump/public/castor/gump_work/update_castor.html
> > Work Name: update_castor (Type: Update)
> > Work ended in a state of : Failed
> > Elapsed: 11 secs
> > Command Line: cvs -q -z3 -d
:pserver:anon@cvs.castor.codehaus.org:/scm/castor
> > update -P -d -A
> > [Working Directory: /usr/local/gump/public/workspace/cvs/castor]
> > ---------------------------------------------
> > cvs server: failed to create lock directory for
`/scm/castor/castor/lib/tests'
> > (/home/projects/castor/haus.d/lock/cvs/castor/lib/tests/#cvs.lock):
Permission
> > denied
> > cvs server: failed to obtain dir lock in repository
> > `/scm/castor/castor/lib/tests'
> > cvs [server aborted]: read lock failed - giving up
> > ---------------------------------------------
> >
> > To subscribe to this information via syndicated feeds:
> > - RSS: http://vmgump.apache.org/gump/public/castor/rss.xml
> > - Atom: http://vmgump.apache.org/gump/public/castor/atom.xml
> >
> > ============================== Gump Tracking Only ===
> > Produced by Gump version 2.2.
> > Gump Run 23000023062005, vmgump.apache.org:vmgump-public:23000023062005
> > Gump E-mail Identifier (unique within run) #1.
> >
> > *********************************************************** G U M P
> > [GUMP@vmgump]: Project nant (in module nant) failed
> > To whom it may engage...
> >
> > This is an automated request, but not an unsolicited one. For
> > more information please visit http://gump.apache.org/nagged.html,
> > and/or contact the folk at general@gump.apache.org.
> >
> > Project nant has an issue affecting its community integration.
> > This issue affects 1 projects,
> >  and has been outstanding for 46 runs.
> > The current state of this project is 'Failed', with reason 'Build
Failed'.
> > For reference only, the following projects are affected by this:
> >     - nant :  NAnt is a free .NET build tool. In theory it is kind of
like...
> >
> >
> > Full details are available at:
> >     http://vmgump.apache.org/gump/public/nant/nant/index.html
> >
> > That said, some information snippets are provided here.
> >
> > The following annotations (debug/informational/warning/error messages)
were
> > provided:
> >  -INFO- Failed with reason build failed
> >
> >
> >
> > The following work was performed:
> >
http://vmgump.apache.org/gump/public/nant/nant/gump_work/build_nant_nant.html
> > Work Name: build_nant_nant (Type: Build)
> > Work ended in a state of : Failed
> > Elapsed: 2 secs
> > Command Line: make
> > [Working Directory: /usr/local/gump/public/workspace/nant]
> > ---------------------------------------------
> > mkdir -p bootstrap
> > cp -R lib/ bootstrap/lib
> > # Mono loads log4net before privatebinpath is set-up, so we need this in
the
> > same directory
> > # as NAnt.exe
> > cp lib/log4net.dll bootstrap
> > cp src/NAnt.Console/App.config bootstrap/NAnt.exe.config
> >
mcs -target:exe -define:MONO -out:bootstrap/NAnt.exe -r:bootstrap/log4net.dl
l
> > \
> > -recurse:src/NAnt.Console/*.cs src/CommonAssemblyInfo.cs
> > Compilation succeeded
> > resgen  src/NAnt.Core/Resources/Strings.resx
> > bootstrap/NAnt.Core.Resources.Strings.resources
> > make: resgen: Command not found
> > make: *** [bootstrap/NAnt.Core.dll] Error 127
> > ---------------------------------------------
> >
> > To subscribe to this information via syndicated feeds:
> > - RSS: http://vmgump.apache.org/gump/public/nant/nant/rss.xml
> > - Atom: http://vmgump.apache.org/gump/public/nant/nant/atom.xml
> >
> > ============================== Gump Tracking Only ===
> > Produced by Gump version 2.2.
> > Gump Run 23000023062005, vmgump.apache.org:vmgump-public:23000023062005
> > Gump E-mail Identifier (unique within run) #2.
> >
> > *********************************************************** G U M P
> > [GUMP@vmgump]: Module jaxen success, but with warnings.
> > To whom it may engage...
> >
> > This is an automated request, but not an unsolicited one. For
> > more information please visit http://gump.apache.org/nagged.html,
> > and/or contact the folk at general@gump.apache.org.
> >
> > Module jaxen contains errors.
> > The current state of this module is 'Success'.
> >
> > Full details are available at:
> >     http://vmgump.apache.org/gump/public/jaxen/index.html
> >
> > That said, some information snippets are provided here.
> >
> > The following annotations (debug/informational/warning/error messages)
were
> > provided:
> >  -ERROR- *** Failed to update from source control. Stale contents ***
> >
> >
> >
> > The following work was performed:
> > http://vmgump.apache.org/gump/public/jaxen/gump_work/update_jaxen.html
> > Work Name: update_jaxen (Type: Update)
> > Work ended in a state of : Failed
> > Elapsed: 2 secs
> > Command Line: cvs -q -z3 -d
> > :pserver:anonymous@cvs.jaxen.codehaus.org:/scm/jaxen update -P -d -A
> > [Working Directory: /usr/local/gump/public/workspace/cvs/jaxen]
> > ---------------------------------------------
> > cvs server: failed to create lock directory for
> > `/scm/jaxen/jaxen/src/java/main/org/w3c'
> >
(/home/projects/jaxen/haus.d/lock/cvs/jaxen/src/java/main/org/w3c/#cvs.lock)
:
> > Permission denied
> > cvs server: failed to obtain dir lock in repository
> > `/scm/jaxen/jaxen/src/java/main/org/w3c'
> > cvs [server aborted]: read lock failed - giving up
> > ---------------------------------------------
> >
> > To subscribe to this information via syndicated feeds:
> > - RSS: http://vmgump.apache.org/gump/public/jaxen/rss.xml
> > - Atom: http://vmgump.apache.org/gump/public/jaxen/atom.xml
> >
> > ============================== Gump Tracking Only ===
> > Produced by Gump version 2.2.
> > Gump Run 23000023062005, vmgump.apache.org:vmgump-public:23000023062005
> > Gump E-mail Identifier (unique within run) #3.
> >
> > *********************************************************** G U M P
> > [GUMP@vmgump]: Project txt2html-task (in module jakarta-servletapi-5)
success,
> > but with warnings.
> > To whom it may engage...
> >
> > This is an automated request, but not an unsolicited one. For
> > more information please visit http://gump.apache.org/nagged.html,
> > and/or contact the folk at general@gump.apache.org.
> >
> > Project txt2html-task contains errors.
> > The current state of this project is 'Success'.
> >
> > Full details are available at:
> >
> >
http://vmgump.apache.org/gump/public/jakarta-servletapi-5/txt2html-task/index.
> > html
> >
> > That said, some information snippets are provided here.
> >
> > The following annotations (debug/informational/warning/error messages)
were
> > provided:
> >  -DEBUG- Sole output [ant] identifier set to project name
> >  -INFO- Made directory
> > [/usr/local/gump/public/workspace/jakarta-servletapi-5/jsr152/build/ant]
> >  -INFO- No license on redistributable project with outputs.
> >  -ERROR- Failed to publish
> > [/usr/local/gump/public/workspace/jakarta-servletapi-5/jsr152/build/ant]
to
> > repository : [Errno 21] Is a directory
> >
> >
> >
> > The following work was performed:
> >
http://vmgump.apache.org/gump/public/jakarta-servletapi-5/txt2html-task/gump_w
> > ork/build_jakarta-servletapi-5_txt2html-task.html
> > Work Name: build_jakarta-servletapi-5_txt2html-task (Type: Build)
> > Work ended in a state of : Success
> > Elapsed: 2 secs
> > Command Line: java -Djava.awt.headless=true
>
> -Xbootclasspath/p:/usr/local/gump/public/workspace/xml-xerces2/java/build/
xerc
> >
esImpl.jar:/usr/local/gump/public/workspace/xml-commons/java/external/build/
xm
> > l-apis.jar org.apache.tools.ant.Main
>
> -Dgump.merge=/x1/gump/public/gump/work/merge.xml -Dbuild.sysclasspath=only
ant
> > [Working Directory:
> > /usr/local/gump/public/workspace/jakarta-servletapi-5/jsr152]
> > CLASSPATH:
> >
/opt/jdk1.4/lib/tools.jar:/usr/local/gump/public/workspace/jakarta-servletap
i-
> >
5/jsr152/build/ant:/usr/local/gump/public/workspace/ant/dist/lib/ant-jmf.jar
:/
> >
usr/local/gump/public/workspace/ant/dist/lib/ant-swing.jar:/usr/local/gump/p
ub
> >
lic/workspace/ant/dist/lib/ant-apache-resolver.jar:/usr/local/gump/public/wo
rk
> >
space/ant/dist/lib/ant-trax.jar:/usr/local/gump/public/workspace/ant/dist/li
b/
> >
ant-junit.jar:/usr/local/gump/public/workspace/ant/dist/lib/ant-launcher.jar
:/
> >
usr/local/gump/public/workspace/ant/dist/lib/ant-nodeps.jar:/usr/local/gump/
pu
> >
blic/workspace/ant/dist/lib/ant.jar:/usr/local/gump/public/workspace/dist/ju
ni
> >
t/junit.jar:/usr/local/gump/public/workspace/xml-commons/java/build/resolver
.j
> > ar
> > ---------------------------------------------
> > Buildfile: build.xml
> >
> > prepare:
> >     [mkdir] Created dir:
> > /x1/gump/public/workspace/jakarta-servletapi-5/jsr152/build/classes
> >     [mkdir] Created dir:
> > /x1/gump/public/workspace/jakarta-servletapi-5/jsr152/build/docs
> >     [mkdir] Created dir:
> > /x1/gump/public/workspace/jakarta-servletapi-5/jsr152/build/docs/api
> >     [mkdir] Created dir:
> > /x1/gump/public/workspace/jakarta-servletapi-5/jsr152/build/examples
> >     [mkdir] Created dir:
> > /x1/gump/public/workspace/jakarta-servletapi-5/jsr152/dist
> >     [mkdir] Created dir:
> > /x1/gump/public/workspace/jakarta-servletapi-5/jsr152/dist/docs
> >     [mkdir] Created dir:
> > /x1/gump/public/workspace/jakarta-servletapi-5/jsr152/dist/docs/api
> >     [mkdir] Created dir:
> > /x1/gump/public/workspace/jakarta-servletapi-5/jsr152/dist/lib
> >     [mkdir] Created dir:
> > /x1/gump/public/workspace/jakarta-servletapi-5/jsr152/dist/src
> >     [mkdir] Created dir:
> > /x1/gump/public/workspace/jakarta-servletapi-5/jsr152/dist/examples
> >
> > ant:
> >     [javac] Compiling 1 source file to
> > /x1/gump/public/workspace/jakarta-servletapi-5/jsr152/build/ant
> >     [javac] Note:
> >
/x1/gump/public/workspace/jakarta-servletapi-5/jsr152/src/ant/task/Txt2Html.
ja
> > va uses or overrides a deprecated API.
> >     [javac] Note: Recompile with -deprecation for details.
> >
> > BUILD SUCCESSFUL
> > Total time: 1 second
> > ---------------------------------------------
> >
> > To subscribe to this information via syndicated feeds:
> > - RSS:
> >
>
http://vmgump.apache.org/gump/public/jakarta-servletapi-5/txt2html-task/rss.xm>
> l
> > - Atom:
> >
http://vmgump.apache.org/gump/public/jakarta-servletapi-5/txt2html-task/atom.x
> > ml
> >
> > ============================== Gump Tracking Only ===
> > Produced by Gump version 2.2.
> > Gump Run 23000023062005, vmgump.apache.org:vmgump-public:23000023062005
> > Gump E-mail Identifier (unique within run) #7.
> >
> > *********************************************************** G U M P
> > [GUMP@vmgump]: Project httpunit (in module httpunit) failed
> > To whom it may engage...
> >
> > This is an automated request, but not an unsolicited one. For
> > more information please visit http://gump.apache.org/nagged.html,
> > and/or contact the folk at general@gump.apache.org.
> >
> > Project httpunit has an issue affecting its community integration.
> > This issue affects 33 projects,
> >  and has been outstanding for 24 runs.
> > The current state of this project is 'Failed', with reason 'Build
Failed'.
> > For reference only, the following projects are affected by this:
> >     - authx-example :  Apache Authentication and Authorization Framework
> >     - avalon-http-context :  Avalon SVN
> >     - avalon-http-demo :  Avalon SVN
> >     - avalon-http-examples :  Avalon SVN
> >     - avalon-http-impl :  Avalon SVN
> >     - avalon-http-server :  Avalon SVN
> >     - avalon-http-servlet :  Avalon SVN
> >     - avalon-http-static :  Avalon SVN
> >     - avalon-http-test :  Avalon SVN
> >     - avalon-planet-facilities :  Avalon SVN
> >     - fulcrum-intake :  Services Framework
> >     - fulcrum-security-adapter-turbine :  Services Framework
> >     - httpunit :  framework for unit testing web sites
> >     - jakarta-cactus-documentation :  Cactus Documentation
> >     - jakarta-cactus-framework-12 :  Cactus Framework (J2EE 1.2)
> >     - jakarta-cactus-framework-13 :  Cactus Framework (J2EE 1.3)
> >     - jakarta-cactus-release-12 :  Unit test framework for server-side
java
> > code
> >     - jakarta-cactus-release-13 :  Unit test framework for server-side
java
> > code
> >     - jakarta-cactus-sample-jetty-13 :  Cactus Jetty Sample (J2EE 1.3)
> >     - jakarta-cactus-sample-servlet-12 :  Cactus Servlet Sample (J2EE
1.2)
> >     - jakarta-cactus-sample-servlet-13 :  Cactus Servlet Sample (J2EE
1.3)
> >     - jakarta-jetspeed :  Enterprise Information Portal
> >     - jakarta-tomcat-5 :  Servlet 2.4 and JSP 2.0 Reference
Implementation
> >     - jakarta-turbine-2 :  A servlet based framework.
> >     - jakarta-turbine-3 :  A servlet based framework.
> >     - jakarta-velocity-tools :  Velocity-Tools project
> >     - metro-reflector-blocks-complete :  Avalon SVN
> >     - scarab :  Issue Tracking Built for the Ages
> >     - struts-sslext :  The Struts SSL Extension for HTTP/HTTPS switching
> >     - struts-taglib :  Model 2 Model-View-Controller framework for
Servlets
> > and JSP
> >     - struts-taglib-from-packages :  Model 2 Model-View-Controller
framework
> > for Servlets and JSP
> >     - strutstestcase :  An extension of the standard JUnit TestCase
class that
> > provi...
> >     - ws-axis-test :  Apache eXtensible Interaction System
> >
> >
> > Full details are available at:
> >     http://vmgump.apache.org/gump/public/httpunit/httpunit/index.html
> >
> > That said, some information snippets are provided here.
> >
> > The following annotations (debug/informational/warning/error messages)
were
> > provided:
> >  -INFO- Failed with reason build failed
> >  -INFO- Failed to extract fallback artifacts from Gump Repository
> >
> >
> >
> > The following work was performed:
> >
http://vmgump.apache.org/gump/public/httpunit/httpunit/gump_work/build_httpuni
> > t_httpunit.html
> > Work Name: build_httpunit_httpunit (Type: Build)
> > Work ended in a state of : Failed
> > Elapsed:
> > Command Line: java -Djava.awt.headless=true
>
> -Xbootclasspath/p:/usr/local/gump/public/workspace/xml-commons/java/extern
al/b
> >
uild/xml-apis.jar:/usr/local/gump/public/workspace/xml-xerces2/java/build/xe
rc
> > esImpl.jar org.apache.tools.ant.Main
>
> -Dgump.merge=/x1/gump/public/gump/work/merge.xml -Dbuild.sysclasspath=only
> > [Working Directory: /usr/local/gump/public/workspace/httpunit]
> > CLASSPATH:
> >
/opt/jdk1.4/lib/tools.jar:/usr/local/gump/public/workspace/ant/dist/lib/ant-
jm
> >
f.jar:/usr/local/gump/public/workspace/ant/dist/lib/ant-swing.jar:/usr/local
/g
> >
ump/public/workspace/ant/dist/lib/ant-apache-resolver.jar:/usr/local/gump/pu
bl
> >
ic/workspace/ant/dist/lib/ant-trax.jar:/usr/local/gump/public/workspace/ant/
di
> >
st/lib/ant-junit.jar:/usr/local/gump/public/workspace/ant/dist/lib/ant-launc
he
> >
r.jar:/usr/local/gump/public/workspace/ant/dist/lib/ant-nodeps.jar:/usr/loca
l/
> >
gump/public/workspace/ant/dist/lib/ant.jar:/usr/local/gump/public/workspace/
di
> >
st/junit/junit.jar:/usr/local/gump/public/workspace/xml-commons/java/build/r
es
> >
olver.jar:/usr/local/gump/public/workspace/httpunit/jars/Tidy.jar:/usr/local
/g
> >
ump/packages/nekohtml-0.9.3/nekohtmlXni.jar:/usr/local/gump/packages/nekohtm
l-
> >
0.9.3/nekohtml.jar:/usr/local/gump/public/workspace/jakarta-servletapi-4/lib
/s
> > ervlet.jar
> > ---------------------------------------------
> > Buildfile: build.xml
> >
> > BUILD FAILED
> > /x1/gump/public/workspace/httpunit/build.xml:5: Unexpected element
"{}HTML"
> > {antlib:org.apache.tools.ant}HTML
> >
> > Total time: 0 seconds
> > ---------------------------------------------
> >
> > To subscribe to this information via syndicated feeds:
> > - RSS: http://vmgump.apache.org/gump/public/httpunit/httpunit/rss.xml
> > - Atom: http://vmgump.apache.org/gump/public/httpunit/httpunit/atom.xml
> >
> > ============================== Gump Tracking Only ===
> > Produced by Gump version 2.2.
> > Gump Run 23000023062005, vmgump.apache.org:vmgump-public:23000023062005
> > Gump E-mail Identifier (unique within run) #8.
> >
> > *********************************************************** G U M P
> > [GUMP@vmgump]: Project derby-split-2 (in module db-derby) failed
> > To whom it may engage...
> >
> > This is an automated request, but not an unsolicited one. For
> > more information please visit http://gump.apache.org/nagged.html,
> > and/or contact the folk at general@gump.apache.org.
> >
> > Project derby-split-2 has an issue affecting its community integration.
> > This issue affects 6 projects,
> >  and has been outstanding for 44 runs.
> > The current state of this project is 'Failed', with reason 'Build
Failed'.
> > For reference only, the following projects are affected by this:
> >     - derby :  Apache Derby, 100% Java relational database.
> >     - derby-split-2 :  Apache Derby, 100% Java relational database.
> >     - derby-split-3 :  Apache Derby, 100% Java relational database.
> >     - derby-split-4 :  Apache Derby, 100% Java relational database.
> >     - derby-split-5 :  Apache Derby, 100% Java relational database.
> >     - derby-split-6 :  Apache Derby, 100% Java relational database.
> >
> >
> > Full details are available at:
> >
http://vmgump.apache.org/gump/public/db-derby/derby-split-2/index.html
> >
> > That said, some information snippets are provided here.
> >
> > The following annotations (debug/informational/warning/error messages)
were
> > provided:
> >  -DEBUG- Dependency on java-runtime-1.3 exists, no need to add for
property
> > empty.
> >  -INFO- Failed with reason build failed
> >
> >
> >
> > The following work was performed:
> >
http://vmgump.apache.org/gump/public/db-derby/derby-split-2/gump_work/build_db
> > -derby_derby-split-2.html
> > Work Name: build_db-derby_derby-split-2 (Type: Build)
> > Work ended in a state of : Failed
> > Elapsed: 2 secs
> > Command Line: java -Djava.awt.headless=true
>
> -Xbootclasspath/p:/usr/local/gump/public/workspace/xml-commons/java/extern
al/b
> >
uild/xml-apis.jar:/usr/local/gump/public/workspace/xml-xerces2/java/build/xe
rc
> > esImpl.jar org.apache.tools.ant.Main
> > -Dgump.merge=/x1/gump/public/gump/work/merge.xml -Ddeprecation=false
> > -Dbuild.sysclasspath=last
> > -Dempty=/usr/local/gump/packages/java-runtime-1.3/rt.jar
> > -Dbuild.compiler=jikes gump_split_2
> > [Working Directory: /usr/local/gump/public/workspace/db-derby]
> > CLASSPATH:
> >
/opt/jdk1.4/lib/tools.jar:/usr/local/gump/public/workspace/ant/dist/lib/ant-
jm
> >
f.jar:/usr/local/gump/public/workspace/ant/dist/lib/ant-swing.jar:/usr/local
/g
> >
ump/public/workspace/ant/dist/lib/ant-apache-resolver.jar:/usr/local/gump/pu
bl
> >
ic/workspace/ant/dist/lib/ant-trax.jar:/usr/local/gump/public/workspace/ant/
di
> >
st/lib/ant-junit.jar:/usr/local/gump/public/workspace/ant/dist/lib/ant-launc
he
> >
r.jar:/usr/local/gump/public/workspace/ant/dist/lib/ant-nodeps.jar:/usr/loca
l/
> >
gump/public/workspace/ant/dist/lib/ant.jar:/usr/local/gump/public/workspace/
ja
> >
karta-servletapi-5/jsr154/dist/lib/servlet-api.jar:/usr/local/gump/public/wo
rk
> >
space/jakarta-oro/jakarta-oro-23062005.jar:/usr/local/gump/packages/javacc-3
.1
> >
/bin/lib/javacc.jar:/usr/local/gump/packages/java-runtime-1.3/rt.jar:/usr/lo
ca
> >
l/gump/packages/jce/jce-jdk13-116.jar:/usr/local/gump/packages/jdbc2_0/jdbc2
_0
> > -stdext.jar:/usr/local/gump/packages/jta-spec1_0_1/jta-spec1_0_1.jar
> > ---------------------------------------------
> >     [javac]     46. public class BrokeredConnection implements
Connection
> >     [javac]                      ^----------------^
> >     [javac] *** Semantic Error: The abstract method "void
> > rollback(java.sql.Savepoint $1) throws java.sql.SQLException;",
inherited from
> > type "java.sql.Connection", is not implemented in the non-abstract class
> > "org.apache.derby.iapi.jdbc.BrokeredConnection".
> >
> >
> >     [javac]     46. public class BrokeredConnection implements
Connection
> >     [javac]                      ^----------------^
> >     [javac] *** Semantic Error: The abstract method "void
> > releaseSavepoint(java.sql.Savepoint $1) throws java.sql.SQLException;",
> > inherited from type "java.sql.Connection", is not implemented in the
> > non-abstract class "org.apache.derby.iapi.jdbc.BrokeredConnection".
> >
> >
> >     [javac]     46. public class BrokeredConnection implements
Connection
> >     [javac]                      ^----------------^
> >     [javac] *** Semantic Error: The abstract method "java.sql.Savepoint
> > setSavepoint() throws java.sql.SQLException;", inherited from type
> > "java.sql.Connection", is not implemented in the non-abstract class
> > "org.apache.derby.iapi.jdbc.BrokeredConnection".
> >
> >
> >     [javac]     46. public class BrokeredConnection implements
Connection
> >     [javac]                      ^----------------^
> >     [javac] *** Semantic Error: The abstract method "void
setHoldability(int
> > $1) throws java.sql.SQLException;", inherited from type
"java.sql.Connection",
> > is not implemented in the non-abstract class
> > "org.apache.derby.iapi.jdbc.BrokeredConnection".
> >
> >
> >     [javac]     46. public class BrokeredConnection implements
Connection
> >     [javac]                      ^----------------^
> >     [javac] *** Semantic Error: The abstract method "int
getHoldability()
> > throws java.sql.SQLException;", inherited from type
"java.sql.Connection", is
> > not implemented in the non-abstract class
> > "org.apache.derby.iapi.jdbc.BrokeredConnection".
> >
> >     [javac] Found 4 semantic errors compiling
> >
"/x1/gump/public/workspace/db-derby/java/engine/org/apache/derby/impl/jdbc/E
mb
> > edConnection.java":
> >
> >     [javac]     89. public class EmbedConnection implements
> > java.sql.Connection
> >     [javac]                      ^-------------^
> >     [javac] *** Semantic Error: The abstract method "java.sql.Savepoint
> > setSavepoint(java.lang.String $1) throws java.sql.SQLException;",
inherited
> > from type "java.sql.Connection", is not implemented in the non-abstract
class
> > "org.apache.derby.impl.jdbc.EmbedConnection".
> >
> >
> >     [javac]     89. public class EmbedConnection implements
> > java.sql.Connection
> >     [javac]                      ^-------------^
> >     [javac] *** Semantic Error: The abstract method "void
> > rollback(java.sql.Savepoint $1) throws java.sql.SQLException;",
inherited from
> > type "java.sql.Connection", is not implemented in the non-abstract class
> > "org.apache.derby.impl.jdbc.EmbedConnection".
> >
> >
> >     [javac]     89. public class EmbedConnection implements
> > java.sql.Connection
> >     [javac]                      ^-------------^
> >     [javac] *** Semantic Error: The abstract method "void
> > releaseSavepoint(java.sql.Savepoint $1) throws java.sql.SQLException;",
> > inherited from type "java.sql.Connection", is not implemented in the
> > non-abstract class "org.apache.derby.impl.jdbc.EmbedConnection".
> >
> >
> >     [javac]     89. public class EmbedConnection implements
> > java.sql.Connection
> >     [javac]                      ^-------------^
> >     [javac] *** Semantic Error: The abstract method "java.sql.Savepoint
> > setSavepoint() throws java.sql.SQLException;", inherited from type
> > "java.sql.Connection", is not implemented in the non-abstract class
> > "org.apache.derby.impl.jdbc.EmbedConnection".
> >
> > BUILD FAILED
> > /x1/gump/public/workspace/db-derby/build.xml:1126: The following error
> > occurred while executing this line:
> >
/x1/gump/public/workspace/db-derby/java/engine/org/apache/derby/iapi/jdbc/bu
il
> > d.xml:65: Compile failed; see the compiler error output for details.
> >
> > Total time: 1 second
> > ---------------------------------------------
> >
> > To subscribe to this information via syndicated feeds:
> > - RSS:
http://vmgump.apache.org/gump/public/db-derby/derby-split-2/rss.xml
> > - Atom:
http://vmgump.apache.org/gump/public/db-derby/derby-split-2/atom.xml
> >
> > ============================== Gump Tracking Only ===
> > Produced by Gump version 2.2.
> > Gump Run 23000023062005, vmgump.apache.org:vmgump-public:23000023062005
> > Gump E-mail Identifier (unique within run) #14.
> >
> > *********************************************************** G U M P
> > [GUMP@vmgump]: Project jaxen (in module jaxen) failed
> > To whom it may engage...
> >
> > This is an automated request, but not an unsolicited one. For
> > more information please visit http://gump.apache.org/nagged.html,
> > and/or contact the folk at general@gump.apache.org.
> >
> > Project jaxen has an issue affecting its community integration.
> > This issue affects 4 projects,
> >  and has been outstanding for 2 runs.
> > The current state of this project is 'Failed', with reason 'Build
Failed'.
> > For reference only, the following projects are affected by this:
> >     - dom4j-HEAD :  The flexible XML framework for Java
> >     - dom4j-HEAD-tests :  The flexible XML framework for Java
> >     - jaxen :  Universal Java XPath Engine
> >     - jaxen-test :  Universal Java XPath Engine
> >
> >
> > Full details are available at:
> >     http://vmgump.apache.org/gump/public/jaxen/jaxen/index.html
> >
> > That said, some information snippets are provided here.
> >
> > The following annotations (debug/informational/warning/error messages)
were
> > provided:
> >  -DEBUG- Sole output [jaxen-23062005.jar] identifier set to project name
> >  -DEBUG- Dependency on xml-xerces exists, no need to add for property
> > maven.jar.xercesImpl.
> >  -DEBUG- Dependency on xml-apis exists, no need to add for property
> > maven.jar.xmlParserAPIs.
> >  -DEBUG- (Gump generated) Maven Properties in:
> > /usr/local/gump/public/workspace/jaxen/build.properties
> >  -INFO- Failed with reason build failed
> >  -DEBUG- Maven POM in:
/usr/local/gump/public/workspace/jaxen/project.xml
> >  -DEBUG- Maven project properties in:
> > /usr/local/gump/public/workspace/jaxen/project.properties
> >  -INFO- Failed to extract fallback artifacts from Gump Repository
> >
> >
> >
> > The following work was performed:
> >
http://vmgump.apache.org/gump/public/jaxen/jaxen/gump_work/build_jaxen_jaxen.h
> > tml
> > Work Name: build_jaxen_jaxen (Type: Build)
> > Work ended in a state of : Failed
> > Elapsed: 1 min 38 secs
> > Command Line: maven --offline jar
> > [Working Directory: /usr/local/gump/public/workspace/jaxen]
> > CLASSPATH:
> >
/opt/jdk1.4/lib/tools.jar:/usr/local/gump/public/workspace/jaxen/target/clas
se
> >
s:/usr/local/gump/public/workspace/jaxen/target/test-classes:/usr/local/gump
/p
> >
ublic/workspace/dom4j/build/dom4j.jar:/usr/local/gump/public/workspace/ant/d
is
> >
t/lib/ant-jmf.jar:/usr/local/gump/public/workspace/ant/dist/lib/ant-swing.ja
r:
> >
/usr/local/gump/public/workspace/ant/dist/lib/ant-apache-resolver.jar:/usr/l
oc
> >
al/gump/public/workspace/ant/dist/lib/ant-trax.jar:/usr/local/gump/public/wo
rk
> >
space/ant/dist/lib/ant-junit.jar:/usr/local/gump/public/workspace/ant/dist/l
ib
> >
/ant-launcher.jar:/usr/local/gump/public/workspace/ant/dist/lib/ant-nodeps.j
ar
> >
:/usr/local/gump/public/workspace/ant/dist/lib/ant.jar:/usr/local/gump/publi
c/
> >
workspace/jdom/build/jdom.jar:/usr/local/gump/public/workspace/dist/junit/ju
ni
> > t.jar:/usr/local/gump/public/workspace/xom/build/xom-23062005.jar
> > ---------------------------------------------
> >     [junit] Running org.jaxen.saxpath.helpers.XPathReaderFactoryTest
> >     [junit] Tests run: 7, Failures: 0, Errors: 0, Time elapsed: 0.495
sec
> >     [junit] Running org.jaxen.saxpath.SAXPathExceptionTest
> >     [junit] Tests run: 2, Failures: 0, Errors: 0, Time elapsed: 0.488
sec
> >     [junit] Running org.jaxen.xom.DocumentNavigatorTest
> >     [junit] Tests run: 62, Failures: 0, Errors: 0, Time elapsed: 3.345
sec
> >     [junit] Running org.jaxen.xom.XPathTest
> >     [junit] Tests run: 2, Failures: 0, Errors: 0, Time elapsed: 0.783
sec
> >     [junit] Running org.jaxen.JaxenRuntimeExceptionTest
> >     [junit] Tests run: 2, Failures: 0, Errors: 0, Time elapsed: 0.484
sec
> >     [junit] Running org.jaxen.FunctionCallExceptionTest
> >     [junit] Tests run: 2, Failures: 0, Errors: 0, Time elapsed: 0.473
sec
> >     [junit] Running org.jaxen.UnresolvableExceptionTest
> >     [junit] Tests run: 2, Failures: 0, Errors: 0, Time elapsed: 0.647
sec
> >     [junit] Running org.jaxen.util.SingletonListTest
> >     [junit] Tests run: 1, Failures: 0, Errors: 0, Time elapsed: 0.482
sec
> >     [junit] Running org.jaxen.util.AncestorOrSelfAxisIteratorTest
> >     [junit] Tests run: 2, Failures: 0, Errors: 0, Time elapsed: 0.56 sec
> >     [junit] Running org.jaxen.util.DescendantAxisIteratorTest
> >     [junit] Tests run: 2, Failures: 0, Errors: 0, Time elapsed: 0.493
sec
> >     [junit] Running org.jaxen.util.FollowingAxisIteratorTest
> >     [junit] Tests run: 2, Failures: 0, Errors: 0, Time elapsed: 0.495
sec
> >     [junit] Running org.jaxen.util.FollowingSiblingAxisIteratorTest
> >     [junit] Tests run: 2, Failures: 0, Errors: 0, Time elapsed: 0.484
sec
> >     [junit] Running org.jaxen.util.PrecedingAxisIteratorTest
> >     [junit] Tests run: 2, Failures: 0, Errors: 0, Time elapsed: 0.5 sec
> >     [junit] Running org.jaxen.util.PrecedingSiblingAxisIteratorTest
> >     [junit] Tests run: 2, Failures: 0, Errors: 0, Time elapsed: 0.496
sec
> >     [junit] Running org.jaxen.util.SingleObjectIteratorTest
> >     [junit] Tests run: 2, Failures: 0, Errors: 0, Time elapsed: 0.469
sec
> >     [junit] Running org.jaxen.SimpleNamespaceContextTest
> >     [junit] Tests run: 1, Failures: 0, Errors: 0, Time elapsed: 0.481
sec
> >     [junit] Running org.jaxen.UnsupportedAxisExceptionTest
> >     [junit] Tests run: 1, Failures: 0, Errors: 0, Time elapsed: 0.48 sec
> >     [junit] Running org.jaxen.VariableContextTest
> >     [junit] Tests run: 2, Failures: 0, Errors: 0, Time elapsed: 0.65 sec
> >     [junit] Running org.jaxen.XPathSyntaxExceptionTest
> >     [junit] Tests run: 3, Failures: 0, Errors: 0, Time elapsed: 0.56 sec
> >     [junit] Running org.jaxen.JaxenExceptionTest
> >     [junit] Tests run: 2, Failures: 0, Errors: 0, Time elapsed: 0.51 sec
> >
> > BUILD FAILED
> > File...... /home/gump/.maven/cache/maven-test-plugin-1.6.2/plugin.jelly
> > Element... fail
> > Line...... 181
> > Column.... 54
> > There were test failures.
> > Total time: 1 minutes 38 seconds
> > Finished at: Thu Jun 23 02:30:29 PDT 2005
> >
> > ---------------------------------------------
> >
> > To subscribe to this information via syndicated feeds:
> > - RSS: http://vmgump.apache.org/gump/public/jaxen/jaxen/rss.xml
> > - Atom: http://vmgump.apache.org/gump/public/jaxen/jaxen/atom.xml
> >
> > ============================== Gump Tracking Only ===
> > Produced by Gump version 2.2.
> > Gump Run 23000023062005, vmgump.apache.org:vmgump-public:23000023062005
> > Gump E-mail Identifier (unique within run) #20.
> >
> >
> > --
> > Apache Gump
> > http://gump.apache.org/ [Instance: vmgump]
> >
> > ---------------------------------------------------------------------
> > To unsubscribe, e-mail: general-unsubscribe@gump.apache.org
> > For additional commands, e-mail: general-help@gump.apache.org
> >
>
>
>
> ---------------------------------------------------------------------
> To unsubscribe, e-mail: general-unsubscribe@gump.apache.org
> For additional commands, e-mail: general-help@gump.apache.org
>
>


---------------------------------------------------------------------
To unsubscribe, e-mail: general-unsubscribe@gump.apache.org
For additional commands, e-mail: general-help@gump.apache.org


Mime
View raw message