gump-general mailing list archives

Site index · List index
Message view « Date » · « Thread »
Top « Date » · « Thread »
From "Adam Jack" <aj...@mric.coop>
Subject Gump3 unit test failure (on cygwin)
Date Sun, 17 Apr 2005 16:45:55 GMT
I'd try to fix it, but I only have an hour free & want to work on something
else.
regards
Adam
======================================================================
FAIL: test_do_script (testPluginBuilder.BuilderTestCase)
----------------------------------------------------------------------
Traceback (most recent call last):
  File "f:\data\Python\Gump3-SVN\gump\test\testPluginBuilder.py", line 62,
in te
st_do_script
AssertionError: 'RESULT\n' !=
"'c:\\winnt\\temp\\tmpiv76ad\\w\\r\\m\\dobuild' is
 not recognized as an internal or external command,\r\noperable program or
batch
 file.\r\n"

----------------------------------------------------------------------
Ran 52 tests in 11.857s

FAILED (failures=1)

======================================================================
OVERALL FAILED (total failures=1)


---------------------------------------------------------------------
To unsubscribe, e-mail: general-unsubscribe@gump.apache.org
For additional commands, e-mail: general-help@gump.apache.org


Mime
View raw message