groovy-dev mailing list archives

Site index · List index
Message view « Date » · « Thread »
Top « Date » · « Thread »
From Pascal Schumacher <pascalschumac...@gmx.net>
Subject Re: Failing Groovysh Test with JDK 9 SNAPSHOT on Buildserver
Date Tue, 03 Nov 2015 18:37:13 GMT
Thibault kindly forwarded me the feedback on the java issue he created

Anybody has an idea how to fix the problem Pallavi is reporting with 
building groovy?

-------- Weitergeleitete Nachricht --------
Betreff: 	Fwd: JI-9024430 : double free or corruption (fasttop)
Datum: 	Tue, 3 Nov 2015 12:19:55 +0100

	

	


I have a response, but now I have less time to deal with this....


---------- Forwarded message ----------
From: Pallavi Sonal <pallavi.sonal@oracle.com>
Date: Tue, Nov 3, 2015 at 10:01 AM
Subject: JI-9024430 : double free or corruption (fasttop)


Hi Thibault,

Thanks for reporting the incident to Oracle.

I tried building the incubator-groovy project from the Github apache
repository and attached is the output of the build. I didn’t get the
error as reported by you, though build failed with a different error
for me. I had tried the build on Windows 7 OS.

Please let me know if there is a certain configuration/setting that I
may be missing and that may help reproducing the output.

Have you tried building with the latest JDK 9ea B85? Are you still
getting the same error?

Thanks,
Pallavi

  

To honour the JVM settings for this build a new JVM will be forked. Please consider using
the daemon: https://docs.gradle.org/2.8/userguide/gradle_daemon.html.
:buildSrc:compileJava UP-TO-DATE
:buildSrc:compileGroovy UP-TO-DATE
:buildSrc:processResources UP-TO-DATE
:buildSrc:classes UP-TO-DATE
:buildSrc:jar UP-TO-DATE
:buildSrc:assemble UP-TO-DATE
:buildSrc:compileTestJava UP-TO-DATE
:buildSrc:compileTestGroovy UP-TO-DATE
:buildSrc:processTestResources UP-TO-DATE
:buildSrc:testClasses UP-TO-DATE
:buildSrc:test UP-TO-DATE
:buildSrc:check UP-TO-DATE
:buildSrc:build UP-TO-DATE
Bintray user: null
Using Java from D:\JDK9b85 (version 1.9.0-ea)


          DM .N$?
           $I?7OM.
         .7+?II77MZ       ,:~~
         +I$7O$8?  .M..DMMNNMMNZ.
          ONDOMI.     7MMMMMMOO$I.
          DOM87=      ZMNM8NMI77$.
     .MNDO?$8$?       8MMNMMMN7II.
    MMMO. O$7Z.   OI8?MDNNM$$$$7OM
     M8  ZZ7$.    MMMMMDD7I77I777MMMM.
        ZZ$7$     DMM$N$ZNMZDMODNDM. DD
      .Z$$I$$       .ZI777777II778     ?D.
     8$$7I$I+         .$I7?I7II7D.       ?Z
    .O$$7I$78         N77O+??I?$.          Z
    =7$7777$7 .    .=7NZ?I$7I+$.             O
   ~:7$$7$7D+$~:=Z:=~++77Z$?IIZ~.             N
   $Z$7O8D8=Z8I7==I~I:+~OZ887$MOI$O           .7
   :O$I+~=?:O8?I$=++=:===Z$77ZN++$+~.          Z.
    :7$78ZZZZZ=ZZ$~?==~+DD$8O$OO$7+?:.         $
     .=~=+Z7I7?7I$+~=:~+~O~???77?~+??~         O
         +=IZ7$7OI$=Z:~:~=8I?I?+$Z8++:        N.
           =$+8ZO$$==+=~=?=8$IIIIID$ZZ.      Z

                    INDY ENABLED !

Detected development environment
[buildinfo] Properties file path was not found! (Relevant only for builds running on a CI
Server)
:copyResources UP-TO-DATE
:ensureGrammars UP-TO-DATE
:exceptionUtils UP-TO-DATE
:compileJava UP-TO-DATE
:dgmConverter UP-TO-DATE
:bootstrapJar UP-TO-DATE
:compileGroovy UP-TO-DATE
:processResources UP-TO-DATE
:classes UP-TO-DATE
:jar UP-TO-DATE
:groovy-swing:moduleDescriptor UP-TO-DATE
:groovy-swing:compileJava UP-TO-DATE
:groovy-swing:compileGroovy UP-TO-DATE
:groovy-swing:processResources UP-TO-DATE
:groovy-swing:classes UP-TO-DATE
:groovy-swing:jar UP-TO-DATE
:groovy-xml:moduleDescriptor UP-TO-DATE
:groovy-xml:compileJava UP-TO-DATE
:groovy-xml:compileGroovy UP-TO-DATE
:groovy-xml:processResources UP-TO-DATE
:groovy-xml:classes UP-TO-DATE
:groovy-xml:jar UP-TO-DATE
:groovy-templates:compileJava UP-TO-DATE
:groovy-templates:compileGroovy UP-TO-DATE
:groovy-templates:processResources UP-TO-DATE
:groovy-templates:classes UP-TO-DATE
:groovy-templates:jar UP-TO-DATE
:groovy-console:compileJava UP-TO-DATE
:groovy-console:compileGroovy UP-TO-DATE
:groovy-console:processResources UP-TO-DATE
:groovy-console:classes UP-TO-DATE
:groovy-console:jar UP-TO-DATE
:groovy-groovysh:compileJava UP-TO-DATE
:groovy-groovysh:compileGroovy UP-TO-DATE
:groovy-groovysh:processResources UP-TO-DATE
:groovy-groovysh:classes UP-TO-DATE
:groovy-test:compileJava UP-TO-DATE
:groovy-test:compileGroovy UP-TO-DATE
:groovy-test:processResources UP-TO-DATE
:groovy-test:classes UP-TO-DATE
:groovy-test:jar UP-TO-DATE
:groovy-groovysh:compileTestJava UP-TO-DATE
:groovy-groovysh:compileTestGroovy UP-TO-DATE
:groovy-groovysh:processTestResources UP-TO-DATE
:groovy-groovysh:testClasses UP-TO-DATE
:groovy-groovysh:test FAILED


Unexpected exception thrown.
org.gradle.messaging.remote.internal.MessageIOException: Could not write message
  [EndOfStream] to '/127.0.0.1:60344'.
         at org.gradle.messaging.remote.internal.inet.SocketConnection.dispatch(S
ocketConnection.java:111)
         at org.gradle.messaging.remote.internal.hub.MessageHub$ConnectionDispatc
h.run(MessageHub.java:284)
         at org.gradle.internal.concurrent.ExecutorPolicy$CatchAndRecordFailures.
onExecute(ExecutorPolicy.java:54)
         at org.gradle.internal.concurrent.StoppableExecutorImpl$1.run(StoppableE
xecutorImpl.java:40)
         at java.util.concurrent.ThreadPoolExecutor.runWorker(ThreadPoolExecutor.
java:1142)
         at java.util.concurrent.ThreadPoolExecutor$Worker.run(ThreadPoolExecutor
.java:617)
         at java.lang.Thread.run(Thread.java:747)
Caused by: java.io.IOException: An existing connection was forcibly closed by th
e remote host
         at sun.nio.ch.SocketDispatcher.write0(Native Method)
         at sun.nio.ch.SocketDispatcher.write(SocketDispatcher.java:51)
         at sun.nio.ch.IOUtil.writeFromNativeBuffer(IOUtil.java:93)
         at sun.nio.ch.IOUtil.write(IOUtil.java:51)
         at sun.nio.ch.SocketChannelImpl.write(SocketChannelImpl.java:471)
         at org.gradle.messaging.remote.internal.inet.SocketConnection$SocketOutp
utStream.flush(SocketConnection.java:236)
         at org.gradle.messaging.remote.internal.inet.SocketConnection.dispatch(S
ocketConnection.java:109)
         ... 6 more
Unexpected exception thrown.
org.gradle.messaging.remote.internal.MessageIOException: Could not write message
  [EndOfStream] to '/127.0.0.1:60355'.
         at org.gradle.messaging.remote.internal.inet.SocketConnection.dispatch(S
ocketConnection.java:111)
         at org.gradle.messaging.remote.internal.hub.MessageHub$ConnectionDispatc
h.run(MessageHub.java:284)
         at org.gradle.internal.concurrent.ExecutorPolicy$CatchAndRecordFailures.
onExecute(ExecutorPolicy.java:54)
         at org.gradle.internal.concurrent.StoppableExecutorImpl$1.run(StoppableE
xecutorImpl.java:40)
         at java.util.concurrent.ThreadPoolExecutor.runWorker(ThreadPoolExecutor.
java:1142)
         at java.util.concurrent.ThreadPoolExecutor$Worker.run(ThreadPoolExecutor
.java:617)
         at java.lang.Thread.run(Thread.java:747)
Caused by: java.io.IOException: An existing connection was forcibly closed by th
e remote host
         at sun.nio.ch.SocketDispatcher.write0(Native Method)
         at sun.nio.ch.SocketDispatcher.write(SocketDispatcher.java:51)
         at sun.nio.ch.IOUtil.writeFromNativeBuffer(IOUtil.java:93)
         at sun.nio.ch.IOUtil.write(IOUtil.java:51)
         at sun.nio.ch.SocketChannelImpl.write(SocketChannelImpl.java:471)
         at org.gradle.messaging.remote.internal.inet.SocketConnection$SocketOutp
utStream.flush(SocketConnection.java:236)
         at org.gradle.messaging.remote.internal.inet.SocketConnection.dispatch(S
ocketConnection.java:109)
         ... 6 more
Unexpected exception thrown.
org.gradle.messaging.remote.internal.MessageIOException: Could not write message
  [EndOfStream] to '/127.0.0.1:60343'.
         at org.gradle.messaging.remote.internal.inet.SocketConnection.dispatch(S
ocketConnection.java:111)
         at org.gradle.messaging.remote.internal.hub.MessageHub$ConnectionDispatc
h.run(MessageHub.java:284)
         at org.gradle.internal.concurrent.ExecutorPolicy$CatchAndRecordFailures.
onExecute(ExecutorPolicy.java:54)
         at org.gradle.internal.concurrent.StoppableExecutorImpl$1.run(StoppableE
xecutorImpl.java:40)
         at java.util.concurrent.ThreadPoolExecutor.runWorker(ThreadPoolExecutor.
java:1142)
         at java.util.concurrent.ThreadPoolExecutor$Worker.run(ThreadPoolExecutor
.java:617)
         at java.lang.Thread.run(Thread.java:747)
Caused by: java.io.IOException: An existing connection was forcibly closed by th
e remote host
         at sun.nio.ch.SocketDispatcher.write0(Native Method)
         at sun.nio.ch.SocketDispatcher.write(SocketDispatcher.java:51)
         at sun.nio.ch.IOUtil.writeFromNativeBuffer(IOUtil.java:93)
         at sun.nio.ch.IOUtil.write(IOUtil.java:51)
         at sun.nio.ch.SocketChannelImpl.write(SocketChannelImpl.java:471)
         at org.gradle.messaging.remote.internal.inet.SocketConnection$SocketOutp
utStream.flush(SocketConnection.java:236)
         at org.gradle.messaging.remote.internal.inet.SocketConnection.dispatch(S
ocketConnection.java:109)
         ... 6 more
Could not stop org.gradle.messaging.actor.internal.DefaultActorFactory$NonBlocki
ngActor@79d0aaa5.
org.gradle.messaging.dispatch.DispatchException: Could not dispatch message [Met
hodInvocation method: stop()].
         at org.gradle.messaging.dispatch.ExceptionTrackingFailureHandler.dispatc
hFailed(ExceptionTrackingFailureHandler.java:34)
         at org.gradle.messaging.dispatch.FailureHandlingDispatch.dispatch(Failur
eHandlingDispatch.java:31)
         at org.gradle.messaging.dispatch.AsyncDispatch.dispatchMessages(AsyncDis
patch.java:132)
         at org.gradle.messaging.dispatch.AsyncDispatch.access$000(AsyncDispatch.
java:33)
         at org.gradle.messaging.dispatch.AsyncDispatch$1.run(AsyncDispatch.java:
72)
         at org.gradle.internal.concurrent.ExecutorPolicy$CatchAndRecordFailures.
onExecute(ExecutorPolicy.java:54)
         at org.gradle.internal.concurrent.StoppableExecutorImpl$1.run(StoppableE
xecutorImpl.java:40)
         at java.util.concurrent.ThreadPoolExecutor.runWorker(ThreadPoolExecutor.
java:1142)
         at java.util.concurrent.ThreadPoolExecutor$Worker.run(ThreadPoolExecutor
.java:617)
         at java.lang.Thread.run(Thread.java:747)
Caused by: org.gradle.process.internal.ExecException: Process 'Gradle Test Execu
tor 1' finished with non-zero exit value -1073740940
         at org.gradle.process.internal.DefaultExecHandle$ExecResultImpl.assertNo
rmalExitValue(DefaultExecHandle.java:367)
         at org.gradle.process.internal.DefaultWorkerProcess.waitForStop(DefaultW
orkerProcess.java:161)
         at org.gradle.api.internal.tasks.testing.worker.ForkingTestClassProcesso
r.stop(ForkingTestClassProcessor.java:86)
         at org.gradle.api.internal.tasks.testing.processors.RestartEveryNTestCla
ssProcessor.endBatch(RestartEveryNTestClassProcessor.java:60)
         at org.gradle.api.internal.tasks.testing.processors.RestartEveryNTestCla
ssProcessor.stop(RestartEveryNTestClassProcessor.java:54)
         at sun.reflect.NativeMethodAccessorImpl.invoke0(Native Method)
         at sun.reflect.NativeMethodAccessorImpl.invoke(NativeMethodAccessorImpl.
java:62)
         at sun.reflect.DelegatingMethodAccessorImpl.invoke(DelegatingMethodAcces
sorImpl.java:43)
         at java.lang.reflect.Method.invoke(Method.java:520)
         at org.gradle.messaging.dispatch.ReflectionDispatch.dispatch(ReflectionD
ispatch.java:35)
         at org.gradle.messaging.dispatch.ReflectionDispatch.dispatch(ReflectionD
ispatch.java:24)
         at org.gradle.messaging.dispatch.FailureHandlingDispatch.dispatch(Failur
eHandlingDispatch.java:29)
         ... 8 more
Could not stop org.gradle.messaging.actor.internal.DefaultActorFactory$NonBlocki
ngActor@624dca6.
org.gradle.messaging.dispatch.DispatchException: Could not dispatch message [Met
hodInvocation method: stop()].
         at org.gradle.messaging.dispatch.ExceptionTrackingFailureHandler.dispatc
hFailed(ExceptionTrackingFailureHandler.java:34)
         at org.gradle.messaging.dispatch.FailureHandlingDispatch.dispatch(Failur
eHandlingDispatch.java:31)
         at org.gradle.messaging.dispatch.AsyncDispatch.dispatchMessages(AsyncDis
patch.java:132)
         at org.gradle.messaging.dispatch.AsyncDispatch.access$000(AsyncDispatch.
java:33)
         at org.gradle.messaging.dispatch.AsyncDispatch$1.run(AsyncDispatch.java:
72)
         at org.gradle.internal.concurrent.ExecutorPolicy$CatchAndRecordFailures.
onExecute(ExecutorPolicy.java:54)
         at org.gradle.internal.concurrent.StoppableExecutorImpl$1.run(StoppableE
xecutorImpl.java:40)
         at java.util.concurrent.ThreadPoolExecutor.runWorker(ThreadPoolExecutor.
java:1142)
         at java.util.concurrent.ThreadPoolExecutor$Worker.run(ThreadPoolExecutor
.java:617)
         at java.lang.Thread.run(Thread.java:747)
Caused by: org.gradle.process.internal.ExecException: Process 'Gradle Test Execu
tor 4' finished with non-zero exit value -1073740940
         at org.gradle.process.internal.DefaultExecHandle$ExecResultImpl.assertNo
rmalExitValue(DefaultExecHandle.java:367)
         at org.gradle.process.internal.DefaultWorkerProcess.waitForStop(DefaultW
orkerProcess.java:161)
         at org.gradle.api.internal.tasks.testing.worker.ForkingTestClassProcesso
r.stop(ForkingTestClassProcessor.java:86)
         at org.gradle.api.internal.tasks.testing.processors.RestartEveryNTestCla
ssProcessor.endBatch(RestartEveryNTestClassProcessor.java:60)
         at org.gradle.api.internal.tasks.testing.processors.RestartEveryNTestCla
ssProcessor.stop(RestartEveryNTestClassProcessor.java:54)
         at sun.reflect.NativeMethodAccessorImpl.invoke0(Native Method)
         at sun.reflect.NativeMethodAccessorImpl.invoke(NativeMethodAccessorImpl.
java:62)
         at sun.reflect.DelegatingMethodAccessorImpl.invoke(DelegatingMethodAcces
sorImpl.java:43)
         at java.lang.reflect.Method.invoke(Method.java:520)
         at org.gradle.messaging.dispatch.ReflectionDispatch.dispatch(ReflectionD
ispatch.java:35)
         at org.gradle.messaging.dispatch.ReflectionDispatch.dispatch(ReflectionD
ispatch.java:24)
         at org.gradle.messaging.dispatch.FailureHandlingDispatch.dispatch(Failur
eHandlingDispatch.java:29)
         ... 8 more

FAILURE: Build failed with an exception.

* What went wrong:
Execution failed for task ':groovy-groovysh:test'.
> Process 'Gradle Test Executor 2' finished with non-zero exit value -1073740940


* Try:
Run with --stacktrace option to get the stack trace. Run with --info or --debug
option to get more log output.

BUILD FAILED

Total time: 2 mins 54.093 secs




Mime
View raw message