gora-dev mailing list archives

Site index · List index
Message view « Date » · « Thread »
Top « Date » · « Thread »
From "Lewis John McGibbney (JIRA)" <j...@apache.org>
Subject [jira] [Created] (GORA-501) Fix Javadoc for JDK1.8 compliance
Date Sat, 28 Jan 2017 09:27:24 GMT
Lewis John McGibbney created GORA-501:
-----------------------------------------

             Summary: Fix Javadoc for JDK1.8 compliance
                 Key: GORA-501
                 URL: https://issues.apache.org/jira/browse/GORA-501
             Project: Apache Gora
          Issue Type: Task
          Components: documentation
            Reporter: Lewis John McGibbney
            Priority: Blocker
             Fix For: 0.7


Unfortunately it seems like the Jenkins build was not using JDK 1.8 for our CI, I've just
configured it and it results in the following
{code}
[INFO] ------------------------------------------------------------------------
[INFO] BUILD FAILURE
[INFO] ------------------------------------------------------------------------
[INFO] Total time: 18:07 min
[INFO] Finished at: 2017-01-28T09:24:19+00:00
[INFO] Final Memory: 90M/818M
[INFO] ------------------------------------------------------------------------

Waiting for Jenkins to finish collecting data

[ERROR] Failed to execute goal org.apache.maven.plugins:maven-javadoc-plugin:2.8:aggregate
(default-cli) on project gora: An error has occurred in JavaDocs report generation:
[ERROR] Exit code: 1 - /home/jenkins/jenkins-slave/workspace/gora-trunk/gora-core/src/main/java/org/apache/gora/util/AvroUtils.java:46:
warning: no @param for schema
[ERROR] public static Map<String, Field> getFieldMap(Schema schema) {
[ERROR] ^
[ERROR] /home/jenkins/jenkins-slave/workspace/gora-trunk/gora-core/src/main/java/org/apache/gora/util/AvroUtils.java:46:
warning: no @return
[ERROR] public static Map<String, Field> getFieldMap(Schema schema) {
[ERROR] ^
[ERROR] /home/jenkins/jenkins-slave/workspace/gora-trunk/gora-core/src/main/java/org/apache/gora/util/AvroUtils.java:68:
warning: no @param for clazz
[ERROR] public static Schema getSchema(Class<? extends PersistentBase> clazz)
[ERROR] ^
[ERROR] /home/jenkins/jenkins-slave/workspace/gora-trunk/gora-core/src/main/java/org/apache/gora/util/AvroUtils.java:68:
warning: no @return
[ERROR] public static Schema getSchema(Class<? extends PersistentBase> clazz)
[ERROR] ^
[ERROR] /home/jenkins/jenkins-slave/workspace/gora-trunk/gora-core/src/main/java/org/apache/gora/util/AvroUtils.java:68:
warning: no @throws for java.lang.NoSuchFieldException
[ERROR] public static Schema getSchema(Class<? extends PersistentBase> clazz)
[ERROR] ^
[ERROR] /home/jenkins/jenkins-slave/workspace/gora-trunk/gora-core/src/main/java/org/apache/gora/util/AvroUtils.java:68:
warning: no @throws for java.lang.IllegalAccessException
[ERROR] public static Schema getSchema(Class<? extends PersistentBase> clazz)
[ERROR] ^
[ERROR] /home/jenkins/jenkins-slave/workspace/gora-trunk/gora-core/src/main/java/org/apache/gora/util/ByteUtils.java:91:
warning: no description for @param
[ERROR] * @param srcOffset
[ERROR] ^
[ERROR] /home/jenkins/jenkins-slave/workspace/gora-trunk/gora-core/src/main/java/org/apache/gora/util/ByteUtils.java:92:
warning: no description for @param
[ERROR] * @param srcLength
[ERROR] ^
[ERROR] /home/jenkins/jenkins-slave/workspace/gora-trunk/gora-core/src/main/java/org/apache/gora/util/ByteUtils.java:144:
warning: no description for @param
[ERROR] * @param off
[ERROR] ^
[ERROR] /home/jenkins/jenkins-slave/workspace/gora-trunk/gora-core/src/main/java/org/apache/gora/util/ByteUtils.java:145:
warning: no description for @param
[ERROR] * @param len
[ERROR] ^
[ERROR] /home/jenkins/jenkins-slave/workspace/gora-trunk/gora-core/src/main/java/org/apache/gora/util/ByteUtils.java:166:
warning: no description for @param
[ERROR] * @param s
[ERROR] ^
[ERROR] /home/jenkins/jenkins-slave/workspace/gora-trunk/gora-core/src/main/java/org/apache/gora/util/ByteUtils.java:185:
warning: no description for @param
[ERROR] * @param b
[ERROR] ^
[ERROR] /home/jenkins/jenkins-slave/workspace/gora-trunk/gora-core/src/main/java/org/apache/gora/util/ByteUtils.java:195:
warning: no description for @param
[ERROR] * @param b
[ERROR] ^
[ERROR] /home/jenkins/jenkins-slave/workspace/gora-trunk/gora-core/src/main/java/org/apache/gora/util/ByteUtils.java:207:
warning: no description for @param
[ERROR] * @param val
[ERROR] ^
[ERROR] /home/jenkins/jenkins-slave/workspace/gora-trunk/gora-core/src/main/java/org/apache/gora/util/ByteUtils.java:222:
warning: no description for @param
[ERROR] * @param bytes
[ERROR] ^
[ERROR] /home/jenkins/jenkins-slave/workspace/gora-trunk/gora-core/src/main/java/org/apache/gora/util/ByteUtils.java:231:
warning: no description for @param
[ERROR] * @param bytes
[ERROR] ^
[ERROR] /home/jenkins/jenkins-slave/workspace/gora-trunk/gora-core/src/main/java/org/apache/gora/util/ByteUtils.java:232:
warning: no description for @param
[ERROR] * @param offset
[ERROR] ^
[ERROR] /home/jenkins/jenkins-slave/workspace/gora-trunk/gora-core/src/main/java/org/apache/gora/util/ByteUtils.java:241:
warning: no description for @param
[ERROR] * @param bytes
[ERROR] ^
[ERROR] /home/jenkins/jenkins-slave/workspace/gora-trunk/gora-core/src/main/java/org/apache/gora/util/ByteUtils.java:242:
warning: no description for @param
[ERROR] * @param offset
[ERROR] ^
[ERROR] /home/jenkins/jenkins-slave/workspace/gora-trunk/gora-core/src/main/java/org/apache/gora/util/ByteUtils.java:243:
warning: no description for @param
[ERROR] * @param length
[ERROR] ^
[ERROR] /home/jenkins/jenkins-slave/workspace/gora-trunk/gora-core/src/main/java/org/apache/gora/util/ByteUtils.java:261:
warning: no description for @param
[ERROR] * @param bytes
[ERROR] ^
[ERROR] /home/jenkins/jenkins-slave/workspace/gora-trunk/gora-core/src/main/java/org/apache/gora/util/ByteUtils.java:270:
warning: no description for @param
[ERROR] * @param bytes
[ERROR] ^
[ERROR] /home/jenkins/jenkins-slave/workspace/gora-trunk/gora-core/src/main/java/org/apache/gora/util/ByteUtils.java:271:
warning: no description for @param
[ERROR] * @param offset
[ERROR] ^
[ERROR] /home/jenkins/jenkins-slave/workspace/gora-trunk/gora-core/src/main/java/org/apache/gora/util/ByteUtils.java:279:
warning: no description for @param
[ERROR] * @param f
[ERROR] ^
[ERROR] /home/jenkins/jenkins-slave/workspace/gora-trunk/gora-core/src/main/java/org/apache/gora/util/ByteUtils.java:289:
warning: no description for @param
[ERROR] * @param bytes
[ERROR] ^
[ERROR] /home/jenkins/jenkins-slave/workspace/gora-trunk/gora-core/src/main/java/org/apache/gora/util/ByteUtils.java:297:
warning: no description for @param
[ERROR] * @param bytes
[ERROR] ^
[ERROR] /home/jenkins/jenkins-slave/workspace/gora-trunk/gora-core/src/main/java/org/apache/gora/util/ByteUtils.java:298:
warning: no description for @param
[ERROR] * @param offset
[ERROR] ^
[ERROR] /home/jenkins/jenkins-slave/workspace/gora-trunk/gora-core/src/main/java/org/apache/gora/util/ByteUtils.java:307:
warning: no description for @param
[ERROR] * @param d
[ERROR] ^
[ERROR] /home/jenkins/jenkins-slave/workspace/gora-trunk/gora-core/src/main/java/org/apache/gora/util/ByteUtils.java:318:
warning: no description for @param
[ERROR] * @param val
[ERROR] ^
[ERROR] /home/jenkins/jenkins-slave/workspace/gora-trunk/gora-core/src/main/java/org/apache/gora/util/ByteUtils.java:333:
warning: no description for @param
[ERROR] * @param bytes
[ERROR] ^
[ERROR] /home/jenkins/jenkins-slave/workspace/gora-trunk/gora-core/src/main/java/org/apache/gora/util/ByteUtils.java:342:
warning: no description for @param
[ERROR] * @param bytes
[ERROR] ^
[ERROR] /home/jenkins/jenkins-slave/workspace/gora-trunk/gora-core/src/main/java/org/apache/gora/util/ByteUtils.java:343:
warning: no description for @param
[ERROR] * @param offset
[ERROR] ^
[ERROR] /home/jenkins/jenkins-slave/workspace/gora-trunk/gora-core/src/main/java/org/apache/gora/util/ByteUtils.java:352:
warning: no description for @param
[ERROR] * @param bytes
[ERROR] ^
[ERROR] /home/jenkins/jenkins-slave/workspace/gora-trunk/gora-core/src/main/java/org/apache/gora/util/ByteUtils.java:353:
warning: no description for @param
[ERROR] * @param offset
[ERROR] ^
[ERROR] /home/jenkins/jenkins-slave/workspace/gora-trunk/gora-core/src/main/java/org/apache/gora/util/ByteUtils.java:354:
warning: no description for @param
[ERROR] * @param length
[ERROR] ^
[ERROR] /home/jenkins/jenkins-slave/workspace/gora-trunk/gora-core/src/main/java/org/apache/gora/util/ByteUtils.java:372:
warning: no description for @param
[ERROR] * @param val
[ERROR] ^
[ERROR] /home/jenkins/jenkins-slave/workspace/gora-trunk/gora-core/src/main/java/org/apache/gora/util/ByteUtils.java:385:
warning: no description for @param
[ERROR] * @param bytes
[ERROR] ^
[ERROR] /home/jenkins/jenkins-slave/workspace/gora-trunk/gora-core/src/main/java/org/apache/gora/util/ByteUtils.java:394:
warning: no description for @param
[ERROR] * @param bytes
[ERROR] ^
[ERROR] /home/jenkins/jenkins-slave/workspace/gora-trunk/gora-core/src/main/java/org/apache/gora/util/ByteUtils.java:395:
warning: no description for @param
[ERROR] * @param offset
[ERROR] ^
[ERROR] /home/jenkins/jenkins-slave/workspace/gora-trunk/gora-core/src/main/java/org/apache/gora/util/ByteUtils.java:404:
warning: no description for @param
[ERROR] * @param bytes
[ERROR] ^
[ERROR] /home/jenkins/jenkins-slave/workspace/gora-trunk/gora-core/src/main/java/org/apache/gora/util/ByteUtils.java:405:
warning: no description for @param
[ERROR] * @param offset
[ERROR] ^
[ERROR] /home/jenkins/jenkins-slave/workspace/gora-trunk/gora-core/src/main/java/org/apache/gora/util/ByteUtils.java:406:
warning: no description for @param
[ERROR] * @param length
[ERROR] ^
[ERROR] /home/jenkins/jenkins-slave/workspace/gora-trunk/gora-core/src/main/java/org/apache/gora/util/ByteUtils.java:424:
warning: no description for @param
[ERROR] * @param val
[ERROR] ^
[ERROR] /home/jenkins/jenkins-slave/workspace/gora-trunk/gora-core/src/main/java/org/apache/gora/util/ByteUtils.java:438:
warning: no description for @param
[ERROR] * @param bytes
[ERROR] ^
[ERROR] /home/jenkins/jenkins-slave/workspace/gora-trunk/gora-core/src/main/java/org/apache/gora/util/ByteUtils.java:449:
warning: no description for @param
[ERROR] * @param bytes
[ERROR] ^
[ERROR] /home/jenkins/jenkins-slave/workspace/gora-trunk/gora-core/src/main/java/org/apache/gora/util/ByteUtils.java:450:
warning: no description for @param
[ERROR] * @param offset
[ERROR] ^
[ERROR] /home/jenkins/jenkins-slave/workspace/gora-trunk/gora-core/src/main/java/org/apache/gora/util/ByteUtils.java:460:
warning: no description for @param
[ERROR] * @param bytes
[ERROR] ^
[ERROR] /home/jenkins/jenkins-slave/workspace/gora-trunk/gora-core/src/main/java/org/apache/gora/util/ByteUtils.java:461:
warning: no description for @param
[ERROR] * @param offset
[ERROR] ^
[ERROR] /home/jenkins/jenkins-slave/workspace/gora-trunk/gora-core/src/main/java/org/apache/gora/util/ByteUtils.java:462:
warning: no description for @param
[ERROR] * @param length
[ERROR] ^
[ERROR] /home/jenkins/jenkins-slave/workspace/gora-trunk/gora-core/src/main/java/org/apache/gora/util/ByteUtils.java:480:
warning: no description for @param
[ERROR] * @param bytes
[ERROR] ^
[ERROR] /home/jenkins/jenkins-slave/workspace/gora-trunk/gora-core/src/main/java/org/apache/gora/util/ByteUtils.java:490:
warning: no description for @param
[ERROR] * @param bytes
[ERROR] ^
[ERROR] /home/jenkins/jenkins-slave/workspace/gora-trunk/gora-core/src/main/java/org/apache/gora/util/ByteUtils.java:491:
warning: no description for @param
[ERROR] * @param offset
[ERROR] ^
[ERROR] /home/jenkins/jenkins-slave/workspace/gora-trunk/gora-core/src/main/java/org/apache/gora/util/ByteUtils.java:501:
warning: no description for @param
[ERROR] * @param bytes
[ERROR] ^
[ERROR] /home/jenkins/jenkins-slave/workspace/gora-trunk/gora-core/src/main/java/org/apache/gora/util/ByteUtils.java:502:
warning: no description for @param
[ERROR] * @param offset
[ERROR] ^
[ERROR] /home/jenkins/jenkins-slave/workspace/gora-trunk/gora-core/src/main/java/org/apache/gora/util/ByteUtils.java:503:
warning: no description for @param
[ERROR] * @param length
[ERROR] ^
[ERROR] /home/jenkins/jenkins-slave/workspace/gora-trunk/gora-core/src/main/java/org/apache/gora/util/ByteUtils.java:562:
warning: no description for @param
[ERROR] * @param buffer
[ERROR] ^
[ERROR] /home/jenkins/jenkins-slave/workspace/gora-trunk/gora-core/src/main/java/org/apache/gora/util/ByteUtils.java:582:
warning: no description for @param
[ERROR] * @param buffer
[ERROR] ^
[ERROR] /home/jenkins/jenkins-slave/workspace/gora-trunk/gora-core/src/main/java/org/apache/gora/util/ByteUtils.java:605:
warning: no description for @throws
[ERROR] * @throws java.io.IOException
[ERROR] ^
[ERROR] /home/jenkins/jenkins-slave/workspace/gora-trunk/gora-core/src/main/java/org/apache/gora/util/ByteUtils.java:625:
warning: no description for @param
[ERROR] * @param left
[ERROR] ^
[ERROR] /home/jenkins/jenkins-slave/workspace/gora-trunk/gora-core/src/main/java/org/apache/gora/util/ByteUtils.java:626:
warning: no description for @param
[ERROR] * @param right
[ERROR] ^
[ERROR] /home/jenkins/jenkins-slave/workspace/gora-trunk/gora-core/src/main/java/org/apache/gora/util/ByteUtils.java:634:
warning: no description for @param
[ERROR] * @param b1
[ERROR] ^
[ERROR] /home/jenkins/jenkins-slave/workspace/gora-trunk/gora-core/src/main/java/org/apache/gora/util/ByteUtils.java:635:
warning: no description for @param
[ERROR] * @param b2
[ERROR] ^
[ERROR] /home/jenkins/jenkins-slave/workspace/gora-trunk/gora-core/src/main/java/org/apache/gora/util/ByteUtils.java:658:
warning: no description for @param
[ERROR] * @param left
[ERROR] ^
[ERROR] /home/jenkins/jenkins-slave/workspace/gora-trunk/gora-core/src/main/java/org/apache/gora/util/ByteUtils.java:659:
warning: no description for @param
[ERROR] * @param right
[ERROR] ^
[ERROR] /home/jenkins/jenkins-slave/workspace/gora-trunk/gora-core/src/main/java/org/apache/gora/util/ClassLoadingUtils.java:18:
warning: no @throws for java.lang.ClassNotFoundException
[ERROR] public static Class<?> loadClass(String className) throws ClassNotFoundException
{
[ERROR] ^
[ERROR] /home/jenkins/jenkins-slave/workspace/gora-trunk/gora-core/src/main/java/org/apache/gora/util/ClassLoadingUtils.java:32:
warning: no @throws for java.lang.ClassNotFoundException
[ERROR] public static Class<?> loadClass(Class<?> contextClass, String className)
throws ClassNotFoundException {
[ERROR] ^
[ERROR] /home/jenkins/jenkins-slave/workspace/gora-trunk/gora-core/src/main/java/org/apache/gora/util/IOUtils.java:102:
warning: no description for @throws
[ERROR] * @throws IOException */
[ERROR] ^
[ERROR] /home/jenkins/jenkins-slave/workspace/gora-trunk/gora-core/src/main/java/org/apache/gora/util/IOUtils.java:103:
warning: no @param for <T>
[ERROR] public static<T> void serialize(Configuration conf, DataOutput out
[ERROR] ^
[ERROR] /home/jenkins/jenkins-slave/workspace/gora-trunk/gora-core/src/main/java/org/apache/gora/util/IOUtils.java:103:
warning: no @param for conf
[ERROR] public static<T> void serialize(Configuration conf, DataOutput out
[ERROR] ^
[ERROR] /home/jenkins/jenkins-slave/workspace/gora-trunk/gora-core/src/main/java/org/apache/gora/util/IOUtils.java:103:
warning: no @param for out
[ERROR] public static<T> void serialize(Configuration conf, DataOutput out
[ERROR] ^
[ERROR] /home/jenkins/jenkins-slave/workspace/gora-trunk/gora-core/src/main/java/org/apache/gora/util/IOUtils.java:103:
warning: no @param for obj
[ERROR] public static<T> void serialize(Configuration conf, DataOutput out
[ERROR] ^
[ERROR] /home/jenkins/jenkins-slave/workspace/gora-trunk/gora-core/src/main/java/org/apache/gora/util/IOUtils.java:103:
warning: no @param for objClass
[ERROR] public static<T> void serialize(Configuration conf, DataOutput out
[ERROR] ^
[ERROR] /home/jenkins/jenkins-slave/workspace/gora-trunk/gora-core/src/main/java/org/apache/gora/util/IOUtils.java:133:
warning: no description for @throws
[ERROR] * @throws IOException */
[ERROR] ^
[ERROR] /home/jenkins/jenkins-slave/workspace/gora-trunk/gora-core/src/main/java/org/apache/gora/util/IOUtils.java:135:
warning: no @param for <T>
[ERROR] public static<T> void serialize(Configuration conf, DataOutput out
[ERROR] ^
[ERROR] /home/jenkins/jenkins-slave/workspace/gora-trunk/gora-core/src/main/java/org/apache/gora/util/IOUtils.java:135:
warning: no @param for conf
[ERROR] public static<T> void serialize(Configuration conf, DataOutput out
[ERROR] ^
[ERROR] /home/jenkins/jenkins-slave/workspace/gora-trunk/gora-core/src/main/java/org/apache/gora/util/IOUtils.java:135:
warning: no @param for out
[ERROR] public static<T> void serialize(Configuration conf, DataOutput out
[ERROR] ^
[ERROR] /home/jenkins/jenkins-slave/workspace/gora-trunk/gora-core/src/main/java/org/apache/gora/util/IOUtils.java:135:
warning: no @param for obj
[ERROR] public static<T> void serialize(Configuration conf, DataOutput out
[ERROR] ^
[ERROR] /home/jenkins/jenkins-slave/workspace/gora-trunk/gora-core/src/main/java/org/apache/gora/util/IOUtils.java:143:
warning: no @param for <T>
[ERROR] public static<T> byte[] serialize(Configuration conf, T obj) throws IOException
{
[ERROR] ^
[ERROR] /home/jenkins/jenkins-slave/workspace/gora-trunk/gora-core/src/main/java/org/apache/gora/util/IOUtils.java:143:
warning: no @param for conf
[ERROR] public static<T> byte[] serialize(Configuration conf, T obj) throws IOException
{
[ERROR] ^
[ERROR] /home/jenkins/jenkins-slave/workspace/gora-trunk/gora-core/src/main/java/org/apache/gora/util/IOUtils.java:143:
warning: no @param for obj
[ERROR] public static<T> byte[] serialize(Configuration conf, T obj) throws IOException
{
[ERROR] ^
[ERROR] /home/jenkins/jenkins-slave/workspace/gora-trunk/gora-core/src/main/java/org/apache/gora/util/IOUtils.java:143:
warning: no @return
[ERROR] public static<T> byte[] serialize(Configuration conf, T obj) throws IOException
{
[ERROR] ^
[ERROR] /home/jenkins/jenkins-slave/workspace/gora-trunk/gora-core/src/main/java/org/apache/gora/util/IOUtils.java:143:
warning: no @throws for java.io.IOException
[ERROR] public static<T> byte[] serialize(Configuration conf, T obj) throws IOException
{
[ERROR] ^
[ERROR] /home/jenkins/jenkins-slave/workspace/gora-trunk/gora-core/src/main/java/org/apache/gora/util/IOUtils.java:153:
warning: no @param for <T>
[ERROR] public static<T extends SpecificRecord> void serialize(OutputStream os,
[ERROR] ^
[ERROR] /home/jenkins/jenkins-slave/workspace/gora-trunk/gora-core/src/main/java/org/apache/gora/util/IOUtils.java:153:
warning: no @param for os
[ERROR] public static<T extends SpecificRecord> void serialize(OutputStream os,
[ERROR] ^
[ERROR] /home/jenkins/jenkins-slave/workspace/gora-trunk/gora-core/src/main/java/org/apache/gora/util/IOUtils.java:153:
warning: no @param for datumWriter
[ERROR] public static<T extends SpecificRecord> void serialize(OutputStream os,
[ERROR] ^
[ERROR] /home/jenkins/jenkins-slave/workspace/gora-trunk/gora-core/src/main/java/org/apache/gora/util/IOUtils.java:153:
warning: no @param for object
[ERROR] public static<T extends SpecificRecord> void serialize(OutputStream os,
[ERROR] ^
[ERROR] /home/jenkins/jenkins-slave/workspace/gora-trunk/gora-core/src/main/java/org/apache/gora/util/IOUtils.java:153:
warning: no @throws for java.io.IOException
[ERROR] public static<T extends SpecificRecord> void serialize(OutputStream os,
[ERROR] ^
[ERROR] /home/jenkins/jenkins-slave/workspace/gora-trunk/gora-core/src/main/java/org/apache/gora/util/IOUtils.java:165:
warning: no @param for <T>
[ERROR] public static<T> void serialize(OutputStream os,
[ERROR] ^
[ERROR] /home/jenkins/jenkins-slave/workspace/gora-trunk/gora-core/src/main/java/org/apache/gora/util/IOUtils.java:165:
warning: no @param for os
[ERROR] public static<T> void serialize(OutputStream os,
[ERROR] ^
[ERROR] /home/jenkins/jenkins-slave/workspace/gora-trunk/gora-core/src/main/java/org/apache/gora/util/IOUtils.java:165:
warning: no @param for datumWriter
[ERROR] public static<T> void serialize(OutputStream os,
[ERROR] ^
[ERROR] /home/jenkins/jenkins-slave/workspace/gora-trunk/gora-core/src/main/java/org/apache/gora/util/IOUtils.java:165:
warning: no @param for object
[ERROR] public static<T> void serialize(OutputStream os,
[ERROR] ^
[ERROR] /home/jenkins/jenkins-slave/workspace/gora-trunk/gora-core/src/main/java/org/apache/gora/util/IOUtils.java:165:
warning: no @throws for java.io.IOException
[ERROR] public static<T> void serialize(OutputStream os,
[ERROR] ^
[ERROR] /home/jenkins/jenkins-slave/workspace/gora-trunk/gora-core/src/main/java/org/apache/gora/util/IOUtils.java:177:
warning: no @param for <T>
[ERROR] public static<T extends SpecificRecord> byte[] serialize(SpecificDatumWriter<T>
datumWriter
[ERROR] ^
[ERROR] /home/jenkins/jenkins-slave/workspace/gora-trunk/gora-core/src/main/java/org/apache/gora/util/IOUtils.java:177:
warning: no @param for datumWriter
[ERROR] public static<T extends SpecificRecord> byte[] serialize(SpecificDatumWriter<T>
datumWriter
[ERROR] ^
[ERROR] /home/jenkins/jenkins-slave/workspace/gora-trunk/gora-core/src/main/java/org/apache/gora/util/IOUtils.java:177:
warning: no @param for object
[ERROR] public static<T extends SpecificRecord> byte[] serialize(SpecificDatumWriter<T>
datumWriter
[ERROR] ^
[ERROR] /home/jenkins/jenkins-slave/workspace/gora-trunk/gora-core/src/main/java/org/apache/gora/util/IOUtils.java:177:
warning: no @return
[ERROR] public static<T extends SpecificRecord> byte[] serialize(SpecificDatumWriter<T>
datumWriter
[ERROR] ^
[ERROR] /home/jenkins/jenkins-slave/workspace/gora-trunk/gora-core/src/main/java/org/apache/gora/util/IOUtils.java:177:
warning: no @throws for java.io.IOException
[ERROR] public static<T extends SpecificRecord> byte[] serialize(SpecificDatumWriter<T>
datumWriter
[ERROR] ^
[ERROR] /home/jenkins/jenkins-slave/workspace/gora-trunk/gora-core/src/main/java/org/apache/gora/util/IOUtils.java:187:
warning: no @param for <T>
[ERROR] public static<T> byte[] serialize(SpecificDatumWriter<T> datumWriter
[ERROR] ^
[ERROR] /home/jenkins/jenkins-slave/workspace/gora-trunk/gora-core/src/main/java/org/apache/gora/util/IOUtils.java:187:
warning: no @param for datumWriter
[ERROR] public static<T> byte[] serialize(SpecificDatumWriter<T> datumWriter
[ERROR] ^
[ERROR] /home/jenkins/jenkins-slave/workspace/gora-trunk/gora-core/src/main/java/org/apache/gora/util/IOUtils.java:187:
warning: no @param for object
[ERROR] public static<T> byte[] serialize(SpecificDatumWriter<T> datumWriter
[ERROR] ^
[ERROR] /home/jenkins/jenkins-slave/workspace/gora-trunk/gora-goraci/src/main/java/org/apache/gora/goraci/generated/CINode.java:122:
error: @param name not found
[ERROR] * @param value the value to set.
[ERROR] ^
[ERROR] /home/jenkins/jenkins-slave/workspace/gora-trunk/gora-goraci/src/main/java/org/apache/gora/goraci/generated/CINode.java:146:
error: @param name not found
[ERROR] * @param value the value to set.
[ERROR] ^
[ERROR] /home/jenkins/jenkins-slave/workspace/gora-trunk/gora-goraci/src/main/java/org/apache/gora/goraci/generated/CINode.java:170:
error: @param name not found
[ERROR] * @param value the value to set.
[ERROR] ^
[ERROR] /home/jenkins/jenkins-slave/workspace/gora-trunk/gora-goraci/src/main/java/org/apache/gora/goraci/generated/CINode.java:369:
error: @param name not found
[ERROR] * @param value the value to set.
[ERROR] ^
[ERROR] /home/jenkins/jenkins-slave/workspace/gora-trunk/gora-goraci/src/main/java/org/apache/gora/goraci/generated/CINode.java:392:
error: @param name not found
[ERROR] * @param value the value to set.
[ERROR] ^
[ERROR] /home/jenkins/jenkins-slave/workspace/gora-trunk/gora-goraci/src/main/java/org/apache/gora/goraci/generated/CINode.java:415:
error: @param name not found
[ERROR] * @param value the value to set.
[ERROR] ^
[ERROR] /home/jenkins/jenkins-slave/workspace/gora-trunk/gora-goraci/src/main/java/org/apache/gora/goraci/generated/Flushed.java:112:
error: @param name not found
[ERROR] * @param value the value to set.
[ERROR] ^
[ERROR] /home/jenkins/jenkins-slave/workspace/gora-trunk/gora-goraci/src/main/java/org/apache/gora/goraci/generated/Flushed.java:250:
error: @param name not found
[ERROR] * @param value the value to set.
[ERROR] ^
[ERROR] /home/jenkins/jenkins-slave/workspace/gora-trunk/gora-tutorial/src/main/java/org/apache/gora/tutorial/log/generated/MetricDatum.java:122:
error: @param name not found
[ERROR] * @param value the value to set.
[ERROR] ^
[ERROR] /home/jenkins/jenkins-slave/workspace/gora-trunk/gora-tutorial/src/main/java/org/apache/gora/tutorial/log/generated/MetricDatum.java:146:
error: @param name not found
[ERROR] * @param value the value to set.
[ERROR] ^
[ERROR] /home/jenkins/jenkins-slave/workspace/gora-trunk/gora-tutorial/src/main/java/org/apache/gora/tutorial/log/generated/MetricDatum.java:170:
error: @param name not found
[ERROR] * @param value the value to set.
[ERROR] ^
[ERROR] /home/jenkins/jenkins-slave/workspace/gora-trunk/gora-tutorial/src/main/java/org/apache/gora/tutorial/log/generated/MetricDatum.java:369:
error: @param name not found
[ERROR] * @param value the value to set.
[ERROR] ^
[ERROR] /home/jenkins/jenkins-slave/workspace/gora-trunk/gora-tutorial/src/main/java/org/apache/gora/tutorial/log/generated/MetricDatum.java:392:
error: @param name not found
[ERROR] * @param value the value to set.
[ERROR] ^
[ERROR] /home/jenkins/jenkins-slave/workspace/gora-trunk/gora-tutorial/src/main/java/org/apache/gora/tutorial/log/generated/MetricDatum.java:415:
error: @param name not found
[ERROR] * @param value the value to set.
[ERROR] ^
[ERROR] /home/jenkins/jenkins-slave/workspace/gora-trunk/gora-tutorial/src/main/java/org/apache/gora/tutorial/log/generated/Pageview.java:147:
error: @param name not found
[ERROR] * @param value the value to set.
[ERROR] ^
[ERROR] /home/jenkins/jenkins-slave/workspace/gora-trunk/gora-tutorial/src/main/java/org/apache/gora/tutorial/log/generated/Pageview.java:171:
error: @param name not found
[ERROR] * @param value the value to set.
[ERROR] ^
[ERROR] /home/jenkins/jenkins-slave/workspace/gora-trunk/gora-tutorial/src/main/java/org/apache/gora/tutorial/log/generated/Pageview.java:195:
error: @param name not found
[ERROR] * @param value the value to set.
[ERROR] ^
[ERROR] /home/jenkins/jenkins-slave/workspace/gora-trunk/gora-tutorial/src/main/java/org/apache/gora/tutorial/log/generated/Pageview.java:219:
error: @param name not found
[ERROR] * @param value the value to set.
[ERROR] ^
[ERROR] /home/jenkins/jenkins-slave/workspace/gora-trunk/gora-tutorial/src/main/java/org/apache/gora/tutorial/log/generated/Pageview.java:243:
error: @param name not found
[ERROR] * @param value the value to set.
[ERROR] ^
[ERROR] /home/jenkins/jenkins-slave/workspace/gora-trunk/gora-tutorial/src/main/java/org/apache/gora/tutorial/log/generated/Pageview.java:267:
error: @param name not found
[ERROR] * @param value the value to set.
[ERROR] ^
[ERROR] /home/jenkins/jenkins-slave/workspace/gora-trunk/gora-tutorial/src/main/java/org/apache/gora/tutorial/log/generated/Pageview.java:291:
error: @param name not found
[ERROR] * @param value the value to set.
[ERROR] ^
[ERROR] /home/jenkins/jenkins-slave/workspace/gora-trunk/gora-tutorial/src/main/java/org/apache/gora/tutorial/log/generated/Pageview.java:315:
error: @param name not found
[ERROR] * @param value the value to set.
[ERROR] ^
[ERROR] /home/jenkins/jenkins-slave/workspace/gora-trunk/gora-tutorial/src/main/java/org/apache/gora/tutorial/log/generated/Pageview.java:668:
error: @param name not found
[ERROR] * @param value the value to set.
[ERROR] ^
[ERROR] /home/jenkins/jenkins-slave/workspace/gora-trunk/gora-tutorial/src/main/java/org/apache/gora/tutorial/log/generated/Pageview.java:691:
error: @param name not found
[ERROR] * @param value the value to set.
[ERROR] ^
[ERROR] /home/jenkins/jenkins-slave/workspace/gora-trunk/gora-tutorial/src/main/java/org/apache/gora/tutorial/log/generated/Pageview.java:714:
error: @param name not found
[ERROR] * @param value the value to set.
[ERROR] ^
[ERROR] /home/jenkins/jenkins-slave/workspace/gora-trunk/gora-tutorial/src/main/java/org/apache/gora/tutorial/log/generated/Pageview.java:737:
error: @param name not found
[ERROR] * @param value the value to set.
[ERROR] ^
[ERROR] /home/jenkins/jenkins-slave/workspace/gora-trunk/gora-tutorial/src/main/java/org/apache/gora/tutorial/log/generated/Pageview.java:760:
error: @param name not found
[ERROR] * @param value the value to set.
[ERROR] ^
[ERROR] /home/jenkins/jenkins-slave/workspace/gora-trunk/gora-tutorial/src/main/java/org/apache/gora/tutorial/log/generated/Pageview.java:783:
error: @param name not found
[ERROR] * @param value the value to set.
[ERROR] ^
[ERROR] /home/jenkins/jenkins-slave/workspace/gora-trunk/gora-tutorial/src/main/java/org/apache/gora/tutorial/log/generated/Pageview.java:806:
error: @param name not found
[ERROR] * @param value the value to set.
[ERROR] ^
[ERROR] /home/jenkins/jenkins-slave/workspace/gora-trunk/gora-tutorial/src/main/java/org/apache/gora/tutorial/log/generated/Pageview.java:829:
error: @param name not found
[ERROR] * @param value the value to set.
[ERROR] ^
[ERROR] 
[ERROR] Command line was: /usr/local/asfpackages/java/jdk1.8.0_102/jre/../bin/javadoc @options
@packages
[ERROR] 
[ERROR] Refer to the generated Javadoc files in '/home/jenkins/jenkins-slave/workspace/gora-trunk/target/site/apidocs'
dir.
[ERROR] -> [Help 1]
[ERROR] 
[ERROR] To see the full stack trace of the errors, re-run Maven with the -e switch.
[ERROR] Re-run Maven using the -X switch to enable full debug logging.
[ERROR] 
[ERROR] For more information about the errors and possible solutions, please read the following
articles:
[ERROR] [Help 1] http://cwiki.apache.org/confluence/display/MAVEN/MojoExecutionException

{code}

We need to fix this.



--
This message was sent by Atlassian JIRA
(v6.3.4#6332)

Mime
View raw message