gora-dev mailing list archives

Site index · List index
Message view « Date » · « Thread »
Top « Date » · « Thread »
From Apache Jenkins Server <jenk...@builds.apache.org>
Subject Build failed in Jenkins: gora-trunk #164
Date Thu, 01 Mar 2012 16:09:36 GMT
See <https://builds.apache.org/job/gora-trunk/164/changes>

Changes:

[ferdy] GORA-101 HBaseStore should properly support multiple tables in the mapping file.

------------------------------------------
[...truncated 2255 lines...]
	at sun.nio.ch.ServerSocketChannelImpl.accept(ServerSocketChannelImpl.java:159)
	at sun.nio.ch.ServerSocketAdaptor.accept(ServerSocketAdaptor.java:84)
	at org.apache.hadoop.hdfs.server.datanode.DataXceiverServer.run(DataXceiverServer.java:130)
	at java.lang.Thread.run(Thread.java:662)

12/03/01 16:08:39 INFO datanode.DataBlockScanner: Exiting DataBlockScanner thread.
12/03/01 16:08:40 INFO hdfs.StateChange: BLOCK* ask 127.0.0.1:33379 to delete  blk_977749741867001287_1004
blk_-1143442878139713658_1003
12/03/01 16:08:40 INFO datanode.DataNode: Waiting for threadgroup to exit, active threads
is 0
12/03/01 16:08:40 INFO datanode.DataNode: DatanodeRegistration(127.0.0.1:33379, storageID=DS-1255138620-67.195.138.8-33379-1330618105763,
infoPort=56978, ipcPort=53145):Finishing DataNode in: FSDataset{dirpath='<https://builds.apache.org/job/gora-trunk/ws/trunk./gora-core/target/test-data/dfs/data/data3/current,/home/jenkins/jenkins-slave/workspace/gora-trunk/trunk./gora-core/target/test-data/dfs/data/data4/current'}>
12/03/01 16:08:40 INFO ipc.Server: Stopping server on 53145
12/03/01 16:08:40 INFO datanode.DataNode: Waiting for threadgroup to exit, active threads
is 0
Shutting down DataNode 0
12/03/01 16:08:40 INFO ipc.Server: Stopping server on 51944
12/03/01 16:08:40 INFO ipc.Server: IPC Server handler 0 on 51944: exiting
12/03/01 16:08:40 INFO ipc.Server: IPC Server handler 2 on 51944: exiting
12/03/01 16:08:40 INFO ipc.Server: IPC Server handler 1 on 51944: exiting
12/03/01 16:08:40 INFO ipc.Server: Stopping IPC Server listener on 51944
12/03/01 16:08:40 INFO datanode.DataNode: Waiting for threadgroup to exit, active threads
is 1
12/03/01 16:08:40 WARN datanode.DataNode: DatanodeRegistration(127.0.0.1:59587, storageID=DS-251782611-67.195.138.8-59587-1330618105585,
infoPort=59609, ipcPort=51944):DataXceiveServer: java.nio.channels.AsynchronousCloseException
	at java.nio.channels.spi.AbstractInterruptibleChannel.end(AbstractInterruptibleChannel.java:185)
	at sun.nio.ch.ServerSocketChannelImpl.accept(ServerSocketChannelImpl.java:159)
	at sun.nio.ch.ServerSocketAdaptor.accept(ServerSocketAdaptor.java:84)
	at org.apache.hadoop.hdfs.server.datanode.DataXceiverServer.run(DataXceiverServer.java:130)
	at java.lang.Thread.run(Thread.java:662)

12/03/01 16:08:40 INFO ipc.Server: Stopping IPC Server Responder
12/03/01 16:08:40 INFO datanode.DataBlockScanner: Exiting DataBlockScanner thread.
12/03/01 16:08:41 INFO datanode.DataNode: Waiting for threadgroup to exit, active threads
is 0
12/03/01 16:08:41 INFO datanode.DataNode: DatanodeRegistration(127.0.0.1:59587, storageID=DS-251782611-67.195.138.8-59587-1330618105585,
infoPort=59609, ipcPort=51944):Finishing DataNode in: FSDataset{dirpath='<https://builds.apache.org/job/gora-trunk/ws/trunk./gora-core/target/test-data/dfs/data/data1/current,/home/jenkins/jenkins-slave/workspace/gora-trunk/trunk./gora-core/target/test-data/dfs/data/data2/current'}>
12/03/01 16:08:41 INFO ipc.Server: Stopping server on 51944
12/03/01 16:08:41 INFO datanode.DataNode: Waiting for threadgroup to exit, active threads
is 0
12/03/01 16:08:41 INFO namenode.DecommissionManager: Interrupted Monitor
java.lang.InterruptedException: sleep interrupted
	at java.lang.Thread.sleep(Native Method)
	at org.apache.hadoop.hdfs.server.namenode.DecommissionManager$Monitor.run(DecommissionManager.java:65)
	at java.lang.Thread.run(Thread.java:662)
12/03/01 16:08:41 WARN namenode.FSNamesystem: ReplicationMonitor thread received InterruptedException.java.lang.InterruptedException:
sleep interrupted
12/03/01 16:08:41 INFO namenode.FSNamesystem: Number of transactions: 33 Total time for transactions(ms):
1Number of transactions batched in Syncs: 0 Number of syncs: 18 SyncTimes(ms): 14 2 
12/03/01 16:08:41 INFO ipc.Server: Stopping server on 54854
12/03/01 16:08:41 INFO ipc.Server: IPC Server handler 1 on 54854: exiting
12/03/01 16:08:41 INFO ipc.Server: Stopping IPC Server listener on 54854
12/03/01 16:08:41 INFO ipc.Server: IPC Server handler 3 on 54854: exiting
12/03/01 16:08:41 INFO ipc.Server: IPC Server handler 2 on 54854: exiting
12/03/01 16:08:41 INFO ipc.Server: IPC Server handler 4 on 54854: exiting
Tests run: 2, Failures: 0, Errors: 0, Skipped: 0, Time elapsed: 34.502 sec
12/03/01 16:08:41 INFO ipc.Server: Stopping IPC Server Responder
12/03/01 16:08:41 INFO ipc.Server: IPC Server handler 0 on 54854: exiting
12/03/01 16:08:41 INFO ipc.Server: IPC Server handler 8 on 54854: exiting
12/03/01 16:08:41 INFO ipc.Server: IPC Server handler 6 on 54854: exiting
12/03/01 16:08:41 INFO ipc.Server: IPC Server handler 9 on 54854: exiting
12/03/01 16:08:41 INFO ipc.Server: IPC Server handler 5 on 54854: exiting
12/03/01 16:08:41 INFO ipc.Server: IPC Server handler 7 on 54854: exiting

Results :

Tests run: 56, Failures: 0, Errors: 0, Skipped: 0

[JENKINS] Recording test results
[INFO] 
[INFO] --- maven-bundle-plugin:2.3.6:bundle (default-bundle) @ gora-core ---
[INFO] [INFO] Copying hadoop-core-0.20.2.jar to <https://builds.apache.org/job/gora-trunk/ws/trunk./gora-core/lib/hadoop-core-0.20.2.jar>
[INFO] Copying paranamer-2.2.jar to <https://builds.apache.org/job/gora-trunk/ws/trunk./gora-core/lib/paranamer-2.2.jar>
[INFO] Copying oro-2.0.8.jar to <https://builds.apache.org/job/gora-trunk/ws/trunk./gora-core/lib/oro-2.0.8.jar>
[INFO] Copying slf4j-api-1.5.8.jar to <https://builds.apache.org/job/gora-trunk/ws/trunk./gora-core/lib/slf4j-api-1.5.8.jar>
[INFO] Copying ftpserver-deprecated-1.0.0-M2.jar to <https://builds.apache.org/job/gora-trunk/ws/trunk./gora-core/lib/ftpserver-deprecated-1.0.0-M2.jar>
[INFO] Copying hamcrest-core-1.1.jar to <https://builds.apache.org/job/gora-trunk/ws/trunk./gora-core/lib/hamcrest-core-1.1.jar>
[INFO] Copying log4j-1.2.16.jar to <https://builds.apache.org/job/gora-trunk/ws/trunk./gora-core/lib/log4j-1.2.16.jar>
[INFO] Copying servlet-api-2.5-6.1.14.jar to <https://builds.apache.org/job/gora-trunk/ws/trunk./gora-core/lib/servlet-api-2.5-6.1.14.jar>
[INFO] Copying paranamer-ant-2.2.jar to <https://builds.apache.org/job/gora-trunk/ws/trunk./gora-core/lib/paranamer-ant-2.2.jar>
[INFO] Copying ftplet-api-1.0.0.jar to <https://builds.apache.org/job/gora-trunk/ws/trunk./gora-core/lib/ftplet-api-1.0.0.jar>
[INFO] Copying commons-net-1.4.1.jar to <https://builds.apache.org/job/gora-trunk/ws/trunk./gora-core/lib/commons-net-1.4.1.jar>
[INFO] Copying commons-httpclient-3.0.1.jar to <https://builds.apache.org/job/gora-trunk/ws/trunk./gora-core/lib/commons-httpclient-3.0.1.jar>
[INFO] Copying commons-lang-2.6.jar to <https://builds.apache.org/job/gora-trunk/ws/trunk./gora-core/lib/commons-lang-2.6.jar>
[INFO] Copying jsp-api-2.1-6.1.14.jar to <https://builds.apache.org/job/gora-trunk/ws/trunk./gora-core/lib/jsp-api-2.1-6.1.14.jar>
[INFO] Copying jasper-compiler-5.5.12.jar to <https://builds.apache.org/job/gora-trunk/ws/trunk./gora-core/lib/jasper-compiler-5.5.12.jar>
[INFO] Copying commons-logging-1.0.3.jar to <https://builds.apache.org/job/gora-trunk/ws/trunk./gora-core/lib/commons-logging-1.0.3.jar>
[INFO] Copying kfs-0.3.jar to <https://builds.apache.org/job/gora-trunk/ws/trunk./gora-core/lib/kfs-0.3.jar>
[INFO] Copying jasper-runtime-5.5.12.jar to <https://builds.apache.org/job/gora-trunk/ws/trunk./gora-core/lib/jasper-runtime-5.5.12.jar>
[INFO] Copying jsp-2.1-6.1.14.jar to <https://builds.apache.org/job/gora-trunk/ws/trunk./gora-core/lib/jsp-2.1-6.1.14.jar>
[INFO] Copying asm-3.2.jar to <https://builds.apache.org/job/gora-trunk/ws/trunk./gora-core/lib/asm-3.2.jar>
[INFO] Copying jetty-6.1.14.jar to <https://builds.apache.org/job/gora-trunk/ws/trunk./gora-core/lib/jetty-6.1.14.jar>
[INFO] Copying jackson-mapper-asl-1.4.2.jar to <https://builds.apache.org/job/gora-trunk/ws/trunk./gora-core/lib/jackson-mapper-asl-1.4.2.jar>
[INFO] Copying qdox-1.10.1.jar to <https://builds.apache.org/job/gora-trunk/ws/trunk./gora-core/lib/qdox-1.10.1.jar>
[INFO] Copying ant-launcher-1.7.1.jar to <https://builds.apache.org/job/gora-trunk/ws/trunk./gora-core/lib/ant-launcher-1.7.1.jar>
[INFO] Copying ant-1.7.1.jar to <https://builds.apache.org/job/gora-trunk/ws/trunk./gora-core/lib/ant-1.7.1.jar>
[INFO] Copying paranamer-generator-2.2.jar to <https://builds.apache.org/job/gora-trunk/ws/trunk./gora-core/lib/paranamer-generator-2.2.jar>
[INFO] Copying junit-4.10.jar to <https://builds.apache.org/job/gora-trunk/ws/trunk./gora-core/lib/junit-4.10.jar>
[INFO] Copying hadoop-test-0.20.2.jar to <https://builds.apache.org/job/gora-trunk/ws/trunk./gora-core/lib/hadoop-test-0.20.2.jar>
[INFO] Copying xmlenc-0.52.jar to <https://builds.apache.org/job/gora-trunk/ws/trunk./gora-core/lib/xmlenc-0.52.jar>
[INFO] Copying jackson-core-asl-1.4.2.jar to <https://builds.apache.org/job/gora-trunk/ws/trunk./gora-core/lib/jackson-core-asl-1.4.2.jar>
[INFO] Copying mina-core-2.0.0-M5.jar to <https://builds.apache.org/job/gora-trunk/ws/trunk./gora-core/lib/mina-core-2.0.0-M5.jar>
[INFO] Copying slf4j-simple-1.5.8.jar to <https://builds.apache.org/job/gora-trunk/ws/trunk./gora-core/lib/slf4j-simple-1.5.8.jar>
[INFO] Copying jetty-util-6.1.14.jar to <https://builds.apache.org/job/gora-trunk/ws/trunk./gora-core/lib/jetty-util-6.1.14.jar>
[INFO] Copying ftpserver-core-1.0.0.jar to <https://builds.apache.org/job/gora-trunk/ws/trunk./gora-core/lib/ftpserver-core-1.0.0.jar>
[INFO] Copying commons-el-1.0.jar to <https://builds.apache.org/job/gora-trunk/ws/trunk./gora-core/lib/commons-el-1.0.jar>
[INFO] Copying avro-1.3.3.jar to <https://builds.apache.org/job/gora-trunk/ws/trunk./gora-core/lib/avro-1.3.3.jar>

[INFO] Copying ant-1.6.5.jar to <https://builds.apache.org/job/gora-trunk/ws/trunk./gora-core/lib/ant-1.6.5.jar>
[INFO] --- maven-dependency-plugin:2.4:copy-dependencies (default) @ gora-core ---
[INFO] Copying commons-codec-1.3.jar to <https://builds.apache.org/job/gora-trunk/ws/trunk./gora-core/lib/commons-codec-1.3.jar>
[INFO] Copying commons-cli-1.2.jar to <https://builds.apache.org/job/gora-trunk/ws/trunk./gora-core/lib/commons-cli-1.2.jar>
[INFO] 
[INFO] --- maven-jar-plugin:2.4:jar (default) @ gora-core ---
[INFO] 
[INFO] --- maven-jar-plugin:2.4:test-jar (default) @ gora-core ---
[INFO] Building jar: <https://builds.apache.org/job/gora-trunk/ws/trunk./gora-core/target/gora-core-0.2-SNAPSHOT-tests.jar>
[INFO] [INFO] Installing <https://builds.apache.org/job/gora-trunk/ws/trunk./gora-core/target/gora-core-0.2-SNAPSHOT.jar>
to /home/jenkins/jenkins-slave/maven-repositories/0/org/apache/gora/gora-core/0.2-SNAPSHOT/gora-core-0.2-SNAPSHOT.jar
[INFO] Installing <https://builds.apache.org/job/gora-trunk/ws/trunk./gora-core/pom.xml>
to /home/jenkins/jenkins-slave/maven-repositories/0/org/apache/gora/gora-core/0.2-SNAPSHOT/gora-core-0.2-SNAPSHOT.pom
[INFO] Installing <https://builds.apache.org/job/gora-trunk/ws/trunk./gora-core/target/gora-core-0.2-SNAPSHOT-tests.jar>
to /home/jenkins/jenkins-slave/maven-repositories/0/org/apache/gora/gora-core/0.2-SNAPSHOT/gora-core-0.2-SNAPSHOT-tests.jar

[INFO] --- maven-install-plugin:2.3.1:install (default-install) @ gora-core ---
[INFO] 
[INFO] --- maven-bundle-plugin:2.3.6:install (default-install) @ gora-core ---
[INFO] Installing org/apache/gora/gora-core/0.2-SNAPSHOT/gora-core-0.2-SNAPSHOT.jar
[INFO] Writing OBR metadata
[JENKINS] Archiving <https://builds.apache.org/job/gora-trunk/ws/trunk./gora-core/pom.xml>
to /home/hudson/hudson/jobs/gora-trunk/modules/org.apache.gora$gora-core/builds/2012-03-01_16-06-53/archive/org.apache.gora/gora-core/0.2-SNAPSHOT/gora-core-0.2-SNAPSHOT.pom
[JENKINS] Archiving <https://builds.apache.org/job/gora-trunk/ws/trunk./gora-core/target/gora-core-0.2-SNAPSHOT.jar>
to /home/hudson/hudson/jobs/gora-trunk/modules/org.apache.gora$gora-core/builds/2012-03-01_16-06-53/archive/org.apache.gora/gora-core/0.2-SNAPSHOT/gora-core-0.2-SNAPSHOT.jar
[JENKINS] Archiving <https://builds.apache.org/job/gora-trunk/ws/trunk./gora-core/target/gora-core-0.2-SNAPSHOT-tests.jar>
to /home/hudson/hudson/jobs/gora-trunk/modules/org.apache.gora$gora-core/builds/2012-03-01_16-06-53/archive/org.apache.gora/gora-core/0.2-SNAPSHOT/gora-core-0.2-SNAPSHOT-tests.jar
[INFO]                                                                         
[INFO] ------------------------------------------------------------------------
[INFO] Building Apache Gora :: Hbase 0.2-SNAPSHOT
[INFO] ------------------------------------------------------------------------
Downloading: http://repo1.maven.org/maven2/com/google/guava/guava/10.0.1/guava-10.0.1.pom
Downloading: http://people.apache.org/~rawson/repo/com/google/guava/guava/10.0.1/guava-10.0.1.pom
Downloading: http://download.java.net/maven/2/com/google/guava/guava/10.0.1/guava-10.0.1.pom
Downloading: http://repository.codehaus.org/com/google/guava/guava/10.0.1/guava-10.0.1.pom
Downloading: http://repo1.maven.org/maven2/com/google/guava/guava/10.0.1/guava-10.0.1.pom
Downloaded: http://repo1.maven.org/maven2/com/google/guava/guava/10.0.1/guava-10.0.1.pom (6
KB at 0.6 KB/sec)
Downloading: http://repo1.maven.org/maven2/com/google/guava/guava-parent/10.0.1/guava-parent-10.0.1.pom
Downloaded: http://repo1.maven.org/maven2/com/google/guava/guava-parent/10.0.1/guava-parent-10.0.1.pom
(2 KB at 0.9 KB/sec)
Downloading: http://repo1.maven.org/maven2/org/jdom/jdom/1.1.2/jdom-1.1.2.pom
Downloaded: http://repo1.maven.org/maven2/org/jdom/jdom/1.1.2/jdom-1.1.2.pom (2 KB at 1.5
KB/sec)
Downloading: http://repo1.maven.org/maven2/jaxen/jaxen/1.1.3/jaxen-1.1.3.pom
Downloaded: http://repo1.maven.org/maven2/jaxen/jaxen/1.1.3/jaxen-1.1.3.pom (10 KB at 6.1
KB/sec)
[JENKINS] Archiving <https://builds.apache.org/job/gora-trunk/ws/trunk./gora-hbase/pom.xml>
to /home/hudson/hudson/jobs/gora-trunk/modules/org.apache.gora$gora-hbase/builds/2012-03-01_16-06-53/archive/org.apache.gora/gora-hbase/0.2-SNAPSHOT/gora-hbase-0.2-SNAPSHOT.pom
[INFO] ------------------------------------------------------------------------
[INFO] Reactor Summary:
[INFO] 
[INFO] Apache Gora ....................................... SUCCESS [30.474s]
[INFO] Apache Gora :: Core ............................... SUCCESS [1:12.112s]
[INFO] Apache Gora :: Hbase .............................. FAILURE [35.534s]
[INFO] Apache Gora :: Cassandra .......................... SKIPPED
[INFO] Apache Gora :: SQL ................................ SKIPPED
[INFO] Apache Gora :: Tutorial ........................... SKIPPED
[INFO] ------------------------------------------------------------------------
[INFO] BUILD FAILURE
[INFO] ------------------------------------------------------------------------
[INFO] Total time: 2:26.207s
[INFO] Finished at: Thu Mar 01 16:09:33 UTC 2012
[INFO] Final Memory: 24M/90M
[INFO] ------------------------------------------------------------------------
mavenExecutionResult exceptions not empty
message : Failed to execute goal on project gora-hbase: Could not resolve dependencies for
project org.apache.gora:gora-hbase:bundle:0.2-SNAPSHOT: Failed to collect dependencies for
[org.apache.gora:gora-core:jar:0.2-SNAPSHOT (compile), org.apache.gora:gora-core:jar:tests:0.2-SNAPSHOT
(test), org.apache.hbase:hbase:jar:0.90.4 (compile), org.apache.hbase:hbase:jar:tests:0.90.4
(compile), org.apache.hadoop:avro:jar:1.3.3 (compile), org.jdom:jdom:jar:1.1.2 (compile),
org.slf4j:slf4j-api:jar:1.5.8 (compile), org.slf4j:slf4j-simple:jar:1.5.8 (compile), log4j:log4j:jar:1.2.16
(compile), junit:junit:jar:4.10 (compile), org.apache.hadoop:hadoop-test:jar:0.20.2 (compile)]
cause : Could not resolve dependencies for project org.apache.gora:gora-hbase:bundle:0.2-SNAPSHOT:
Failed to collect dependencies for [org.apache.gora:gora-core:jar:0.2-SNAPSHOT (compile),
org.apache.gora:gora-core:jar:tests:0.2-SNAPSHOT (test), org.apache.hbase:hbase:jar:0.90.4
(compile), org.apache.hbase:hbase:jar:tests:0.90.4 (compile), org.apache.hadoop:avro:jar:1.3.3
(compile), org.jdom:jdom:jar:1.1.2 (compile), org.slf4j:slf4j-api:jar:1.5.8 (compile), org.slf4j:slf4j-simple:jar:1.5.8
(compile), log4j:log4j:jar:1.2.16 (compile), junit:junit:jar:4.10 (compile), org.apache.hadoop:hadoop-test:jar:0.20.2
(compile)]
Stack trace : 
org.apache.maven.lifecycle.LifecycleExecutionException: Failed to execute goal on project
gora-hbase: Could not resolve dependencies for project org.apache.gora:gora-hbase:bundle:0.2-SNAPSHOT:
Failed to collect dependencies for [org.apache.gora:gora-core:jar:0.2-SNAPSHOT (compile),
org.apache.gora:gora-core:jar:tests:0.2-SNAPSHOT (test), org.apache.hbase:hbase:jar:0.90.4
(compile), org.apache.hbase:hbase:jar:tests:0.90.4 (compile), org.apache.hadoop:avro:jar:1.3.3
(compile), org.jdom:jdom:jar:1.1.2 (compile), org.slf4j:slf4j-api:jar:1.5.8 (compile), org.slf4j:slf4j-simple:jar:1.5.8
(compile), log4j:log4j:jar:1.2.16 (compile), junit:junit:jar:4.10 (compile), org.apache.hadoop:hadoop-test:jar:0.20.2
(compile)]
	at org.apache.maven.lifecycle.internal.LifecycleDependencyResolver.getDependencies(LifecycleDependencyResolver.java:196)
	at org.apache.maven.lifecycle.internal.LifecycleDependencyResolver.resolveProjectDependencies(LifecycleDependencyResolver.java:108)
	at org.apache.maven.lifecycle.internal.MojoExecutor.ensureDependenciesAreResolved(MojoExecutor.java:258)
	at org.apache.maven.lifecycle.internal.MojoExecutor.execute(MojoExecutor.java:201)
	at org.apache.maven.lifecycle.internal.MojoExecutor.execute(MojoExecutor.java:153)
	at org.apache.maven.lifecycle.internal.MojoExecutor.execute(MojoExecutor.java:145)
	at org.apache.maven.lifecycle.internal.LifecycleModuleBuilder.buildProject(LifecycleModuleBuilder.java:84)
	at org.apache.maven.lifecycle.internal.LifecycleModuleBuilder.buildProject(LifecycleModuleBuilder.java:59)
	at org.apache.maven.lifecycle.internal.LifecycleStarter.singleThreadedBuild(LifecycleStarter.java:183)
	at org.apache.maven.lifecycle.internal.LifecycleStarter.execute(LifecycleStarter.java:161)
	at org.apache.maven.DefaultMaven.doExecute(DefaultMaven.java:319)
	at org.apache.maven.DefaultMaven.execute(DefaultMaven.java:156)
	at org.jvnet.hudson.maven3.launcher.Maven3Launcher.main(Maven3Launcher.java:79)
	at sun.reflect.NativeMethodAccessorImpl.invoke0(Native Method)
	at sun.reflect.NativeMethodAccessorImpl.invoke(NativeMethodAccessorImpl.java:39)
	at sun.reflect.DelegatingMethodAccessorImpl.invoke(DelegatingMethodAccessorImpl.java:25)
	at java.lang.reflect.Method.invoke(Method.java:597)
	at org.codehaus.plexus.classworlds.launcher.Launcher.launchStandard(Launcher.java:329)
	at org.codehaus.plexus.classworlds.launcher.Launcher.launch(Launcher.java:239)
	at org.jvnet.hudson.maven3.agent.Maven3Main.launch(Maven3Main.java:158)
	at hudson.maven.Maven3Builder.call(Maven3Builder.java:104)
	at hudson.maven.Maven3Builder.call(Maven3Builder.java:70)
	at hudson.remoting.UserRequest.perform(UserRequest.java:118)
	at hudson.remoting.UserRequest.perform(UserRequest.java:48)
	at hudson.remoting.Request$2.run(Request.java:287)
	at hudson.remoting.InterceptingExecutorService$1.call(InterceptingExecutorService.java:72)
	at java.util.concurrent.FutureTask$Sync.innerRun(FutureTask.java:303)
	at java.util.concurrent.FutureTask.run(FutureTask.java:138)
	at java.util.concurrent.ThreadPoolExecutor$Worker.runTask(ThreadPoolExecutor.java:886)
	at java.util.concurrent.ThreadPoolExecutor$Worker.run(ThreadPoolExecutor.java:908)
	at java.lang.Thread.run(Thread.java:662)
Caused by: org.apache.maven.project.DependencyResolutionException: Could not resolve dependencies
for project org.apache.gora:gora-hbase:bundle:0.2-SNAPSHOT: Failed to collect dependencies
for [org.apache.gora:gora-core:jar:0.2-SNAPSHOT (compile), org.apache.gora:gora-core:jar:tests:0.2-SNAPSHOT
(test), org.apache.hbase:hbase:jar:0.90.4 (compile), org.apache.hbase:hbase:jar:tests:0.90.4
(compile), org.apache.hadoop:avro:jar:1.3.3 (compile), org.jdom:jdom:jar:1.1.2 (compile),
org.slf4j:slf4j-api:jar:1.5.8 (compile), org.slf4j:slf4j-simple:jar:1.5.8 (compile), log4j:log4j:jar:1.2.16
(compile), junit:junit:jar:4.10 (compile), org.apache.hadoop:hadoop-test:jar:0.20.2 (compile)]
	at org.apache.maven.project.DefaultProjectDependenciesResolver.resolve(DefaultProjectDependenciesResolver.java:139)
	at org.apache.maven.lifecycle.internal.LifecycleDependencyResolver.getDependencies(LifecycleDependencyResolver.java:171)
	... 30 more
Caused by: org.sonatype.aether.collection.DependencyCollectionException: Failed to collect
dependencies for [org.apache.gora:gora-core:jar:0.2-SNAPSHOT (compile), org.apache.gora:gora-core:jar:tests:0.2-SNAPSHOT
(test), org.apache.hbase:hbase:jar:0.90.4 (compile), org.apache.hbase:hbase:jar:tests:0.90.4
(compile), org.apache.hadoop:avro:jar:1.3.3 (compile), org.jdom:jdom:jar:1.1.2 (compile),
org.slf4j:slf4j-api:jar:1.5.8 (compile), org.slf4j:slf4j-simple:jar:1.5.8 (compile), log4j:log4j:jar:1.2.16
(compile), junit:junit:jar:4.10 (compile), org.apache.hadoop:hadoop-test:jar:0.20.2 (compile)]
	at org.sonatype.aether.impl.internal.DefaultDependencyCollector.collectDependencies(DefaultDependencyCollector.java:262)
	at org.sonatype.aether.impl.internal.DefaultRepositorySystem.collectDependencies(DefaultRepositorySystem.java:345)
	at org.apache.maven.project.DefaultProjectDependenciesResolver.resolve(DefaultProjectDependenciesResolver.java:131)
	... 31 more
Caused by: org.sonatype.aether.resolution.ArtifactDescriptorException: Failed to read artifact
descriptor for com.google.guava:guava:jar:10.0.1
	at org.apache.maven.repository.internal.DefaultArtifactDescriptorReader.loadPom(DefaultArtifactDescriptorReader.java:282)
	at org.apache.maven.repository.internal.DefaultArtifactDescriptorReader.readArtifactDescriptor(DefaultArtifactDescriptorReader.java:172)
	at org.sonatype.aether.impl.internal.DefaultDependencyCollector.process(DefaultDependencyCollector.java:419)
	at org.sonatype.aether.impl.internal.DefaultDependencyCollector.process(DefaultDependencyCollector.java:533)
	at org.sonatype.aether.impl.internal.DefaultDependencyCollector.collectDependencies(DefaultDependencyCollector.java:243)
	... 33 more
Caused by: org.sonatype.aether.resolution.ArtifactResolutionException: Could not transfer
artifact com.google.guava:guava:pom:10.0.1 from/to central (http://repo1.maven.org/maven2):
Error transferring file: Connection timed out
	at org.sonatype.aether.impl.internal.DefaultArtifactResolver.resolve(DefaultArtifactResolver.java:541)
	at org.sonatype.aether.impl.internal.DefaultArtifactResolver.resolveArtifacts(DefaultArtifactResolver.java:220)
	at org.sonatype.aether.impl.internal.DefaultArtifactResolver.resolveArtifact(DefaultArtifactResolver.java:197)
	at org.apache.maven.repository.internal.DefaultArtifactDescriptorReader.loadPom(DefaultArtifactDescriptorReader.java:267)
	... 37 more
Caused by: org.sonatype.aether.transfer.ArtifactTransferException: Could not transfer artifact
com.google.guava:guava:pom:10.0.1 from/to central (http://repo1.maven.org/maven2): Error transferring
file: Connection timed out
	at org.sonatype.aether.connector.wagon.WagonRepositoryConnector$4.wrap(WagonRepositoryConnector.java:949)
	at org.sonatype.aether.connector.wagon.WagonRepositoryConnector$4.wrap(WagonRepositoryConnector.java:940)
	at org.sonatype.aether.connector.wagon.WagonRepositoryConnector$GetTask.flush(WagonRepositoryConnector.java:695)
	at org.sonatype.aether.connector.wagon.WagonRepositoryConnector$GetTask.flush(WagonRepositoryConnector.java:689)
	at org.sonatype.aether.connector.wagon.WagonRepositoryConnector.get(WagonRepositoryConnector.java:445)
	at org.sonatype.aether.impl.internal.DefaultArtifactResolver.resolve(DefaultArtifactResolver.java:460)
	... 40 more
Caused by: org.apache.maven.wagon.TransferFailedException: Error transferring file: Connection
timed out
	at org.apache.maven.wagon.providers.http.LightweightHttpWagon.fillInputData(LightweightHttpWagon.java:143)
	at org.apache.maven.wagon.StreamWagon.getInputStream(StreamWagon.java:116)
	at org.apache.maven.wagon.StreamWagon.getIfNewer(StreamWagon.java:88)
	at org.apache.maven.wagon.StreamWagon.get(StreamWagon.java:61)
	at org.sonatype.aether.connector.wagon.WagonRepositoryConnector$GetTask.run(WagonRepositoryConnector.java:608)
	at org.sonatype.aether.util.concurrency.RunnableErrorForwarder$1.run(RunnableErrorForwarder.java:64)
	... 3 more
Caused by: java.net.ConnectException: Connection timed out
	at java.net.PlainSocketImpl.socketConnect(Native Method)
	at java.net.PlainSocketImpl.doConnect(PlainSocketImpl.java:351)
	at java.net.PlainSocketImpl.connectToAddress(PlainSocketImpl.java:213)
	at java.net.PlainSocketImpl.connect(PlainSocketImpl.java:200)
	at java.net.SocksSocketImpl.connect(SocksSocketImpl.java:366)
	at java.net.Socket.connect(Socket.java:529)
	at java.net.Socket.connect(Socket.java:478)
	at sun.net.NetworkClient.doConnect(NetworkClient.java:163)
	at sun.net.www.http.HttpClient.openServer(HttpClient.java:395)
	at sun.net.www.http.HttpClient.openServer(HttpClient.java:530)
	at sun.net.www.http.HttpClient.<init>(HttpClient.java:234)
	at sun.net.www.http.HttpClient.New(HttpClient.java:307)
	at sun.net.www.http.HttpClient.New(HttpClient.java:324)
	at sun.net.www.protocol.http.HttpURLConnection.getNewHttpClient(HttpURLConnection.java:970)
	at sun.net.www.protocol.http.HttpURLConnection.plainConnect(HttpURLConnection.java:911)
	at sun.net.www.protocol.http.HttpURLConnection.connect(HttpURLConnection.java:836)
	at sun.net.www.protocol.http.HttpURLConnection.getInputStream(HttpURLConnection.java:1172)
	at java.net.HttpURLConnection.getResponseCode(HttpURLConnection.java:379)
	at org.apache.maven.wagon.providers.http.LightweightHttpWagon.fillInputData(LightweightHttpWagon.java:115)
	... 8 more
Sending e-mails to: dev@gora.apache.org ferdy@apache.org
channel stopped
Updating GORA-101


Mime
View raw message