giraph-user mailing list archives

Site index · List index
Message view « Date » · « Thread »
Top « Date » · « Thread »
From Alexandre Fonseca <alexandrejorgefons...@gmail.com>
Subject Re: Giraph 1.1.0 Apache Giraph Distribution ........................ FAILURE and Unsupported major.minor version 51.0 error.
Date Tue, 11 Feb 2014 09:56:05 GMT
If you check your logs for that execution:
    yarn logs -applicationId application_1392081423052_0008

You'll most likely see it complaining that it can't find YarnApplicationMaster in the classpath. After much experimentation, I've had great success with the following command adapted to your specified paths:

HADOOP_CLASSPATH=$GIRAPH_HOME/giraph-examples/target/ jar $GIRAPH_HOME/giraph-examples/target/giraph-examples-1.1.0-SNAPSHOT-for-hadoop-2.2.0-jar-with-dependencies.jar org.apache.giraph.GiraphRunner org.apache.giraph.examples.SimpleShortestPathsComputation -vip  /user/guest/giraph/input/tiny_graph.txt -vif org.apache.giraph.io.formats.JsonLongDoubleFloatDoubleVertexInputFormat -op /user/guest/giraph/output/shortestpaths -vof org.apache.giraph.io.formats.IdWithValueTextOutputFormat -w 1 -yj giraph-examples-1.1.0-SNAPSHOT-for-hadoop-2.2.0-jar-with-dependencies.jar

If it is instead complaining about some mapreduce classes, you might have stumbled upon this related issue:
https://issues.apache.org/jira/browse/GIRAPH-814

Cheers,
Alex

On Monday, February 10, 2014 06:59:57 PM Rocky Grey wrote:
> I pulled the latest git repository again today and tried to package the
> application and the build was successful. Thanks for all the help. Lot of
> progress.
> 
> But when I tried to run the shortestpath example in Giraph got the
> foolowing error. I was able to run the wordcount example without any
> iisues. Did somebody else face the same problem ?
> 
> [root@sandbox bin]# hadoop jar
> $GIRAPH_HOME/giraph-examples/target/giraph-examples-1.1.0-SNAPSHOT-for-hadoo
> p-2.2.0-jar-with-dependencies.jar org.apache.giraph.GiraphRunner -D
> giraph.zkList="zkNode.net:2081"
> org.apache.giraph.examples.SimpleShortestPathsComputation -vif
> org.apache.giraph.io.formats.JsonLongDoubleFloatDoubleVertexInputFormat
> -vip /user/guest/giraph/input/tiny_graph.txt -vof
> org.apache.giraph.io.formats.IdWithValueTextOutputFormat -op
> /user/guest/giraph/output/shortestpaths -w 1
> 14/02/10 18:52:47 INFO utils.ConfigurationUtils: No edge input format
> specified. Ensure your InputFormat does not require one.
> 14/02/10 18:52:47 INFO utils.ConfigurationUtils: No edge output format
> specified. Ensure your OutputFormat does not require one.
> 14/02/10 18:52:47 INFO yarn.GiraphYarnClient: Final output path is: hdfs://
> sandbox.hortonworks.com:8020/user/guest/giraph/output/shortestpaths
> 14/02/10 18:52:47 INFO yarn.GiraphYarnClient: Running Client
> 14/02/10 18:52:47 INFO client.RMProxy: Connecting to ResourceManager at
> sandbox.hortonworks.com/10.0.2.15:8050
> 14/02/10 18:52:47 INFO yarn.GiraphYarnClient: Got node report from ASM for,
> nodeId=sandbox.hortonworks.com:45454, nodeAddress
> sandbox.hortonworks.com:8042, nodeRackName /default-rack, nodeNumContainers
> 0
> 14/02/10 18:52:47 INFO yarn.GiraphYarnClient: Defaulting per-task heap size
> to 1024MB.
> 14/02/10 18:52:47 INFO yarn.GiraphYarnClient: Obtained new Application ID:
> application_1392081423052_0008
> 14/02/10 18:52:47 INFO Configuration.deprecation: mapred.job.id is
> deprecated. Instead, use mapreduce.job.id
> 14/02/10 18:52:47 INFO yarn.GiraphYarnClient: Set the environment for the
> application master
> 14/02/10 18:52:47 INFO yarn.GiraphYarnClient: Environment for AM
> 
> :{CLASSPATH=${CLASSPATH}:./*:/etc/hadoop/conf:/usr/lib/hadoop/*:/usr/lib/had
> :oop/lib/*:/usr/lib/hadoop-hdfs/*:/usr/lib/hadoop-hdfs/lib/*:/usr/lib/hadoop
> :-yarn/*:/usr/lib/hadoop-yarn/lib/*:/usr/lib/hadoop-mapreduce/*:/usr/lib/had
> :oop-mapreduce/lib/*:$HADOOP_MAPRED_HOME/share/hadoop/mapreduce/*:$HADOOP_MA
> :PRED_HOME/share/hadoop/mapreduce/lib/*}
> 14/02/10 18:52:47 INFO yarn.GiraphYarnClient: buildLocalResourceMap ....
> 14/02/10 18:52:47 INFO Configuration.deprecation: mapred.output.dir is
> deprecated. Instead, use mapreduce.output.fileoutputformat.outputdir
> 14/02/10 18:52:48 INFO yarn.YarnUtils: Registered file in LocalResources ::
> hdfs://
> sandbox.hortonworks.com:8020/user/root/giraph_yarn_jar_cache/application_139
> 2081423052_0008/giraph-conf.xml 14/02/10 18:52:48 INFO
> yarn.GiraphYarnClient: LIB JARS :
> 14/02/10 18:52:48 INFO yarn.YarnUtils: Class path name .
> 14/02/10 18:52:48 INFO yarn.YarnUtils: base path checking .
> 14/02/10 18:52:48 INFO yarn.YarnUtils: Class path name null
> 14/02/10 18:52:48 INFO yarn.YarnUtils: base path checking null
> 14/02/10 18:52:48 INFO yarn.YarnUtils: Class path name /etc/hadoop/conf
> 14/02/10 18:52:48 INFO yarn.YarnUtils: base path checking /etc/hadoop/conf
> 14/02/10 18:52:48 INFO yarn.YarnUtils: Class path name /usr/lib/hadoop/lib/*
> 14/02/10 18:52:48 INFO yarn.YarnUtils: base path checking
> /usr/lib/hadoop/lib
> 14/02/10 18:52:48 INFO yarn.YarnUtils: Class path name /usr/lib/hadoop/.//*
> 14/02/10 18:52:48 INFO yarn.YarnUtils: base path checking /usr/lib/hadoop/./
> 14/02/10 18:52:48 INFO yarn.YarnUtils: Class path name
> /usr/lib/hadoop-hdfs/./
> 14/02/10 18:52:48 INFO yarn.YarnUtils: base path checking
> /usr/lib/hadoop-hdfs/./
> 14/02/10 18:52:48 INFO yarn.YarnUtils: Class path name
> /usr/lib/hadoop-hdfs/lib/*
> 14/02/10 18:52:48 INFO yarn.YarnUtils: base path checking
> /usr/lib/hadoop-hdfs/lib
> 14/02/10 18:52:48 INFO yarn.YarnUtils: Class path name
> /usr/lib/hadoop-hdfs/.//*
> 14/02/10 18:52:48 INFO yarn.YarnUtils: base path checking
> /usr/lib/hadoop-hdfs/./
> 14/02/10 18:52:48 INFO yarn.YarnUtils: Class path name
> /usr/lib/hadoop-yarn/lib/*
> 14/02/10 18:52:48 INFO yarn.YarnUtils: base path checking
> /usr/lib/hadoop-yarn/lib
> 14/02/10 18:52:48 INFO yarn.YarnUtils: Class path name
> /usr/lib/hadoop-yarn/.//*
> 14/02/10 18:52:48 INFO yarn.YarnUtils: base path checking
> /usr/lib/hadoop-yarn/./
> 14/02/10 18:52:48 INFO yarn.YarnUtils: Class path name
> /usr/lib/hadoop-mapreduce/lib/*
> 14/02/10 18:52:48 INFO yarn.YarnUtils: base path checking
> /usr/lib/hadoop-mapreduce/lib
> 14/02/10 18:52:48 INFO yarn.YarnUtils: Class path name
> /usr/lib/hadoop-mapreduce/.//*
> 14/02/10 18:52:48 INFO yarn.YarnUtils: base path checking
> /usr/lib/hadoop-mapreduce/./
> 14/02/10 18:52:48 INFO yarn.YarnUtils: Class path name
> 14/02/10 18:52:48 INFO yarn.YarnUtils: Class path name
> /usr/share/java/mysql-connector-java-5.1.17.jar
> 14/02/10 18:52:48 INFO yarn.YarnUtils: base path checking
> /usr/share/java/mysql-connector-java-5.1.17.jar
> 14/02/10 18:52:48 INFO yarn.YarnUtils: Class path name
> /usr/share/java/mysql-connector-java.jar
> 14/02/10 18:52:48 INFO yarn.YarnUtils: base path checking
> /usr/share/java/mysql-connector-java.jar
> 14/02/10 18:52:48 INFO yarn.YarnUtils: Class path name
> /usr/lib/hadoop-mapreduce/*
> 14/02/10 18:52:48 INFO yarn.YarnUtils: base path checking
> /usr/lib/hadoop-mapreduce
> 14/02/10 18:52:48 INFO yarn.GiraphYarnClient: ApplicationSumbissionContext
> for GiraphApplicationMaster launch container is populated.
> 14/02/10 18:52:48 INFO yarn.GiraphYarnClient: Submitting application to ASM
> 14/02/10 18:52:48 INFO impl.YarnClientImpl: Submitted application
> application_1392081423052_0008 to ResourceManager at
> sandbox.hortonworks.com/10.0.2.15:8050
> 14/02/10 18:52:48 INFO yarn.GiraphYarnClient: Got new appId after
> submission :application_1392081423052_0008
> 14/02/10 18:52:48 INFO yarn.GiraphYarnClient: GiraphApplicationMaster
> container request was submitted to ResourceManager for job: Giraph:
> org.apache.giraph.examples.SimpleShortestPathsComputation
> 14/02/10 18:52:49 INFO yarn.GiraphYarnClient: Giraph:
> org.apache.giraph.examples.SimpleShortestPathsComputation, Elapsed: 0.83
> secs
> 14/02/10 18:52:49 INFO yarn.GiraphYarnClient:
> appattempt_1392081423052_0008_000001, State: ACCEPTED, Containers used: 1
> 14/02/10 18:52:53 ERROR yarn.GiraphYarnClient: Giraph:
> org.apache.giraph.examples.SimpleShortestPathsComputation reports FAILED
> state, diagnostics show: Application application_1392081423052_0008 failed
> 2 times due to AM Container for appattempt_1392081423052_0008_000002 exited
> with  exitCode: 1 due to: Exception from container-launch:
> org.apache.hadoop.util.Shell$ExitCodeException:
>         at org.apache.hadoop.util.Shell.runCommand(Shell.java:464)
>         at org.apache.hadoop.util.Shell.run(Shell.java:379)
>         at
> org.apache.hadoop.util.Shell$ShellCommandExecutor.execute(Shell.java:589)
>         at
> org.apache.hadoop.yarn.server.nodemanager.DefaultContainerExecutor.launchCon
> tainer(DefaultContainerExecutor.java:195) at
> org.apache.hadoop.yarn.server.nodemanager.containermanager.launcher.Containe
> rLaunch.call(ContainerLaunch.java:283) at
> org.apache.hadoop.yarn.server.nodemanager.containermanager.launcher.Containe
> rLaunch.call(ContainerLaunch.java:79) at
> java.util.concurrent.FutureTask$Sync.innerRun(FutureTask.java:334)
>         at java.util.concurrent.FutureTask.run(FutureTask.java:166)
>         at
> java.util.concurrent.ThreadPoolExecutor.runWorker(ThreadPoolExecutor.java:11
> 10) at
> java.util.concurrent.ThreadPoolExecutor$Worker.run(ThreadPoolExecutor.java:6
> 03) at java.lang.Thread.run(Thread.java:722)
> 
> 
> .Failing this attempt.. Failing the application.
> 14/02/10 18:52:53 INFO yarn.GiraphYarnClient: Cleaning up HDFS distributed
> cache directory for Giraph job.
> 14/02/10 18:52:53 INFO yarn.GiraphYarnClient: Completed Giraph:
> org.apache.giraph.examples.SimpleShortestPathsComputation: FAILED, total
> running time: 0 minutes, 4 seconds.
> 
> On Sat, Feb 8, 2014 at 8:19 PM, Rocky Grey <rockygrey@gmail.com> wrote:
> > I changed the JAVA_HOME to jdk 7 and the unsupported error went away. But
> > the build error still persists.
> > 
> > On Sat, Feb 8, 2014 at 9:46 AM, Pavan Kumar A <pavanka@outlook.com> wrote:
> >> Regarding the unsupported major/ minor version. Since we upgraded Giraph
> >> to Java 7. Please check that you are not trying to launch the Giraph job
> >> with java 6
> >> Please specify your  "java -version"
> >> 
> >> ------------------------------
> >> From: rockygrey@gmail.com
> >> Date: Fri, 7 Feb 2014 20:17:52 -0800
> >> Subject: Re: Giraph 1.1.0 Apache Giraph Distribution
> >> ........................ FAILURE and Unsupported major.minor version 51.0
> >> error.
> >> To: user@giraph.apache.org
> >> 
> >> 
> >> Thanks for the reply.
> >> 
> >> I applied the patch and tried to rebild using the command
> >> 
> >> mvn -Phadoop_yarn -Dhadoop.version=2.2.0 -DskipTests clean package
> >> 
> >> The build still failed. I highlighted the potential problem areas in red.
> >> Is there an issue with the maven repository?
> >> 
> >> 
> >> [INFO] Scanning for projects...
> >> [INFO]
> >> ------------------------------------------------------------------------
> >> [INFO] Reactor Build Order:
> >> [INFO]
> >> [INFO] Apache Giraph Parent
> >> [INFO] Apache Giraph Core
> >> [INFO] Apache Giraph Examples
> >> [INFO] Apache Giraph Distribution
> >> [INFO]
> >> 
> >> [INFO]
> >> ------------------------------------------------------------------------
> >> [INFO] Building Apache Giraph Parent 1.1.0-SNAPSHOT
> >> [INFO]
> >> ------------------------------------------------------------------------
> >> [INFO]
> >> [INFO] --- maven-clean-plugin:2.5:clean (default-clean) @ giraph-parent
> >> ---
> >> [INFO]
> >> [INFO] --- mavanagaiata:0.5.0:branch (git-commit) @ giraph-parent ---
> >> [INFO]
> >> [INFO] --- mavanagaiata:0.5.0:commit (git-commit) @ giraph-parent ---
> >> [INFO]
> >> [INFO] --- maven-enforcer-plugin:1.2:enforce (default) @ giraph-parent
> >> ---
> >> [INFO] Skipping Rule Enforcement.
> >> [INFO]
> >> [INFO] --- maven-dependency-versions-check-plugin:2.0.2:check (default) @
> >> giraph-parent ---
> >> [INFO]
> >> [INFO] --- maven-dependency-plugin:2.8:analyze-only (default) @
> >> giraph-parent ---
> >> [INFO] Skipping plugin execution
> >> [INFO]
> >> [INFO] --- maven-dependency-plugin:2.8:analyze-duplicate (default) @
> >> giraph-parent ---
> >> [INFO] Skipping plugin execution
> >> [INFO]
> >> [INFO] --- maven-dependency-plugin:2.8:analyze-dep-mgt (default) @
> >> giraph-parent ---
> >> [INFO] Skipping plugin execution
> >> [INFO]
> >> [INFO] --- maven-duplicate-finder-plugin:1.0.4:check (default) @
> >> giraph-parent ---
> >> [INFO]
> >> 
> >> [INFO]
> >> ------------------------------------------------------------------------
> >> [INFO] Building Apache Giraph Core 1.1.0-SNAPSHOT
> >> [INFO]
> >> ------------------------------------------------------------------------
> >> [INFO]
> >> [INFO] --- maven-clean-plugin:2.5:clean (default-clean) @ giraph-core ---
> >> [INFO] Deleting /usr/local/giraph/giraph-release-1.1.0/giraph-core/target
> >> [INFO]
> >> [INFO] --- mavanagaiata:0.5.0:branch (git-commit) @ giraph-core ---
> >> [INFO]
> >> [INFO] --- mavanagaiata:0.5.0:commit (git-commit) @ giraph-core ---
> >> [INFO]
> >> [INFO] --- maven-enforcer-plugin:1.2:enforce (default) @ giraph-core ---
> >> [INFO] Skipping Rule Enforcement.
> >> [INFO]
> >> [INFO] --- maven-dependency-versions-check-plugin:2.0.2:check (default) @
> >> giraph-core ---
> >> [INFO]
> >> [INFO] --- munge-maven-plugin:1.0:munge (munge) @ giraph-core ---
> >> [INFO]
> >> [INFO] --- maven-resources-plugin:2.6:resources (default-resources) @
> >> giraph-core ---
> >> [INFO] Using 'UTF-8' encoding to copy filtered resources.
> >> [INFO] Copying 2 resources
> >> [INFO]
> >> [INFO] --- maven-compiler-plugin:3.0:compile (default-compile) @
> >> giraph-core ---
> >> [INFO] Changes detected - recompiling the module!
> >> [INFO] Compiling 602 source files to
> >> /usr/local/giraph/giraph-release-1.1.0/giraph-core/target/munged/classes
> >> [WARNING]
> >> /usr/local/giraph/giraph-release-1.1.0/giraph-core/target/munged/main/org
> >> /apache/giraph/utils/UnsafeByteArrayInputStream.java:[34,32]
> >> sun.misc.Unsafe is internal proprietary API and may be removed in a
> >> future release
> >> [WARNING]
> >> /usr/local/giraph/giraph-release-1.1.0/giraph-core/target/munged/main/org
> >> /apache/giraph/utils/UnsafeByteArrayInputStream.java:[37,29]
> >> sun.misc.Unsafe is internal proprietary API and may be removed in a
> >> future release
> >> [WARNING]
> >> /usr/local/giraph/giraph-release-1.1.0/giraph-core/target/munged/main/org
> >> /apache/giraph/utils/UnsafeByteArrayInputStream.java:[39,25]
> >> sun.misc.Unsafe is internal proprietary API and may be removed in a
> >> future release
> >> [WARNING]
> >> /usr/local/giraph/giraph-release-1.1.0/giraph-core/target/munged/main/org
> >> /apache/giraph/utils/UnsafeByteArrayOutputStream.java:[33,29]
> >> sun.misc.Unsafe is internal proprietary API and may be removed in a
> >> future release
> >> [WARNING]
> >> /usr/local/giraph/giraph-release-1.1.0/giraph-core/target/munged/main/org
> >> /apache/giraph/utils/UnsafeByteArrayOutputStream.java:[35,25]
> >> sun.misc.Unsafe is internal proprietary API and may be removed in a
> >> future release
> >> [WARNING]
> >> /usr/local/giraph/giraph-release-1.1.0/giraph-core/target/munged/main/org
> >> /apache/giraph/utils/UnsafeByteArrayOutputStream.java:[66,32]
> >> sun.misc.Unsafe is internal proprietary API and may be removed in a
> >> future release
> >> [WARNING]
> >> /usr/local/giraph/giraph-release-1.1.0/giraph-core/target/munged/main/org
> >> /apache/giraph/utils/DistributedCacheUtils.java: Some input files use or
> >> override a deprecated API.
> >> [WARNING]
> >> /usr/local/giraph/giraph-release-1.1.0/giraph-core/target/munged/main/org
> >> /apache/giraph/utils/DistributedCacheUtils.java: Recompile with
> >> -Xlint:deprecation for details.
> >> [WARNING]
> >> /usr/local/giraph/giraph-release-1.1.0/giraph-core/target/munged/main/org
> >> /apache/giraph/metrics/GiraphMetricsRegistry.java: Some input files use
> >> unchecked or unsafe operations.
> >> [WARNING]
> >> /usr/local/giraph/giraph-release-1.1.0/giraph-core/target/munged/main/org
> >> /apache/giraph/metrics/GiraphMetricsRegistry.java: Recompile with
> >> -Xlint:unchecked for details.
> >> [INFO]
> >> [INFO] --- maven-assembly-plugin:2.4:single (build-fat-jar) @ giraph-core
> >> ---
> >> [INFO] Building jar:
> >> /usr/local/giraph/giraph-release-1.1.0/giraph-core/target/giraph-1.1.0-SN
> >> APSHOT-for-hadoop-2.2.0-jar-with-dependencies.jar [INFO]
> >> [INFO] --- maven-antrun-plugin:1.6:run (default) @ giraph-core ---
> >> [INFO] Executing tasks
> >> 
> >> main:
> >> 2014-02-07 20:09:09,220 INFO  [main] conf.AllOptions
> >> (AllOptions.java:main(172)) - All Options:
> >> 
> >> boolean:
> >>   giraph.SplitMasterWorker => true (boolean)
> >>   giraph.ZkSkipAcl => true (boolean)
> >>   giraph.authenticate => false (boolean)
> >>   giraph.cleanupCheckpointsAfterSuccess => true (boolean)
> >>   giraph.createEdgeSourceVertices => true (boolean)
> >>   giraph.doOutputDuringComputation => false (boolean)
> >>   giraph.failFirstIpcPortBindAttempt => false (boolean)
> >>   giraph.isStaticGraph => false (boolean)
> >>   giraph.jmap.histo.enable => false (boolean)
> >>   giraph.jython.type.wrappers.edge.value => false (boolean)
> >>   giraph.jython.type.wrappers.incoming.message => false (boolean)
> >>   giraph.jython.type.wrappers.outgoing.message => false (boolean)
> >>   giraph.jython.type.wrappers.vertex.id => false (boolean)
> >>   giraph.jython.type.wrappers.vertex.value => false (boolean)
> >>   giraph.keepZooKeeperData => false (boolean)
> >>   giraph.localTestMode => false (boolean)
> >>   giraph.logThreadLayout => false (boolean)
> >>   giraph.metrics.enable => false (boolean)
> >>   giraph.nettyClientUseExecutionHandler => true (boolean)
> >>   giraph.nettyRequestEncoderUseDirectBuffers => false (boolean)
> >>   giraph.nettyServerUseExecutionHandler => true (boolean)
> >>   giraph.nettySimulateFirstRequestClosed => false (boolean)
> >>   giraph.nettySimulateFirstResponseFailed => false (boolean)
> >>   giraph.oneToAllMsgSending => false (boolean)
> >>   giraph.pure.yarn.job => false (boolean)
> >>   giraph.textoutputformat.reverse => false (boolean)
> >>   giraph.trackJobProgressOnClient => true (boolean)
> >>   giraph.useBigDataIOForMessages => false (boolean)
> >>   giraph.useInputSplitLocality => true (boolean)
> >>   giraph.useMessageSizeEncoding => false (boolean)
> >>   giraph.useOutOfCoreGraph => false (boolean)
> >>   giraph.useOutOfCoreMessages => false (boolean)
> >>   giraph.useSuperstepCounters => true (boolean)
> >>   giraph.useUnsafeSerialization => true (boolean)
> >>   giraph.vertex.resolver.create.on.msgs => true (boolean)
> >>   giraph.vertexOutputFormatThreadSafe => false (boolean)
> >>   giraph.zKForceSync => false (boolean)
> >>   giraph.zkIsExternal => true (boolean)
> >> 
> >> class:
> >>   giraph.aggregatorWriterClass => TextAggregatorWriter
> >> 
> >> [AggregatorWriter]  (class)
> >> 
> >>   giraph.computation.factory.class => DefaultComputationFactory
> >> 
> >> [ComputationFactory]  (class)
> >> 
> >>   giraph.computationClass => null [Computation]  (class)
> >>   giraph.edgeInputFilterClass => DefaultEdgeInputFilter
> >> 
> >> [EdgeInputFilter]  (class)
> >> 
> >>   giraph.edgeInputFormatClass => null [EdgeInputFormat]  (class)
> >>   giraph.edgeOutputFormatClass => null [EdgeOutputFormat]  (class)
> >>   giraph.edgeValueClass => null [Writable]  (class)
> >>   giraph.edgeValueFactoryClass => DefaultEdgeValueFactory
> >> 
> >> [EdgeValueFactory]  (class)
> >> 
> >>   giraph.graphPartitionerFactoryClass => HashPartitionerFactory
> >> 
> >> [GraphPartitionerFactory]  (class)
> >> 
> >>   giraph.haltInstructionsWriter => DefaultHaltInstructionsWriter
> >> 
> >> [HaltInstructionsWriter]  (class)
> >> 
> >>   giraph.incomingMessageValueClass => null [Writable]  (class)
> >>   giraph.incomingMessageValueFactoryClass =>
> >> 
> >> DefaultIncomingMessageValueFactory [MessageValueFactory]  (class)
> >> 
> >>   giraph.inputOutEdgesClass => ByteArrayEdges [OutEdges]  (class)
> >>   giraph.jobObserverClass => DefaultJobObserver [GiraphJobObserver]
> >> 
> >> (class)
> >> 
> >>   giraph.jobRetryCheckerClass => DefaultGiraphJobRetryChecker
> >> 
> >> [GiraphJobRetryChecker]  (class)
> >> 
> >>   giraph.master.observers => null [MasterObserver]  (class)
> >>   giraph.masterComputeClass => DefaultMasterCompute [MasterCompute]
> >> 
> >> (class)
> >> 
> >>   giraph.messageCombinerClass => null [MessageCombiner]  (class)
> >>   giraph.outEdgesClass => ByteArrayEdges [OutEdges]  (class)
> >>   giraph.outgoingMessageValueClass => null [Writable]  (class)
> >>   giraph.outgoingMessageValueFactoryClass =>
> >> 
> >> DefaultOutgoingMessageValueFactory [MessageValueFactory]  (class)
> >> 
> >>   giraph.partitionClass => SimplePartition [Partition]  (class)
> >>   giraph.typesHolder => null [TypesHolder]  (class)
> >>   giraph.vertexIdClass => null [WritableComparable]  (class)
> >>   giraph.vertexIdFactoryClass => DefaultVertexIdFactory
> >> 
> >> [VertexIdFactory]  (class)
> >> 
> >>   giraph.vertexInputFilterClass => DefaultVertexInputFilter
> >> 
> >> [VertexInputFilter]  (class)
> >> 
> >>   giraph.vertexInputFormatClass => null [VertexInputFormat]  (class)
> >>   giraph.vertexOutputFormatClass => null [VertexOutputFormat]  (class)
> >>   giraph.vertexResolverClass => DefaultVertexResolver [VertexResolver]
> >> 
> >> (class)
> >> 
> >>   giraph.vertexValueClass => null [Writable]  (class)
> >>   giraph.vertexValueCombinerClass => DefaultVertexValueCombiner
> >> 
> >> [VertexValueCombiner]  (class)
> >> 
> >>   giraph.vertexValueFactoryClass => DefaultVertexValueFactory
> >> 
> >> [VertexValueFactory]  (class)
> >> 
> >>   giraph.worker.observers => null [WorkerObserver]  (class)
> >>   giraph.workerContextClass => DefaultWorkerContext [WorkerContext]
> >> 
> >> (class)
> >> 
> >> enum:
> >>   giraph.computation.language => JAVA (enum)
> >>   giraph.types.language.edge.value => JAVA (enum)
> >>   giraph.types.language.incoming.message => JAVA (enum)
> >>   giraph.types.language.outgoing.message => JAVA (enum)
> >>   giraph.types.language.vertex.id => JAVA (enum)
> >>   giraph.types.language.vertex.value => JAVA (enum)
> >> 
> >> integer:
> >>   giraph.channelsPerServer => 1 (integer)
> >>   giraph.checkpointFrequency => 0 (integer)
> >>   giraph.clientReceiveBufferSize => 32768 (integer)
> >>   giraph.clientSendBufferSize => 524288 (integer)
> >>   giraph.edgeRequestSize => 524288 (integer)
> >>   giraph.eventWaitMsecs => 30000 (integer)
> >>   giraph.ipcInitialPort => 30000 (integer)
> >>   giraph.jmap.histo.msec => 30000 (integer)
> >>   giraph.jmap.histo.print_lines => 30 (integer)
> >>   giraph.maxIpcPortBindAttempts => 20 (integer)
> >>   giraph.maxMasterSuperstepWaitMsecs => 600000 (integer)
> >>   giraph.maxMessagesInMemory => 1000000 (integer)
> >>   giraph.maxMutationsPerRequest => 100 (integer)
> >>   giraph.maxNumberOfSupersteps => 1 (integer)
> >>   giraph.maxPartitionsInMemory => 10 (integer)
> >>   giraph.maxRequestMilliseconds => 600000 (integer)
> >>   giraph.maxResolveAddressAttempts => 5 (integer)
> >>   giraph.messagesBufferSize => 8192 (integer)
> >>   giraph.msgRequestSize => 524288 (integer)
> >>   giraph.nettyClientExecutionThreads => 8 (integer)
> >>   giraph.nettyClientThreads => 4 (integer)
> >>   giraph.nettyMaxConnectionFailures => 1000 (integer)
> >>   giraph.nettyRequestEncoderBufferSize => 32768 (integer)
> >>   giraph.nettyServerExecutionThreads => 8 (integer)
> >>   giraph.nettyServerThreads => 16 (integer)
> >>   giraph.numComputeThreads => 1 (integer)
> >>   giraph.numInputThreads => 1 (integer)
> >>   giraph.numOutputThreads => 1 (integer)
> >>   giraph.partitionLongTailMinPrint => 1 (integer)
> >>   giraph.serverReceiveBufferSize => 524288 (integer)
> >>   giraph.serverSendBufferSize => 32768 (integer)
> >>   giraph.tcpBacklog => 1 (integer)
> >>   giraph.userPartitionCount => -1 (integer)
> >>   giraph.vertexRequestSize => 524288 (integer)
> >>   giraph.waitTaskDoneTimeoutMs => 900000 (integer)
> >>   giraph.waitingRequestMsecs => 15000 (integer)
> >>   giraph.yarn.task.heap.mb => 1024 (integer)
> >>   giraph.zKMinSessionTimeout => 600000 (integer)
> >>   giraph.zkConnectionAttempts => 10 (integer)
> >>   giraph.zkMaxSessionTimeout => 900000 (integer)
> >>   giraph.zkOpsMaxAttempts => 3 (integer)
> >>   giraph.zkOpsRetryWaitMsecs => 5000 (integer)
> >>   giraph.zkServerCount => 1 (integer)
> >>   giraph.zkServerPort => 22181 (integer)
> >>   giraph.zkServerlistPollMsecs => 3000 (integer)
> >>   giraph.zkSessionMsecTimeout => 60000 (integer)
> >>   mapred.map.max.attempts => -1 (integer)
> >> 
> >> float:
> >>   giraph.additionalEdgeRequestSize => 0.2 (float)
> >>   giraph.additionalMsgRequestSize => 0.2 (float)
> >>   giraph.additionalVertexRequestSize => 0.2 (float)
> >>   giraph.inputSplitSamplePercent => 100.0 (float)
> >>   giraph.masterPartitionCountMultiplier => 1.0 (float)
> >>   giraph.minPercentResponded => 100.0 (float)
> >> 
> >> long:
> >>   giraph.InputSplitMaxEdges => -1 (long)
> >>   giraph.InputSplitMaxVertices => -1 (long)
> >> 
> >> string:
> >>   giraph.checkpointDirectory => _bsp/_checkpoints/ (string)
> >>   giraph.dns.interface => default (string)
> >>   giraph.dns.nameserver => default (string)
> >>   giraph.edge.output.subdir =>  (string)
> >>   giraph.logLevel => info (string)
> >>   giraph.messagesDirectory => _bsp/_messages/ (string)
> >>   giraph.metrics.directory =>  (string)
> >>   giraph.nettyClientExecutionAfterHandler => requestEncoder (string)
> >>   giraph.nettyServerExecutionAfterHandler => requestFrameDecoder (string)
> >>   giraph.partitionsDirectory => _bsp/_partitions (string)
> >>   giraph.textoutputformat.separator =>      (string)
> >>   giraph.vertex.output.subdir =>  (string)
> >>   giraph.yarn.libjars =>  (string)
> >>   giraph.zkJavaOpts => -Xmx512m -XX:ParallelGCThreads=4
> >> 
> >> -XX:+UseConcMarkSweepGC -XX:CMSInitiatingOccupancyFraction=70
> >> -XX:MaxGCPauseMillis=100 (string)
> >> 
> >>   giraph.zkList =>  (string)
> >>   giraph.zkManagerDirectory => _bsp/_defaultZkManagerDir (string)
> >> 
> >> [INFO] Executed tasks
> >> [INFO]
> >> [INFO] --- maven-resources-plugin:2.6:testResources
> >> (default-testResources) @ giraph-core ---
> >> [INFO] Using 'UTF-8' encoding to copy filtered resources.
> >> [INFO] Copying 2 resources
> >> [INFO]
> >> [INFO] --- maven-compiler-plugin:3.0:testCompile (default-testCompile) @
> >> giraph-core ---
> >> [INFO] Changes detected - recompiling the module!
> >> [INFO] Compiling 62 source files to
> >> /usr/local/giraph/giraph-release-1.1.0/giraph-core/target/munged/test-cla
> >> sses [WARNING]
> >> /usr/local/giraph/giraph-release-1.1.0/giraph-core/target/munged/test/org
> >> /apache/giraph/master/TestSwitchClasses.java: Some input files use or
> >> override a deprecated API.
> >> [WARNING]
> >> /usr/local/giraph/giraph-release-1.1.0/giraph-core/target/munged/test/org
> >> /apache/giraph/master/TestSwitchClasses.java: Recompile with
> >> -Xlint:deprecation for details.
> >> [WARNING]
> >> /usr/local/giraph/giraph-release-1.1.0/giraph-core/target/munged/test/org
> >> /apache/giraph/partition/TestPartitionStores.java: Some input files use
> >> unchecked or unsafe operations.
> >> [WARNING]
> >> /usr/local/giraph/giraph-release-1.1.0/giraph-core/target/munged/test/org
> >> /apache/giraph/partition/TestPartitionStores.java: Recompile with
> >> -Xlint:unchecked for details.
> >> [INFO]
> >> [INFO] --- maven-dependency-plugin:2.8:analyze-only (default) @
> >> giraph-core ---
> >> [INFO] Skipping plugin execution
> >> [INFO]
> >> [INFO] --- maven-dependency-plugin:2.8:analyze-duplicate (default) @
> >> giraph-core ---
> >> [INFO] Skipping plugin execution
> >> [INFO]
> >> [INFO] --- maven-dependency-plugin:2.8:analyze-dep-mgt (default) @
> >> giraph-core ---
> >> [INFO] Skipping plugin execution
> >> [INFO]
> >> [INFO] --- maven-duplicate-finder-plugin:1.0.4:check (default) @
> >> giraph-core ---
> >> [INFO]
> >> [INFO] --- maven-surefire-plugin:2.6:test (default-test) @ giraph-core
> >> ---
> >> [INFO] Tests are skipped.
> >> [INFO]
> >> [INFO] --- maven-jar-plugin:2.3.2:jar (default-jar) @ giraph-core ---
> >> [INFO] Building jar:
> >> /usr/local/giraph/giraph-release-1.1.0/giraph-core/target/munged/giraph-1
> >> .1.0-SNAPSHOT-for-hadoop-2.2.0.jar [INFO]
> >> [INFO] --- maven-assembly-plugin:2.4:single (make-assembly) @ giraph-core
> >> ---
> >> [INFO] Reading assembly descriptor: src/main/assembly/assembly.xml
> >> [WARNING] NOTE: Currently, inclusion of module dependencies may produce
> >> unpredictable results if a version conflict occurs.
> >> [INFO] Building tar:
> >> /usr/local/giraph/giraph-release-1.1.0/giraph-core/target/giraph-1.1.0-SN
> >> APSHOT-for-hadoop-2.2.0-bin.tar.gz [INFO]
> >> [INFO] --- maven-jar-plugin:2.3.2:jar (default) @ giraph-core ---
> >> [INFO]
> >> [INFO] --- maven-jar-plugin:2.3.2:test-jar (default) @ giraph-core ---
> >> [INFO] Building jar:
> >> /usr/local/giraph/giraph-release-1.1.0/giraph-core/target/munged/giraph-1
> >> .1.0-SNAPSHOT-for-hadoop-2.2.0-tests.jar [INFO]
> >> [INFO] >>> maven-source-plugin:2.1.2:jar (attach-sources) @ giraph-core
> >> 
> >> [INFO]
> >> [INFO] --- mavanagaiata:0.5.0:branch (git-commit) @ giraph-core ---
> >> [INFO]
> >> [INFO] --- mavanagaiata:0.5.0:commit (git-commit) @ giraph-core ---
> >> [INFO]
> >> [INFO] --- maven-enforcer-plugin:1.2:enforce (default) @ giraph-core ---
> >> [INFO] Skipping Rule Enforcement.
> >> [INFO]
> >> [INFO] --- maven-dependency-versions-check-plugin:2.0.2:check (default) @
> >> giraph-core ---
> >> [INFO]
> >> [INFO] --- munge-maven-plugin:1.0:munge (munge) @ giraph-core ---
> >> [INFO]
> >> [INFO] <<< maven-source-plugin:2.1.2:jar (attach-sources) @ giraph-core
> >> <<<
> >> [INFO]
> >> [INFO] --- maven-source-plugin:2.1.2:jar (attach-sources) @ giraph-core
> >> ---
> >> [INFO] org already added, skipping
> >> [INFO] org/apache already added, skipping
> >> [INFO] org/apache/giraph already added, skipping
> >> [INFO] org/apache/giraph/benchmark already added, skipping
> >> [INFO] Building jar:
> >> /usr/local/giraph/giraph-release-1.1.0/giraph-core/target/munged/giraph-1
> >> .1.0-SNAPSHOT-for-hadoop-2.2.0-sources.jar [INFO] org already added,
> >> skipping
> >> [INFO] org/apache already added, skipping
> >> [INFO] org/apache/giraph already added, skipping
> >> [INFO] org/apache/giraph/benchmark already added, skipping
> >> [INFO]
> >> 
> >> [INFO]
> >> ------------------------------------------------------------------------
> >> [INFO] Building Apache Giraph Examples 1.1.0-SNAPSHOT
> >> [INFO]
> >> ------------------------------------------------------------------------
> >> [INFO]
> >> [INFO] --- maven-clean-plugin:2.5:clean (default-clean) @ giraph-examples
> >> ---
> >> [INFO] Deleting
> >> /usr/local/giraph/giraph-release-1.1.0/giraph-examples/target
> >> [INFO]
> >> [INFO] --- mavanagaiata:0.5.0:branch (git-commit) @ giraph-examples ---
> >> [INFO]
> >> [INFO] --- mavanagaiata:0.5.0:commit (git-commit) @ giraph-examples ---
> >> [INFO]
> >> [INFO] --- maven-enforcer-plugin:1.2:enforce (default) @ giraph-examples
> >> ---
> >> [INFO] Skipping Rule Enforcement.
> >> [INFO]
> >> [INFO] --- maven-dependency-versions-check-plugin:2.0.2:check (default) @
> >> giraph-examples ---
> >> [INFO]
> >> [INFO] --- munge-maven-plugin:1.0:munge (munge) @ giraph-examples ---
> >> [INFO]
> >> [INFO] --- maven-resources-plugin:2.6:resources (default-resources) @
> >> giraph-examples ---
> >> [INFO] Using 'UTF-8' encoding to copy filtered resources.
> >> [INFO] skip non existing resourceDirectory
> >> /usr/local/giraph/giraph-release-1.1.0/giraph-examples/src/main/resources
> >> [INFO]
> >> [INFO] --- maven-compiler-plugin:3.0:compile (default-compile) @
> >> giraph-examples ---
> >> [INFO] Changes detected - recompiling the module!
> >> [INFO] Compiling 42 source files to
> >> /usr/local/giraph/giraph-release-1.1.0/giraph-examples/target/munged/clas
> >> ses [WARNING]
> >> /usr/local/giraph/giraph-release-1.1.0/giraph-examples/target/munged/main
> >> /org/apache/giraph/examples/RandomWalkWorkerContext.java:
> >> /usr/local/giraph/giraph-release-1.1.0/giraph-examples/target/munged/mai
> >> n/org/apache/giraph/examples/RandomWalkWorkerContext.java uses or
> >> overrides a deprecated API.
> >> [WARNING]
> >> /usr/local/giraph/giraph-release-1.1.0/giraph-examples/target/munged/main
> >> /org/apache/giraph/examples/RandomWalkWorkerContext.java: Recompile with
> >> -Xlint:deprecation for details.
> >> [INFO]
> >> [INFO] --- maven-assembly-plugin:2.4:single (build-fat-jar) @
> >> giraph-examples ---
> >> [INFO] Building jar:
> >> /usr/local/giraph/giraph-release-1.1.0/giraph-examples/target/giraph-exam
> >> ples-1.1.0-SNAPSHOT-for-hadoop-2.2.0-jar-with-dependencies.jar [INFO]
> >> [INFO] --- maven-resources-plugin:2.6:testResources
> >> (default-testResources) @ giraph-examples ---
> >> [INFO] Using 'UTF-8' encoding to copy filtered resources.
> >> [INFO] skip non existing resourceDirectory
> >> /usr/local/giraph/giraph-release-1.1.0/giraph-examples/src/test/resources
> >> [INFO]
> >> [INFO] --- maven-compiler-plugin:3.0:testCompile (default-testCompile) @
> >> giraph-examples ---
> >> [INFO] Changes detected - recompiling the module!
> >> [INFO] Compiling 22 source files to
> >> /usr/local/giraph/giraph-release-1.1.0/giraph-examples/target/munged/test
> >> -classes [WARNING]
> >> /usr/local/giraph/giraph-release-1.1.0/giraph-examples/target/munged/test
> >> /org/apache/giraph/TestBspBasic.java:
> >> /usr/local/giraph/giraph-release-1.1.0/giraph-examples/target/munged/tes
> >> t/org/apache/giraph/TestBspBasic.java uses or overrides a deprecated API.
> >> [WARNING]
> >> /usr/local/giraph/giraph-release-1.1.0/giraph-examples/target/munged/test
> >> /org/apache/giraph/TestBspBasic.java: Recompile with -Xlint:deprecation
> >> for details.
> >> [WARNING]
> >> /usr/local/giraph/giraph-release-1.1.0/giraph-examples/target/munged/test
> >> /org/apache/giraph/TestBspBasic.java: Some input files use unchecked or
> >> unsafe operations.
> >> [WARNING]
> >> /usr/local/giraph/giraph-release-1.1.0/giraph-examples/target/munged/test
> >> /org/apache/giraph/TestBspBasic.java: Recompile with -Xlint:unchecked for
> >> details.
> >> [INFO]
> >> [INFO] --- maven-dependency-plugin:2.8:analyze-only (default) @
> >> giraph-examples ---
> >> [INFO] Skipping plugin execution
> >> [INFO]
> >> [INFO] --- maven-dependency-plugin:2.8:analyze-duplicate (default) @
> >> giraph-examples ---
> >> [INFO] Skipping plugin execution
> >> [INFO]
> >> [INFO] --- maven-dependency-plugin:2.8:analyze-dep-mgt (default) @
> >> giraph-examples ---
> >> [INFO] Skipping plugin execution
> >> [INFO]
> >> [INFO] --- maven-duplicate-finder-plugin:1.0.4:check (default) @
> >> giraph-examples ---
> >> [INFO]
> >> [INFO] --- maven-surefire-plugin:2.6:test (default-test) @
> >> giraph-examples ---
> >> [INFO] Tests are skipped.
> >> [INFO]
> >> [INFO] --- maven-jar-plugin:2.3.2:jar (default-jar) @ giraph-examples ---
> >> [INFO] Building jar:
> >> /usr/local/giraph/giraph-release-1.1.0/giraph-examples/target/munged/gira
> >> ph-examples-1.1.0-SNAPSHOT-for-hadoop-2.2.0.jar [INFO]
> >> [INFO] --- maven-jar-plugin:2.3.2:jar (default) @ giraph-examples ---
> >> [INFO]
> >> [INFO] --- maven-jar-plugin:2.3.2:test-jar (default) @ giraph-examples
> >> ---
> >> [INFO] Building jar:
> >> /usr/local/giraph/giraph-release-1.1.0/giraph-examples/target/munged/gira
> >> ph-examples-1.1.0-SNAPSHOT-for-hadoop-2.2.0-tests.jar [INFO]
> >> [INFO] >>> maven-source-plugin:2.1.2:jar (attach-sources) @
> >> giraph-examples >>>
> >> [INFO]
> >> [INFO] --- mavanagaiata:0.5.0:branch (git-commit) @ giraph-examples ---
> >> [INFO]
> >> [INFO] --- mavanagaiata:0.5.0:commit (git-commit) @ giraph-examples ---
> >> [INFO]
> >> [INFO] --- maven-enforcer-plugin:1.2:enforce (default) @ giraph-examples
> >> ---
> >> [INFO] Skipping Rule Enforcement.
> >> [INFO]
> >> [INFO] --- maven-dependency-versions-check-plugin:2.0.2:check (default) @
> >> giraph-examples ---
> >> [INFO]
> >> [INFO] --- munge-maven-plugin:1.0:munge (munge) @ giraph-examples ---
> >> [INFO]
> >> [INFO] <<< maven-source-plugin:2.1.2:jar (attach-sources) @
> >> giraph-examples <<<
> >> [INFO]
> >> [INFO] --- maven-source-plugin:2.1.2:jar (attach-sources) @
> >> giraph-examples ---
> >> [INFO] Building jar:
> >> /usr/local/giraph/giraph-release-1.1.0/giraph-examples/target/munged/gira
> >> ph-examples-1.1.0-SNAPSHOT-for-hadoop-2.2.0-sources.jar [INFO]
> >> 
> >> [INFO]
> >> ------------------------------------------------------------------------
> >> [INFO] Building Apache Giraph Distribution 1.1.0-SNAPSHOT
> >> [INFO]
> >> ------------------------------------------------------------------------
> >> Downloading:
> >> https://repository.apache.org/content/groups/public/org/apache/giraph/gir
> >> aph-hbase/1.1.0-SNAPSHOT/maven-metadata.xml Downloading:
> >> https://oss.sonatype.org/content/groups/public/org/apache/giraph/giraph-h
> >> base/1.1.0-SNAPSHOT/maven-metadata.xml Downloading:
> >> http://repo1.maven.org/maven2/org/apache/giraph/giraph-hbase/1.1.0-SNAPSH
> >> OT/maven-metadata.xml
> >> 
> >> 
> >> 
> >> [WARNING] Could not transfer metadata
> >> org.apache.giraph:giraph-hbase:1.1.0-SNAPSHOT/maven-metadata.xml from/to
> >> central (http://repo1.maven.org/maven2): repo1.maven.org: Temporary
> >> failure in name resolution
> >> [WARNING] Could not transfer metadata
> >> org.apache.giraph:giraph-hbase:1.1.0-SNAPSHOT/maven-metadata.xml from/to
> >> apache (https://repository.apache.org/content/groups/public/):
> >> repository.apache.org: Temporary failure in name resolution
> >> [WARNING] Could not transfer metadata
> >> org.apache.giraph:giraph-hbase:1.1.0-SNAPSHOT/maven-metadata.xml from/to
> >> sonatype (https://oss.sonatype.org/content/groups/public/):
> >> oss.sonatype.org: Temporary failure in name resolution
> >> [WARNING] Failure to transfer
> >> org.apache.giraph:giraph-hbase:1.1.0-SNAPSHOT/maven-metadata.xml from
> >> http://repo1.maven.org/maven2 was cached in the local repository,
> >> resolution will not be reattempted until the update interval of central
> >> has
> >> elapsed or updates are forced. Original error: Could not transfer
> >> metadata
> >> org.apache.giraph:giraph-hbase:1.1.0-SNAPSHOT/maven-metadata.xml from/to
> >> central (http://repo1.maven.org/maven2): repo1.maven.org: Temporary
> >> failure in name resolution
> >> [WARNING] Failure to transfer
> >> org.apache.giraph:giraph-hbase:1.1.0-SNAPSHOT/maven-metadata.xml from
> >> https://repository.apache.org/content/groups/public/ was cached in the
> >> local repository, resolution will not be reattempted until the update
> >> interval of apache has elapsed or updates are forced. Original error:
> >> Could
> >> not transfer metadata
> >> org.apache.giraph:giraph-hbase:1.1.0-SNAPSHOT/maven-metadata.xml from/to
> >> apache (https://repository.apache.org/content/groups/public/):
> >> repository.apache.org: Temporary failure in name resolution
> >> [WARNING] Failure to transfer
> >> org.apache.giraph:giraph-hbase:1.1.0-SNAPSHOT/maven-metadata.xml from
> >> https://oss.sonatype.org/content/groups/public/ was cached in the local
> >> repository, resolution will not be reattempted until the update interval
> >> of
> >> sonatype has elapsed or updates are forced. Original error: Could not
> >> transfer metadata
> >> org.apache.giraph:giraph-hbase:1.1.0-SNAPSHOT/maven-metadata.xml from/to
> >> sonatype (https://oss.sonatype.org/content/groups/public/):
> >> oss.sonatype.org: Temporary failure in name resolution
> >> Downloading:
> >> http://repo1.maven.org/maven2/org/apache/giraph/giraph-hbase/1.1.0-SNAPSH
> >> OT/giraph-hbase-1.1.0-SNAPSHOT.pom
> >> 
> >> Downloading:
> >> https://repository.apache.org/content/groups/public/org/apache/giraph/gir
> >> aph-hbase/1.1.0-SNAPSHOT/giraph-hbase-1.1.0-SNAPSHOT.pom
> >> 
> >> Downloading:
> >> https://oss.sonatype.org/content/groups/public/org/apache/giraph/giraph-h
> >> base/1.1.0-SNAPSHOT/giraph-hbase-1.1.0-SNAPSHOT.pom
> >> 
> >> Downloading:
> >> https://repository.apache.org/content/groups/public/org/apache/giraph/gir
> >> aph-accumulo/1.1.0-SNAPSHOT/maven-metadata.xml Downloading:
> >> http://repo1.maven.org/maven2/org/apache/giraph/giraph-accumulo/1.1.0-SNA
> >> PSHOT/maven-metadata.xml
> >> 
> >> 
> >> Downloading:
> >> https://oss.sonatype.org/content/groups/public/org/apache/giraph/giraph-a
> >> ccumulo/1.1.0-SNAPSHOT/maven-metadata.xml
> >> 
> >> [WARNING] Could not transfer metadata
> >> org.apache.giraph:giraph-accumulo:1.1.0-SNAPSHOT/maven-metadata.xml
> >> from/to
> >> central (http://repo1.maven.org/maven2): repo1.maven.org
> >> [WARNING] Could not transfer metadata
> >> org.apache.giraph:giraph-accumulo:1.1.0-SNAPSHOT/maven-metadata.xml
> >> from/to
> >> apache (https://repository.apache.org/content/groups/public/):
> >> repository.apache.org
> >> [WARNING] Could not transfer metadata
> >> org.apache.giraph:giraph-accumulo:1.1.0-SNAPSHOT/maven-metadata.xml
> >> from/to
> >> sonatype (https://oss.sonatype.org/content/groups/public/):
> >> oss.sonatype.org
> >> [WARNING] Failure to transfer
> >> org.apache.giraph:giraph-accumulo:1.1.0-SNAPSHOT/maven-metadata.xml from
> >> http://repo1.maven.org/maven2 was cached in the local repository,
> >> resolution will not be reattempted until the update interval of central
> >> has
> >> elapsed or updates are forced. Original error: Could not transfer
> >> metadata
> >> org.apache.giraph:giraph-accumulo:1.1.0-SNAPSHOT/maven-metadata.xml
> >> from/to
> >> central (http://repo1.maven.org/maven2): repo1.maven.org
> >> [WARNING] Failure to transfer
> >> org.apache.giraph:giraph-accumulo:1.1.0-SNAPSHOT/maven-metadata.xml from
> >> https://repository.apache.org/content/groups/public/ was cached in the
> >> local repository, resolution will not be reattempted until the update
> >> interval of apache has elapsed or updates are forced. Original error:
> >> Could
> >> not transfer metadata
> >> org.apache.giraph:giraph-accumulo:1.1.0-SNAPSHOT/maven-metadata.xml
> >> from/to
> >> apache (https://repository.apache.org/content/groups/public/):
> >> repository.apache.org
> >> [WARNING] Failure to transfer
> >> org.apache.giraph:giraph-accumulo:1.1.0-SNAPSHOT/maven-metadata.xml from
> >> https://oss.sonatype.org/content/groups/public/ was cached in the local
> >> repository, resolution will not be reattempted until the update interval
> >> of
> >> sonatype has elapsed or updates are forced. Original error: Could not
> >> transfer metadata
> >> org.apache.giraph:giraph-accumulo:1.1.0-SNAPSHOT/maven-metadata.xml
> >> from/to
> >> sonatype (https://oss.sonatype.org/content/groups/public/):
> >> oss.sonatype.org
> >> Downloading:
> >> http://repo1.maven.org/maven2/org/apache/giraph/giraph-accumulo/1.1.0-SNA
> >> PSHOT/giraph-accumulo-1.1.0-SNAPSHOT.pom
> >> 
> >> Downloading:
> >> https://repository.apache.org/content/groups/public/org/apache/giraph/gir
> >> aph-accumulo/1.1.0-SNAPSHOT/giraph-accumulo-1.1.0-SNAPSHOT.pom
> >> 
> >> Downloading:
> >> https://oss.sonatype.org/content/groups/public/org/apache/giraph/giraph-a
> >> ccumulo/1.1.0-SNAPSHOT/giraph-accumulo-1.1.0-SNAPSHOT.pom
> >> 
> >> Downloading:
> >> https://repository.apache.org/content/groups/public/org/apache/giraph/gir
> >> aph-hcatalog/1.1.0-SNAPSHOT/maven-metadata.xml
> >> 
> >> Downloading:
> >> http://repo1.maven.org/maven2/org/apache/giraph/giraph-hcatalog/1.1.0-SNA
> >> PSHOT/maven-metadata.xml Downloading:
> >> https://oss.sonatype.org/content/groups/public/org/apache/giraph/giraph-h
> >> catalog/1.1.0-SNAPSHOT/maven-metadata.xml
> >> 
> >> 
> >> [WARNING] Could not transfer metadata
> >> org.apache.giraph:giraph-hcatalog:1.1.0-SNAPSHOT/maven-metadata.xml
> >> from/to
> >> central (http://repo1.maven.org/maven2): repo1.maven.org
> >> [WARNING] Could not transfer metadata
> >> org.apache.giraph:giraph-hcatalog:1.1.0-SNAPSHOT/maven-metadata.xml
> >> from/to
> >> apache (https://repository.apache.org/content/groups/public/):
> >> repository.apache.org
> >> [WARNING] Could not transfer metadata
> >> org.apache.giraph:giraph-hcatalog:1.1.0-SNAPSHOT/maven-metadata.xml
> >> from/to
> >> sonatype (https://oss.sonatype.org/content/groups/public/):
> >> oss.sonatype.org
> >> [WARNING] Failure to transfer
> >> org.apache.giraph:giraph-hcatalog:1.1.0-SNAPSHOT/maven-metadata.xml from
> >> http://repo1.maven.org/maven2 was cached in the local repository,
> >> resolution will not be reattempted until the update interval of central
> >> has
> >> elapsed or updates are forced. Original error: Could not transfer
> >> metadata
> >> org.apache.giraph:giraph-hcatalog:1.1.0-SNAPSHOT/maven-metadata.xml
> >> from/to
> >> central (http://repo1.maven.org/maven2): repo1.maven.org
> >> [WARNING] Failure to transfer
> >> org.apache.giraph:giraph-hcatalog:1.1.0-SNAPSHOT/maven-metadata.xml from
> >> https://repository.apache.org/content/groups/public/ was cached in the
> >> local repository, resolution will not be reattempted until the update
> >> interval of apache has elapsed or updates are forced. Original error:
> >> Could
> >> not transfer metadata
> >> org.apache.giraph:giraph-hcatalog:1.1.0-SNAPSHOT/maven-metadata.xml
> >> from/to
> >> apache (https://repository.apache.org/content/groups/public/):
> >> repository.apache.org
> >> [WARNING] Failure to transfer
> >> org.apache.giraph:giraph-hcatalog:1.1.0-SNAPSHOT/maven-metadata.xml from
> >> https://oss.sonatype.org/content/groups/public/ was cached in the local
> >> repository, resolution will not be reattempted until the update interval
> >> of
> >> sonatype has elapsed or updates are forced. Original error: Could not
> >> transfer metadata
> >> org.apache.giraph:giraph-hcatalog:1.1.0-SNAPSHOT/maven-metadata.xml
> >> from/to
> >> sonatype (https://oss.sonatype.org/content/groups/public/):
> >> oss.sonatype.org
> >> Downloading:
> >> http://repo1.maven.org/maven2/org/apache/giraph/giraph-hcatalog/1.1.0-SNA
> >> PSHOT/giraph-hcatalog-1.1.0-SNAPSHOT.pom
> >> 
> >> Downloading:
> >> https://repository.apache.org/content/groups/public/org/apache/giraph/gir
> >> aph-hcatalog/1.1.0-SNAPSHOT/giraph-hcatalog-1.1.0-SNAPSHOT.pom
> >> 
> >> Downloading:
> >> https://oss.sonatype.org/content/groups/public/org/apache/giraph/giraph-h
> >> catalog/1.1.0-SNAPSHOT/giraph-hcatalog-1.1.0-SNAPSHOT.pom
> >> 
> >> Downloading:
> >> https://repository.apache.org/content/groups/public/org/apache/giraph/gir
> >> aph-hive/1.1.0-SNAPSHOT/maven-metadata.xml
> >> 
> >> Downloading:
> >> http://repo1.maven.org/maven2/org/apache/giraph/giraph-hive/1.1.0-SNAPSHO
> >> T/maven-metadata.xml Downloading:
> >> https://oss.sonatype.org/content/groups/public/org/apache/giraph/giraph-h
> >> ive/1.1.0-SNAPSHOT/maven-metadata.xml
> >> 
> >> 
> >> [WARNING] Could not transfer metadata
> >> org.apache.giraph:giraph-hive:1.1.0-SNAPSHOT/maven-metadata.xml from/to
> >> central (http://repo1.maven.org/maven2): repo1.maven.org
> >> [WARNING] Could not transfer metadata
> >> org.apache.giraph:giraph-hive:1.1.0-SNAPSHOT/maven-metadata.xml from/to
> >> apache (https://repository.apache.org/content/groups/public/):
> >> repository.apache.org
> >> [WARNING] Could not transfer metadata
> >> org.apache.giraph:giraph-hive:1.1.0-SNAPSHOT/maven-metadata.xml from/to
> >> sonatype (https://oss.sonatype.org/content/groups/public/):
> >> oss.sonatype.org
> >> [WARNING] Failure to transfer
> >> org.apache.giraph:giraph-hive:1.1.0-SNAPSHOT/maven-metadata.xml from
> >> http://repo1.maven.org/maven2 was cached in the local repository,
> >> resolution will not be reattempted until the update interval of central
> >> has
> >> elapsed or updates are forced. Original error: Could not transfer
> >> metadata
> >> org.apache.giraph:giraph-hive:1.1.0-SNAPSHOT/maven-metadata.xml from/to
> >> central (http://repo1.maven.org/maven2): repo1.maven.org
> >> [WARNING] Failure to transfer
> >> org.apache.giraph:giraph-hive:1.1.0-SNAPSHOT/maven-metadata.xml from
> >> https://repository.apache.org/content/groups/public/ was cached in the
> >> local repository, resolution will not be reattempted until the update
> >> interval of apache has elapsed or updates are forced. Original error:
> >> Could
> >> not transfer metadata
> >> org.apache.giraph:giraph-hive:1.1.0-SNAPSHOT/maven-metadata.xml from/to
> >> apache (https://repository.apache.org/content/groups/public/):
> >> repository.apache.org
> >> [WARNING] Failure to transfer
> >> org.apache.giraph:giraph-hive:1.1.0-SNAPSHOT/maven-metadata.xml from
> >> https://oss.sonatype.org/content/groups/public/ was cached in the local
> >> repository, resolution will not be reattempted until the update interval
> >> of
> >> sonatype has elapsed or updates are forced. Original error: Could not
> >> transfer metadata
> >> org.apache.giraph:giraph-hive:1.1.0-SNAPSHOT/maven-metadata.xml from/to
> >> sonatype (https://oss.sonatype.org/content/groups/public/):
> >> oss.sonatype.org
> >> Downloading:
> >> http://repo1.maven.org/maven2/org/apache/giraph/giraph-hive/1.1.0-SNAPSHO
> >> T/giraph-hive-1.1.0-SNAPSHOT.pom
> >> 
> >> Downloading:
> >> https://repository.apache.org/content/groups/public/org/apache/giraph/gir
> >> aph-hive/1.1.0-SNAPSHOT/giraph-hive-1.1.0-SNAPSHOT.pom
> >> 
> >> Downloading:
> >> https://oss.sonatype.org/content/groups/public/org/apache/giraph/giraph-h
> >> ive/1.1.0-SNAPSHOT/giraph-hive-1.1.0-SNAPSHOT.pom
> >> 
> >> Downloading:
> >> http://repo1.maven.org/maven2/org/apache/giraph/giraph-gora/1.1.0-SNAPSHO
> >> T/maven-metadata.xml Downloading:
> >> https://repository.apache.org/content/groups/public/org/apache/giraph/gir
> >> aph-gora/1.1.0-SNAPSHOT/maven-metadata.xml
> >> 
> >> Downloading:
> >> https://oss.sonatype.org/content/groups/public/org/apache/giraph/giraph-g
> >> ora/1.1.0-SNAPSHOT/maven-metadata.xml
> >> 
> >> 
> >> [WARNING] Could not transfer metadata
> >> org.apache.giraph:giraph-gora:1.1.0-SNAPSHOT/maven-metadata.xml from/to
> >> central (http://repo1.maven.org/maven2): repo1.maven.org
> >> [WARNING] Could not transfer metadata
> >> org.apache.giraph:giraph-gora:1.1.0-SNAPSHOT/maven-metadata.xml from/to
> >> apache (https://repository.apache.org/content/groups/public/):
> >> repository.apache.org
> >> [WARNING] Could not transfer metadata
> >> org.apache.giraph:giraph-gora:1.1.0-SNAPSHOT/maven-metadata.xml from/to
> >> sonatype (https://oss.sonatype.org/content/groups/public/):
> >> oss.sonatype.org
> >> [WARNING] Failure to transfer
> >> org.apache.giraph:giraph-gora:1.1.0-SNAPSHOT/maven-metadata.xml from
> >> http://repo1.maven.org/maven2 was cached in the local repository,
> >> resolution will not be reattempted until the update interval of central
> >> has
> >> elapsed or updates are forced. Original error: Could not transfer
> >> metadata
> >> org.apache.giraph:giraph-gora:1.1.0-SNAPSHOT/maven-metadata.xml from/to
> >> central (http://repo1.maven.org/maven2): repo1.maven.org
> >> [WARNING] Failure to transfer
> >> org.apache.giraph:giraph-gora:1.1.0-SNAPSHOT/maven-metadata.xml from
> >> https://repository.apache.org/content/groups/public/ was cached in the
> >> local repository, resolution will not be reattempted until the update
> >> interval of apache has elapsed or updates are forced. Original error:
> >> Could
> >> not transfer metadata
> >> org.apache.giraph:giraph-gora:1.1.0-SNAPSHOT/maven-metadata.xml from/to
> >> apache (https://repository.apache.org/content/groups/public/):
> >> repository.apache.org
> >> [WARNING] Failure to transfer
> >> org.apache.giraph:giraph-gora:1.1.0-SNAPSHOT/maven-metadata.xml from
> >> https://oss.sonatype.org/content/groups/public/ was cached in the local
> >> repository, resolution will not be reattempted until the update interval
> >> of
> >> sonatype has elapsed or updates are forced. Original error: Could not
> >> transfer metadata
> >> org.apache.giraph:giraph-gora:1.1.0-SNAPSHOT/maven-metadata.xml from/to
> >> sonatype (https://oss.sonatype.org/content/groups/public/):
> >> oss.sonatype.org
> >> Downloading:
> >> http://repo1.maven.org/maven2/org/apache/giraph/giraph-gora/1.1.0-SNAPSHO
> >> T/giraph-gora-1.1.0-SNAPSHOT.pom
> >> 
> >> Downloading:
> >> https://repository.apache.org/content/groups/public/org/apache/giraph/gir
> >> aph-gora/1.1.0-SNAPSHOT/giraph-gora-1.1.0-SNAPSHOT.pom
> >> 
> >> Downloading:
> >> https://oss.sonatype.org/content/groups/public/org/apache/giraph/giraph-g
> >> ora/1.1.0-SNAPSHOT/giraph-gora-1.1.0-SNAPSHOT.pom
> >> 
> >> [INFO]
> >> ------------------------------------------------------------------------
> >> [INFO] Reactor Summary:
> >> [INFO]
> >> [INFO] Apache Giraph Parent .............................. SUCCESS
> >> [4.034s]
> >> [INFO] Apache Giraph Core ................................ SUCCESS
> >> [35.503s]
> >> [INFO] Apache Giraph Examples ............................ SUCCESS
> >> [12.285s]
> >> [INFO] Apache Giraph Distribution ........................ FAILURE
> >> [0.700s]
> >> [INFO]
> >> ------------------------------------------------------------------------
> >> [INFO] BUILD FAILURE
> >> [INFO]
> >> ------------------------------------------------------------------------
> >> [INFO] Total time: 52.856s
> >> [INFO] Finished at: Fri Feb 07 20:09:31 PST 2014
> >> [INFO] Final Memory: 51M/311M
> >> [INFO]
> >> ------------------------------------------------------------------------
> >> [ERROR] Failed to execute goal on project giraph-dist: Could not resolve
> >> dependencies for project
> >> org.apache.giraph:giraph-dist:pom:1.1.0-SNAPSHOT:
> >> Failed to collect dependencies at
> >> org.apache.giraph:giraph-hbase:jar:1.1.0-SNAPSHOT: Failed to read
> >> artifact
> >> descriptor for org.apache.giraph:giraph-hbase:jar:1.1.0-SNAPSHOT: Could
> >> not
> >> transfer artifact org.apache.giraph:giraph-hbase:pom:1.1.0-SNAPSHOT
> >> from/to
> >> central (http://repo1.maven.org/maven2): repo1.maven.org: Unknown host
> >> repo1.maven.org -> [Help 1]
> >> [ERROR]
> >> [ERROR] To see the full stack trace of the errors, re-run Maven with the
> >> -e switch.
> >> [ERROR] Re-run Maven using the -X switch to enable full debug logging.
> >> [ERROR]
> >> [ERROR] For more information about the errors and possible solutions,
> >> please read the following articles:
> >> [ERROR] [Help 1]
> >> http://cwiki.apache.org/confluence/display/MAVEN/DependencyResolutionExce
> >> ption [ERROR]
> >> [ERROR] After correcting the problems, you can resume the build with the
> >> command
> >> [ERROR]   mvn <goals> -rf :giraph-dist
> >> 
> >> 
> >> 
> >> On Thu, Feb 6, 2014 at 2:30 PM, Roman Shaposhnik
> >> <roman@shaposhnik.org>wrote:>> 
> >> Try applying this patch (you may need to apply it with a fuzz):
> >>     https://issues.apache.org/jira/browse/GIRAPH-794
> >> 
> >> and let us know if it helps (it should).
> >> 
> >> Thanks,
> >> Roman.
> >> 
> >> On Thu, Feb 6, 2014 at 2:23 PM, Rocky Grey <rockygrey@gmail.com> wrote:
> >> > Hi
> >> > 
> >> > I pulled the latest repository from Git -
> >> > http://git-wip-us.apache.org/repos/asf/giraph.git
> >> > 
> >> > and tried to package the application using
> >> > 
> >> > mvn -Phadoop_yarn -Dhadoop.version=2.2.0 -DskipTests clean package
> >> > 
> >> > The process succeeded partially. Below is the snapshot of the package
> >> 
> >> log.
> >> 
> >> > Did anybody else face the same problem ?
> >> > 
> >> > ...
> >> > ....
> >> > .......
> >> > [INFO]
> >> > -----------------------------------------------------------------------
> >> > -
> >> > [INFO] Building Apache Giraph Distribution 1.1.0-SNAPSHOT
> >> > [INFO]
> >> > -----------------------------------------------------------------------
> >> > -
> >> > [WARNING] The POM for org.apache.giraph:giraph-hbase:jar:1.1.0-SNAPSHOT
> >> 
> >> is
> >> 
> >> > missing, no dependency information available
> >> > [WARNING] The POM for
> >> 
> >> org.apache.giraph:giraph-accumulo:jar:1.1.0-SNAPSHOT
> >> 
> >> > is missing, no dependency information available
> >> > [WARNING] The POM for
> >> 
> >> org.apache.giraph:giraph-hcatalog:jar:1.1.0-SNAPSHOT
> >> 
> >> > is missing, no dependency information available
> >> > [WARNING] The POM for org.apache.giraph:giraph-hive:jar:1.1.0-SNAPSHOT
> >> 
> >> is
> >> 
> >> > missing, no dependency information available
> >> > [INFO]
> >> > -----------------------------------------------------------------------
> >> > -
> >> > [INFO] Reactor Summary:
> >> > [INFO]
> >> > [INFO] Apache Giraph Parent .............................. SUCCESS
> >> 
> >> [4.283s]
> >> 
> >> > [INFO] Apache Giraph Core ................................ SUCCESS
> >> 
> >> [35.053s]
> >> 
> >> > [INFO] Apache Giraph Examples ............................ SUCCESS
> >> 
> >> [12.905s]
> >> 
> >> > [INFO] Apache Giraph Distribution ........................ FAILURE
> >> 
> >> [0.110s]
> >> 
> >> > [INFO]
> >> > -----------------------------------------------------------------------
> >> > -
> >> > [INFO] BUILD FAILURE
> >> > [INFO]
> >> > -----------------------------------------------------------------------
> >> > -
> >> > [INFO] Total time: 52.782s
> >> > [INFO] Finished at: Thu Feb 06 13:17:41 PST 2014
> >> > [INFO] Final Memory: 41M/286M
> >> > [INFO]
> >> > -----------------------------------------------------------------------
> >> > -
> >> > [ERROR] Failed to execute goal on project giraph-dist: Could not
> >> > resolve
> >> > dependencies for project
> >> 
> >> org.apache.giraph:giraph-dist:pom:1.1.0-SNAPSHOT:
> >> > The following artifacts could not be resolved:
> >> > org.apache.giraph:giraph-hbase:jar:1.1.0-SNAPSHOT,
> >> > org.apache.giraph:giraph-accumulo:jar:1.1.0-SNAPSHOT,
> >> > org.apache.giraph:giraph-hcatalog:jar:1.1.0-SNAPSHOT,
> >> > org.apache.giraph:giraph-hive:jar:1.1.0-SNAPSHOT: Failure to find
> >> > org.apache.giraph:giraph-hbase:jar:1.1.0-SNAPSHOT in
> >> > http://repo1.maven.org/maven2 was cached in the local repository,
> >> 
> >> resolution
> >> 
> >> > will not be reattempted until the update interval of central has
> >> 
> >> elapsed or
> >> 
> >> > updates are forced -> [Help 1]
> >> > [ERROR]
> >> > [ERROR] To see the full stack trace of the errors, re-run Maven with
> >> 
> >> the -e
> >> 
> >> > switch.
> >> > [ERROR] Re-run Maven using the -X switch to enable full debug logging.
> >> > [ERROR]
> >> > [ERROR] For more information about the errors and possible solutions,
> >> 
> >> please
> >> 
> >> > read the following articles:
> >> > [ERROR] [Help 1]
> >> 
> >> http://cwiki.apache.org/confluence/display/MAVEN/DependencyResolutionExce
> >> ption>> 
> >> > [ERROR]
> >> > [ERROR] After correcting the problems, you can resume the build with
> >> > the
> >> > command
> >> > [ERROR]   mvn <goals> -rf :giraph-dist
> >> > 
> >> > I tried to rerun the process multiple times but got the same error.
> >> > 
> >> > 
> >> > On a second note when I tried to test the partially successful
> >> 
> >> installation
> >> 
> >> > like mentioned below
> >> > 
> >> > # hadoop jar
> >> 
> >> $GIRAPH_HOME/giraph-examples/target/giraph-examples-1.1.0-SNAPSHOT-for-ha
> >> doop-2.2.0-jar-with-dependencies.jar>> 
> >> > org.apache.giraph.GiraphRunner -h
> >> > 
> >> > It failed with the following error.
> >> > 
> >> > Exception in thread "main" java.lang.UnsupportedClassVersionError:
> >> > org/apache/giraph/GiraphRunner : Unsupported major.minor version 51.0
> >> > 
> >> >         at java.lang.ClassLoader.defineClass1(Native Method)
> >> >         at java.lang.ClassLoader.defineClassCond(ClassLoader.java:631)
> >> >         at java.lang.ClassLoader.defineClass(ClassLoader.java:615)
> >> >         at
> >> > 
> >> > java.security.SecureClassLoader.defineClass(SecureClassLoader.java:141)
> >> > 
> >> >         at java.net.URLClassLoader.defineClass(URLClassLoader.java:283)
> >> >         at java.net.URLClassLoader.access$000(URLClassLoader.java:58)
> >> >         at java.net.URLClassLoader$1.run(URLClassLoader.java:197)
> >> >         at java.security.AccessController.doPrivileged(Native Method)
> >> >         at java.net.URLClassLoader.findClass(URLClassLoader.java:190)
> >> >         at java.lang.ClassLoader.loadClass(ClassLoader.java:306)
> >> >         at java.lang.ClassLoader.loadClass(ClassLoader.java:247)
> >> >         at java.lang.Class.forName0(Native Method)
> >> >         at java.lang.Class.forName(Class.java:247)
> >> >         at org.apache.hadoop.util.RunJar.main(RunJar.java:205)
> >> > 
> >> > Any help would be appreciated.
> >> > 
> >> > Thanks.

Mime
View raw message