giraph-dev mailing list archives

Site index · List index
Message view « Date » · « Thread »
Top « Date » · « Thread »
From Apache Jenkins Server <jenk...@builds.apache.org>
Subject Failed: GIRAPH-447 PreCommit Build #43
Date Thu, 13 Dec 2012 02:58:21 GMT
Jira: https://issues.apache.org/jira/browse/GIRAPH-447
Build: https://builds.apache.org/job/PreCommit-GIRAPH-Build/43/

###################################################################################
########################## LAST 60 LINES OF THE CONSOLE ###########################
[...truncated 723 lines...]
patching file giraph/src/test/java/org/apache/giraph/TestVertexTypes.java
patching file giraph/src/test/java/org/apache/giraph/comm/ConnectionTest.java
patching file giraph/src/test/java/org/apache/giraph/comm/RequestFailureTest.java
patching file giraph/src/test/java/org/apache/giraph/comm/RequestTest.java
patching file giraph/src/test/java/org/apache/giraph/comm/SaslConnectionTest.java
patching file giraph/src/test/java/org/apache/giraph/comm/TestMessageStores.java
patching file giraph/src/test/java/org/apache/giraph/examples/ConnectedComponentsVertexTest.java
patching file giraph/src/test/java/org/apache/giraph/examples/RandomWalkWithRestartVertexTest.java
patching file giraph/src/test/java/org/apache/giraph/examples/SimpleShortestPathsVertexTest.java
patching file giraph/src/test/java/org/apache/giraph/examples/TryMultiIpcBindingPortsTest.java
patching file giraph/src/test/java/org/apache/giraph/graph/TestAggregatorsHandling.java
patching file giraph/src/test/java/org/apache/giraph/graph/TestMutableVertex.java
patching file giraph/src/test/java/org/apache/giraph/graph/partition/TestPartitionStores.java
patching file giraph/src/test/java/org/apache/giraph/io/TestLongDoubleDoubleAdjacencyListVertexInputFormat.java
patching file giraph/src/test/java/org/apache/giraph/io/TestTextDoubleDoubleAdjacencyListVertexInputFormat.java
patching file giraph/src/test/java/org/apache/giraph/utils/BspUtilsTest.java
patching file giraph/src/test/java/org/apache/giraph/utils/MockUtils.java
patching file giraph/src/test/java/zk/TestZooKeeperManager.java
PATCH APPLICATION FAILED




-1 overall.  Here are the results of testing the latest attachment 
  http://issues.apache.org/jira/secure/attachment/12560136/GIRAPH-447.patch
  against trunk revision 1419623.

    -1 patch.  The patch command could not apply the patch.

Console output: https://builds.apache.org/job/PreCommit-GIRAPH-Build/43//console

This message is automatically generated.


======================================================================
======================================================================
    Adding comment to Jira.
======================================================================
======================================================================


Comment added.
bfadb0cbd6cd251c660e77076f91f2516191276d logged out


======================================================================
======================================================================
    Finished build.
======================================================================
======================================================================


Build step 'Execute shell' marked build as failure
[FINDBUGS] Skipping publisher since build result is FAILURE
Archiving artifacts
Recording test results
[description-setter] Could not determine description.
Email was triggered for: Failure
Sending email for trigger: Failure



###################################################################################
############################## FAILED TESTS (if any) ##############################
No tests ran.
Mime
  • Unnamed multipart/mixed (inline, None, 0 bytes)
View raw message