geronimo-user mailing list archives

Site index · List index
Message view « Date » · « Thread »
Top « Date » · « Thread »
From lichtin <lich...@yahoo.com>
Subject Re: Daytrader application does not build
Date Thu, 26 Jan 2012 13:48:57 GMT
With Maven 3.0.3, the builds starts out ok and only after a while stops with:

[INFO]
[INFO] --- car-maven-plugin:3.0-SNAPSHOT:validate-configuration
(default-validate-configuration) @ daytrader-derby-datasource ---
[WARNING] The POM for
org.apache.geronimo.buildsupport:car-maven-plugin:jar:3.0-20111220.185441-426
is invalid, transitive dependencies (if any) will not be available, enable
debug logging for more details
26.01.2012 14:41:43 org.sonatype.guice.bean.reflect.LoadedClass
WARNUNG: Error injecting:
org.apache.geronimo.mavenplugins.car.ValidateConfigurationMojo
java.lang.NoClassDefFoundError:
org/apache/maven/shared/filtering/MavenFilteringException
        at java.lang.Class.getDeclaredConstructors0(Native Method)
        at java.lang.Class.privateGetDeclaredConstructors(Class.java:2389)
        at java.lang.Class.getDeclaredConstructors(Class.java:1836)
        at
com.google.inject.spi.InjectionPoint.forConstructorOf(InjectionPoint.java:243)
        at
com.google.inject.internal.ConstructorBindingImpl.create(ConstructorBindingImpl.java:96)
        at
com.google.inject.internal.InjectorImpl.createUninitializedBinding(InjectorImpl.java:628)
        at
com.google.inject.internal.InjectorImpl.createJustInTimeBinding(InjectorImpl.java:835)
        at
com.google.inject.internal.InjectorImpl.createJustInTimeBindingRecursive(InjectorImpl.java:769)
        at
com.google.inject.internal.InjectorImpl.getJustInTimeBinding(InjectorImpl.java:254)
        at
com.google.inject.internal.InjectorImpl.getBindingOrThrow(InjectorImpl.java:205)
        at
com.google.inject.internal.InjectorImpl.getInternalFactory(InjectorImpl.java:843)
        at
com.google.inject.internal.InjectorImpl.getProviderOrThrow(InjectorImpl.java:957)
        at
com.google.inject.internal.InjectorImpl.getProvider(InjectorImpl.java:990)
        at
com.google.inject.internal.InjectorImpl.getProvider(InjectorImpl.java:951)
        at
com.google.inject.internal.InjectorImpl.getInstance(InjectorImpl.java:1003)
        at
org.sonatype.guice.bean.reflect.AbstractDeferredClass.get(AbstractDeferredClass.java:47)
        at
com.google.inject.internal.InternalFactoryToProviderAdapter.get(InternalFactoryToProviderAdapter.java:40)
        at
com.google.inject.internal.InjectorImpl$4$1.call(InjectorImpl.java:968)
        at
com.google.inject.internal.InjectorImpl.callInContext(InjectorImpl.java:1014)
        at
com.google.inject.internal.InjectorImpl$4.get(InjectorImpl.java:964)
        at com.google.inject.Scopes$1$1.get(Scopes.java:59)
        at
org.sonatype.guice.bean.locators.LazyBeanEntry.getValue(LazyBeanEntry.java:79)
        at
org.sonatype.guice.plexus.locators.LazyPlexusBean.getValue(LazyPlexusBean.java:53)
        at
org.codehaus.plexus.DefaultPlexusContainer.lookup(DefaultPlexusContainer.java:243)
        at
org.codehaus.plexus.DefaultPlexusContainer.lookup(DefaultPlexusContainer.java:235)
        at
org.apache.maven.plugin.internal.DefaultMavenPluginManager.getConfiguredMojo(DefaultMavenPluginManager.java:455)
        at
org.apache.maven.plugin.DefaultBuildPluginManager.executeMojo(DefaultBuildPluginManager.java:92)
        at
org.apache.maven.lifecycle.internal.MojoExecutor.execute(MojoExecutor.java:209)
        at
org.apache.maven.lifecycle.internal.MojoExecutor.execute(MojoExecutor.java:153)
        at
org.apache.maven.lifecycle.internal.MojoExecutor.execute(MojoExecutor.java:145)
        at
org.apache.maven.lifecycle.internal.LifecycleModuleBuilder.buildProject(LifecycleModuleBuilder.java:84)
        at
org.apache.maven.lifecycle.internal.LifecycleModuleBuilder.buildProject(LifecycleModuleBuilder.java:59)
        at
org.apache.maven.lifecycle.internal.LifecycleStarter.singleThreadedBuild(LifecycleStarter.java:183)
        at
org.apache.maven.lifecycle.internal.LifecycleStarter.execute(LifecycleStarter.java:161)
        at org.apache.maven.DefaultMaven.doExecute(DefaultMaven.java:319)
        at org.apache.maven.DefaultMaven.execute(DefaultMaven.java:156)
        at org.apache.maven.cli.MavenCli.execute(MavenCli.java:537)
        at org.apache.maven.cli.MavenCli.doMain(MavenCli.java:196)
        at org.apache.maven.cli.MavenCli.main(MavenCli.java:141)
        at sun.reflect.NativeMethodAccessorImpl.invoke0(Native Method)
        at
sun.reflect.NativeMethodAccessorImpl.invoke(NativeMethodAccessorImpl.java:39)
        at
sun.reflect.DelegatingMethodAccessorImpl.invoke(DelegatingMethodAccessorImpl.java:25)
        at java.lang.reflect.Method.invoke(Method.java:597)
        at
org.codehaus.plexus.classworlds.launcher.Launcher.launchEnhanced(Launcher.java:290)
        at
org.codehaus.plexus.classworlds.launcher.Launcher.launch(Launcher.java:230)
        at
org.codehaus.plexus.classworlds.launcher.Launcher.mainWithExitCode(Launcher.java:409)
        at
org.codehaus.plexus.classworlds.launcher.Launcher.main(Launcher.java:352)
Caused by: java.lang.ClassNotFoundException:
org.apache.maven.shared.filtering.MavenFilteringException
        at
org.codehaus.plexus.classworlds.strategy.SelfFirstStrategy.loadClass(SelfFirstStrategy.java:50)
        at
org.codehaus.plexus.classworlds.realm.ClassRealm.loadClass(ClassRealm.java:244)
        at
org.codehaus.plexus.classworlds.realm.ClassRealm.loadClass(ClassRealm.java:230)
        ... 47 more
[INFO]
------------------------------------------------------------------------
[INFO] Reactor Summary:
[INFO]
[INFO] DayTrader :: Performance Benchmark Sample :: Java EE 6  SUCCESS
[9.823s]
[INFO] Daytrader :: JAVA EE 6 ............................ SUCCESS [0.143s]
[INFO] DayTrader :: Java EE 6 :: Modules ................. SUCCESS [0.174s]
[INFO] DayTrader :: Java EE 6 :: Modules - Utils ......... SUCCESS [7.168s]
[INFO] DayTrader :: Java EE 6 :: Modules - Entities ...... SUCCESS [22.804s]
[INFO] DayTrader :: Java EE 6 :: Modules - Web ........... SUCCESS [26.919s]
[INFO] DayTrader :: Java EE 6 :: Assemblies .............. SUCCESS [0.038s]
[INFO] DayTrader :: Assemblies - Java EE 6 EAR ........... SUCCESS [3.423s]
[INFO] Daytrader plans ................................... SUCCESS [0.440s]
[INFO] DayTrader :: Plugins .............................. SUCCESS [1.993s]
[INFO] Daytrader :: Plugins :: Derby DataSource .......... FAILURE
[6:37.426s]
[INFO] Daytrader :: Plugins :: JavaEE JMS Resource ....... SKIPPED
[INFO]
------------------------------------------------------------------------
[INFO] BUILD FAILURE
[INFO]
------------------------------------------------------------------------
[INFO] Total time: 7:59.351s
[INFO] Finished at: Thu Jan 26 14:41:43 CET 2012
[INFO] Final Memory: 44M/205M
[INFO]
------------------------------------------------------------------------
[ERROR] Failed to execute goal
org.apache.geronimo.buildsupport:car-maven-plugin:3.0-SNAPSHOT:validate-configuration
(default-validate-configuration) on project daytrader-derby-datasource:
Execution default-validate-configuration
of goal
org.apache.geronimo.buildsupport:car-maven-plugin:3.0-SNAPSHOT:validate-configuration
failed: Unable to load the mojo 'validate-configuration' in the plugin
'org.apache.geronimo.buildsupport:car-maven-plugin:3.0-SNAPSHOT'.
 A required class is missing:
org/apache/maven/shared/filtering/MavenFilteringException
[ERROR] -----------------------------------------------------
[ERROR] realm =   
plugin>org.apache.geronimo.buildsupport:car-maven-plugin:3.0-SNAPSHOT

--
View this message in context: http://apache-geronimo.328035.n3.nabble.com/Daytrader-application-does-not-build-tp3684317p3690475.html
Sent from the Users mailing list archive at Nabble.com.

Mime
View raw message