geronimo-user mailing list archives

Site index · List index
Message view « Date » · « Thread »
Top « Date » · « Thread »
From "Sanjay Dwivedi" <sanjay.dwiv...@gmail.com>
Subject Build Failed - Building from SVN Geronimo 1.0
Date Sun, 12 Feb 2006 03:51:56 GMT
Hello,

I get following error while building Geronimo 1.0 from SVN source (not the zip file).
I have followed the email trails and JIRA to copy geronimo-corba_2.3_spec-1.0.jar in
.maven/repository/org.apache.geronimo.specs, still get the error. Also tried creating
 geronimo-corba_2.3_spec/1.1-SNAPSHOT/jar there and copying the corba jar. Still get the error.

Any help is appreciated.

-- Sanjay

---------------------------------------------------------------------------------------------------------------------


multiproject:install-callback:
    [echo] Running car:install for openejb Configuration for the J2EE Server
22:44:00,265 ERROR [PackageBuilder] org.apache.geronimo.common.DeploymentExcepti
on: org.apache.geronimo.kernel.repository.MissingDependencyException: uri org.ap
ache.geronimo.specs/geronimo-corba_2.3_spec/1.1-SNAPSHOT/jar not found in reposi
tory
org.apache.geronimo.common.DeploymentException: org.apache.geronimo.kernel.repos
itory.MissingDependencyException: uri org.apache.geronimo.specs/geronimo-corba_2
.3_spec/1.1-SNAPSHOT/jar not found in repository
        at org.apache.geronimo.deployment.service.ServiceConfigBuilder.getDepend
encyURI(ServiceConfigBuilder.java:402)
        at org.apache.geronimo.deployment.service.ServiceConfigBuilder.addDepend
encies(ServiceConfigBuilder.java:276)
        at org.apache.geronimo.deployment.service.ServiceConfigBuilder.addDepend
encies(ServiceConfigBuilder.java:303)
        at org.apache.geronimo.deployment.service.ServiceConfigBuilder.buildConf
iguration(ServiceConfigBuilder.java:204)
        at org.apache.geronimo.deployment.service.ServiceConfigBuilder.buildConf
iguration(ServiceConfigBuilder.java:167)
        at org.apache.geronimo.deployment.service.ServiceConfigBuilder$$FastClas
sByCGLIB$$9f173be6.invoke(<generated>)
        at net.sf.cglib.reflect.FastMethod.invoke(FastMethod.java:53)
        at org.apache.geronimo.gbean.runtime.FastMethodInvoker.invoke(FastMethod
Invoker.java:38)
        at org.apache.geronimo.gbean.runtime.GBeanOperation.invoke(GBeanOperatio
n.java:118)
        at org.apache.geronimo.gbean.runtime.GBeanInstance.invoke(GBeanInstance.
java:800)
        at org.apache.geronimo.gbean.runtime.RawInvoker.invoke(RawInvoker.java:5
7)
        at org.apache.geronimo.kernel.basic.RawOperationInvoker.invoke(RawOperat
ionInvoker.java:36)
        at org.apache.geronimo.kernel.basic.ProxyMethodInterceptor.intercept(Pro
xyMethodInterceptor.java:96)
        at org.apache.geronimo.deployment.ConfigurationBuilder$$EnhancerByCGLIB$
$50d44f45.buildConfiguration(<generated>)
        at org.apache.geronimo.deployment.Deployer.deploy(Deployer.java:279)
        at org.apache.geronimo.deployment.Deployer$$FastClassByCGLIB$$734a235d.i
nvoke(<generated>)
        at net.sf.cglib.reflect.FastMethod.invoke(FastMethod.java:53)
        at org.apache.geronimo.gbean.runtime.FastMethodInvoker.invoke(FastMethod
Invoker.java:38)
        at org.apache.geronimo.gbean.runtime.GBeanOperation.invoke(GBeanOperatio
n.java:118)
        at org.apache.geronimo.gbean.runtime.GBeanInstance.invoke(GBeanInstance.
java:835)
        at org.apache.geronimo.kernel.basic.BasicKernel.invoke(BasicKernel.java:
178)
        at org.apache.geronimo.plugin.packaging.PackageBuilder.invokeDeployer(Pa
ckageBuilder.java:389)
        at org.apache.geronimo.plugin.packaging.PackageBuilder.execute(PackageBu
ilder.java:294)
        at sun.reflect.NativeMethodAccessorImpl.invoke0(Native Method)
        at sun.reflect.NativeMethodAccessorImpl.invoke(NativeMethodAccessorImpl.
java:39)
        at sun.reflect.DelegatingMethodAccessorImpl.invoke(DelegatingMethodAcces
sorImpl.java:25)
        at java.lang.reflect.Method.invoke(Method.java:324)
        at org.apache.geronimo.plugin.packaging.PackageBuilderShell.execute(Pack
ageBuilderShell.java:232)
        at sun.reflect.NativeMethodAccessorImpl.invoke0(Native Method)
        at sun.reflect.NativeMethodAccessorImpl.invoke(NativeMethodAccessorImpl.
java:39)
        at sun.reflect.DelegatingMethodAccessorImpl.invoke(DelegatingMethodAcces
sorImpl.java:25)
        at java.lang.reflect.Method.invoke(Method.java:324)
        at org.apache.commons.jelly.impl.DynamicBeanTag.doTag(DynamicBeanTag.jav
a:230)
        at org.apache.commons.jelly.impl.StaticTagScript.run(StaticTagScript.jav
a:145)
        at org.apache.commons.jelly.impl.ScriptBlock.run(ScriptBlock.java:135)
        at org.apache.maven.jelly.tags.werkz.MavenGoalTag.runBodyTag(MavenGoalTa
g.java:79)
        at org.apache.maven.jelly.tags.werkz.MavenGoalTag$MavenGoalAction.perfor
mAction(MavenGoalTag.java:110)
        at com.werken.werkz.Goal.fire(Goal.java:639)
        at com.werken.werkz.Goal.attain(Goal.java:575)
        at com.werken.werkz.Goal.attainPrecursors(Goal.java:488)
        at com.werken.werkz.Goal.attain(Goal.java:573)
        at com.werken.werkz.WerkzProject.attainGoal(WerkzProject.java:193)
        at org.apache.maven.jelly.tags.werkz.MavenAttainGoalTag.doTag(MavenAttai
nGoalTag.java:127)
        at org.apache.commons.jelly.impl.TagScript.run(TagScript.java:279)
        at org.apache.commons.jelly.impl.ScriptBlock.run(ScriptBlock.java:135)
        at org.apache.maven.jelly.tags.werkz.MavenGoalTag.runBodyTag(MavenGoalTa
g.java:79)
        at org.apache.maven.jelly.tags.werkz.MavenGoalTag$MavenGoalAction.perfor
mAction(MavenGoalTag.java:110)
        at com.werken.werkz.Goal.fire(Goal.java:639)
        at com.werken.werkz.Goal.attain(Goal.java:575)
        at org.apache.maven.plugin.PluginManager.attainGoals(PluginManager.java:
671)
        at org.apache.maven.MavenSession.attainGoals(MavenSession.java:263)
        at org.apache.maven.jelly.tags.maven.ReactorTag.doTag(ReactorTag.java:36
8)
        at org.apache.commons.jelly.impl.TagScript.run(TagScript.java:279)
        at org.apache.commons.jelly.impl.ScriptBlock.run(ScriptBlock.java:135)
        at org.apache.maven.jelly.tags.werkz.MavenGoalTag.runBodyTag(MavenGoalTa
g.java:79)
        at org.apache.maven.jelly.tags.werkz.MavenGoalTag$MavenGoalAction.perfor
mAction(MavenGoalTag.java:110)
        at com.werken.werkz.Goal.fire(Goal.java:639)
        at com.werken.werkz.Goal.attain(Goal.java:575)
        at com.werken.werkz.WerkzProject.attainGoal(WerkzProject.java:193)
        at org.apache.maven.jelly.tags.werkz.MavenAttainGoalTag.doTag(MavenAttai
nGoalTag.java:127)
        at org.apache.commons.jelly.impl.TagScript.run(TagScript.java:279)
        at org.apache.commons.jelly.impl.ScriptBlock.run(ScriptBlock.java:135)
        at org.apache.maven.jelly.tags.werkz.MavenGoalTag.runBodyTag(MavenGoalTa
g.java:79)
        at org.apache.maven.jelly.tags.werkz.MavenGoalTag$MavenGoalAction.perfor
mAction(MavenGoalTag.java:110)
        at com.werken.werkz.Goal.fire(Goal.java:639)
        at com.werken.werkz.Goal.attain(Goal.java:575)
        at org.apache.maven.plugin.PluginManager.attainGoals(PluginManager.java:
671)
        at org.apache.maven.MavenSession.attainGoals(MavenSession.java:263)
        at org.apache.maven.cli.App.doMain(App.java:488)
        at org.apache.maven.cli.App.main(App.java:1239)
        at sun.reflect.NativeMethodAccessorImpl.invoke0(Native Method)
        at sun.reflect.NativeMethodAccessorImpl.invoke(NativeMethodAccessorImpl.
java:39)
        at sun.reflect.DelegatingMethodAccessorImpl.invoke(DelegatingMethodAcces
sorImpl.java:25)
        at java.lang.reflect.Method.invoke(Method.java:324)
        at com.werken.forehead.Forehead.run(Forehead.java:551)
        at com.werken.forehead.Forehead.main(Forehead.java:581)
Caused by: org.apache.geronimo.kernel.repository.MissingDependencyException: uri
 org.apache.geronimo.specs/geronimo-corba_2.3_spec/1.1-SNAPSHOT/jar not found in
 repository
        ... 76 more
java.lang.reflect.InvocationTargetException: null
java.lang.reflect.InvocationTargetException
        at sun.reflect.NativeMethodAccessorImpl.invoke0(Native Method)
        at sun.reflect.NativeMethodAccessorImpl.invoke(NativeMethodAccessorImpl.
java:39)
        at sun.reflect.DelegatingMethodAccessorImpl.invoke(DelegatingMethodAcces
sorImpl.java:25)
        at java.lang.reflect.Method.invoke(Method.java:324)
        at org.apache.geronimo.plugin.packaging.PackageBuilderShell.execute(Pack
ageBuilderShell.java:232)
        at sun.reflect.NativeMethodAccessorImpl.invoke0(Native Method)
        at sun.reflect.NativeMethodAccessorImpl.invoke(NativeMethodAccessorImpl.
java:39)
        at sun.reflect.DelegatingMethodAccessorImpl.invoke(DelegatingMethodAcces
sorImpl.java:25)
        at java.lang.reflect.Method.invoke(Method.java:324)
        at org.apache.commons.jelly.impl.DynamicBeanTag.doTag(DynamicBeanTag.jav
a:230)
        at org.apache.commons.jelly.impl.StaticTagScript.run(StaticTagScript.jav
a:145)
        at org.apache.commons.jelly.impl.ScriptBlock.run(ScriptBlock.java:135)
        at org.apache.maven.jelly.tags.werkz.MavenGoalTag.runBodyTag(MavenGoalTa
g.java:79)
        at org.apache.maven.jelly.tags.werkz.MavenGoalTag$MavenGoalAction.perfor
mAction(MavenGoalTag.java:110)
        at com.werken.werkz.Goal.fire(Goal.java:639)
        at com.werken.werkz.Goal.attain(Goal.java:575)
        at com.werken.werkz.Goal.attainPrecursors(Goal.java:488)
        at com.werken.werkz.Goal.attain(Goal.java:573)
        at com.werken.werkz.WerkzProject.attainGoal(WerkzProject.java:193)
        at org.apache.maven.jelly.tags.werkz.MavenAttainGoalTag.doTag(MavenAttai
nGoalTag.java:127)
        at org.apache.commons.jelly.impl.TagScript.run(TagScript.java:279)
        at org.apache.commons.jelly.impl.ScriptBlock.run(ScriptBlock.java:135)
        at org.apache.maven.jelly.tags.werkz.MavenGoalTag.runBodyTag(MavenGoalTa
g.java:79)
        at org.apache.maven.jelly.tags.werkz.MavenGoalTag$MavenGoalAction.perfor
mAction(MavenGoalTag.java:110)
        at com.werken.werkz.Goal.fire(Goal.java:639)
        at com.werken.werkz.Goal.attain(Goal.java:575)
        at org.apache.maven.plugin.PluginManager.attainGoals(PluginManager.java:
671)
        at org.apache.maven.MavenSession.attainGoals(MavenSession.java:263)
        at org.apache.maven.jelly.tags.maven.ReactorTag.doTag(ReactorTag.java:36
8)
        at org.apache.commons.jelly.impl.TagScript.run(TagScript.java:279)
        at org.apache.commons.jelly.impl.ScriptBlock.run(ScriptBlock.java:135)
        at org.apache.maven.jelly.tags.werkz.MavenGoalTag.runBodyTag(MavenGoalTa
g.java:79)
        at org.apache.maven.jelly.tags.werkz.MavenGoalTag$MavenGoalAction.perfor
mAction(MavenGoalTag.java:110)
        at com.werken.werkz.Goal.fire(Goal.java:639)
        at com.werken.werkz.Goal.attain(Goal.java:575)
        at com.werken.werkz.WerkzProject.attainGoal(WerkzProject.java:193)
        at org.apache.maven.jelly.tags.werkz.MavenAttainGoalTag.doTag(MavenAttai
nGoalTag.java:127)
        at org.apache.commons.jelly.impl.TagScript.run(TagScript.java:279)
        at org.apache.commons.jelly.impl.ScriptBlock.run(ScriptBlock.java:135)
        at org.apache.maven.jelly.tags.werkz.MavenGoalTag.runBodyTag(MavenGoalTa
g.java:79)
        at org.apache.maven.jelly.tags.werkz.MavenGoalTag$MavenGoalAction.perfor
mAction(MavenGoalTag.java:110)
        at com.werken.werkz.Goal.fire(Goal.java:639)
        at com.werken.werkz.Goal.attain(Goal.java:575)
        at org.apache.maven.plugin.PluginManager.attainGoals(PluginManager.java:
671)
        at org.apache.maven.MavenSession.attainGoals(MavenSession.java:263)
        at org.apache.maven.cli.App.doMain(App.java:488)
        at org.apache.maven.cli.App.main(App.java:1239)
        at sun.reflect.NativeMethodAccessorImpl.invoke0(Native Method)
        at sun.reflect.NativeMethodAccessorImpl.invoke(NativeMethodAccessorImpl.
java:39)
        at sun.reflect.DelegatingMethodAccessorImpl.invoke(DelegatingMethodAcces
sorImpl.java:25)
        at java.lang.reflect.Method.invoke(Method.java:324)
        at com.werken.forehead.Forehead.run(Forehead.java:551)
        at com.werken.forehead.Forehead.main(Forehead.java:581)
Caused by: org.apache.geronimo.common.DeploymentException: org.apache.geronimo.k
ernel.repository.MissingDependencyException: uri org.apache.geronimo.specs/geron
imo-corba_2.3_spec/1.1-SNAPSHOT/jar not found in repository
        at org.apache.geronimo.deployment.service.ServiceConfigBuilder.getDepend
encyURI(ServiceConfigBuilder.java:402)
        at org.apache.geronimo.deployment.service.ServiceConfigBuilder.addDepend
encies(ServiceConfigBuilder.java:276)
        at org.apache.geronimo.deployment.service.ServiceConfigBuilder.addDepend
encies(ServiceConfigBuilder.java:303)
        at org.apache.geronimo.deployment.service.ServiceConfigBuilder.buildConf
iguration(ServiceConfigBuilder.java:204)
        at org.apache.geronimo.deployment.service.ServiceConfigBuilder.buildConf
iguration(ServiceConfigBuilder.java:167)
        at org.apache.geronimo.deployment.service.ServiceConfigBuilder$$FastClas
sByCGLIB$$9f173be6.invoke(<generated>)
        at net.sf.cglib.reflect.FastMethod.invoke(FastMethod.java:53)
        at org.apache.geronimo.gbean.runtime.FastMethodInvoker.invoke(FastMethod
Invoker.java:38)
        at org.apache.geronimo.gbean.runtime.GBeanOperation.invoke(GBeanOperatio
n.java:118)
        at org.apache.geronimo.gbean.runtime.GBeanInstance.invoke(GBeanInstance.
java:800)
        at org.apache.geronimo.gbean.runtime.RawInvoker.invoke(RawInvoker.java:5
7)
        at org.apache.geronimo.kernel.basic.RawOperationInvoker.invoke(RawOperat
ionInvoker.java:36)
        at org.apache.geronimo.kernel.basic.ProxyMethodInterceptor.intercept(Pro
xyMethodInterceptor.java:96)
        at org.apache.geronimo.deployment.ConfigurationBuilder$$EnhancerByCGLIB$
$50d44f45.buildConfiguration(<generated>)
        at org.apache.geronimo.deployment.Deployer.deploy(Deployer.java:279)
        at org.apache.geronimo.deployment.Deployer$$FastClassByCGLIB$$734a235d.i
nvoke(<generated>)
        at net.sf.cglib.reflect.FastMethod.invoke(FastMethod.java:53)
        at org.apache.geronimo.gbean.runtime.FastMethodInvoker.invoke(FastMethod
Invoker.java:38)
        at org.apache.geronimo.gbean.runtime.GBeanOperation.invoke(GBeanOperatio
n.java:118)
        at org.apache.geronimo.gbean.runtime.GBeanInstance.invoke(GBeanInstance.
java:835)
        at org.apache.geronimo.kernel.basic.BasicKernel.invoke(BasicKernel.java:
178)
        at org.apache.geronimo.plugin.packaging.PackageBuilder.invokeDeployer(Pa
ckageBuilder.java:389)
        at org.apache.geronimo.plugin.packaging.PackageBuilder.execute(PackageBu
ilder.java:294)
        ... 53 more
Caused by: org.apache.geronimo.kernel.repository.MissingDependencyException: uri
 org.apache.geronimo.specs/geronimo-corba_2.3_spec/1.1-SNAPSHOT/jar not found in
 repository
        ... 76 more

BUILD FAILED
File...... C:\home\sdwivedi\geronimo\geronimo\maven.xml
Element... maven:reactor
Line...... 58
Column.... 112
Unable to obtain goal [multiproject:install-callback] -- C:\Documents and Settin
gs\sdwivedi\.maven\cache\geronimo-packaging-plugin-1.1.3\plugin.jelly:69:15: <ca
r:package> null
Mime
View raw message