geronimo-user mailing list archives

Site index · List index
Message view « Date » · « Thread »
Top « Date » · « Thread »
From "Nicholas Irving" <nirv...@darkedges.com>
Subject RE: fail to build with
Date Fri, 23 Dec 2005 23:27:52 GMT
I get this when I use that branch

 

+----------------------------------------

| geronimo and geronimo-plugins Geronimo :: Axis

| Memory: 17M/23M

+----------------------------------------

Attempting to download axis-1.4-356167.jar.

WARNING: Failed to download axis-1.4-356167.jar.

 

BUILD FAILED

File...... D:\java\libraries\svn\geronimo\maven.xml

Element... maven:reactor

Line...... 43

Column.... 154

The build cannot continue because of the following unsatisfied dependency:

 

axis-1.4-356167.jar

 

am I not using the correct repo?
http://ibiblio.org/maven/axis/jars/axis-1.4-356167.jar does not seem to
exist.

 

What repos should I have as default?

 

  _____  

From: Sachin Patel [mailto:sppatel2@gmail.com] 
Sent: Saturday, 24 December 2005 8:26 AM
To: user@geronimo.apache.org
Subject: Re: fail to build with 

 

Try checking out from the v1 branch instead of head.

 

http://svn.apache.org/repos/asf/geronimo/branches/1.0/

 

 

- sachin

 





 

On Dec 23, 2005, at 4:02 PM, Henry Hwang wrote:





Sachin:

 

I clean the svn checkout and went through the process of checking out the
trunk again:

 

>svn checkout  <https://svn.apache.org/repos/asf/geronimo/trunk>
https://svn.apache.org/repos/asf/geronimo/trunk geronimo

>cd geronimo

>svn update

Then

 

>maven -o m:fresh-checkout

 

Everything works

 

Then I did:

 

>maven new

 

It compiled for a while, then hit the same error again:

 

+----------------------------------------

| configurations Daytrader using derby deployed on tomcat

| Memory: 87M/101M

+----------------------------------------

Attempting to download geronimo-gbean-deployer-1.0-SNAPSHOT.car.

Attempting to download j2ee-deployer-1.0-SNAPSHOT.car.

Attempting to download tomcat-deployer-1.0-SNAPSHOT.car.

Attempting to download j2ee-server-1.0-SNAPSHOT.car.

Attempting to download geronimo-daytrader-derby-db-1.0-SNAPSHOT.jar.

Attempting to download daytrader-ear-1.0-SNAPSHOT.ear.

Attempting to download geronimo-system-1.0-SNAPSHOT.jar.

Attempting to download geronimo-activation-1.0-SNAPSHOT.jar.

Attempting to download geronimo-j2ee-1.0-SNAPSHOT.jar.

Attempting to download geronimo-core-1.0-SNAPSHOT.jar.

Attempting to download geronimo-common-1.0-SNAPSHOT.jar.

Attempting to download geronimo-connector-1.0-SNAPSHOT.jar.

Attempting to download geronimo-naming-1.0-SNAPSHOT.jar.

Attempting to download geronimo-timer-1.0-SNAPSHOT.jar.

Attempting to download geronimo-transaction-1.0-SNAPSHOT.jar.

Attempting to download geronimo-security-1.0-SNAPSHOT.jar.

Attempting to download geronimo-webservices-1.0-SNAPSHOT.jar.

Attempting to download geronimo-jmxremoting-1.0-SNAPSHOT.jar.

Attempting to download geronimo-client-1.0-SNAPSHOT.jar.

Attempting to download geronimo-axis-1.0-SNAPSHOT.jar.

Attempting to download geronimo-tomcat-1.0-SNAPSHOT.jar.

Attempting to download openejb-core-2.0-SNAPSHOT.jar.

car:prepare-plan:

 

car:package:

 

car:install:

 

 

build:end:

 

build:start:

 

multiproject:install-callback:

    [echo] Running car:install for Daytrader using derby deployed on tomcat

Retrieving document at 'WEB-INF/wsdl/TradeServices.wsdl'.

112916 [main] ERROR org.apache.geronimo.plugin.packaging.PackageBuilder  -
org.apache.geronimo.common.DeploymentException: a connector is missing in
repository: activemq/activemq-ra/3.2.1/rar

org.apache.geronimo.common.DeploymentException: a connector is missing in
repository: activemq/activemq-ra/3.2.1/rar

        at
org.apache.geronimo.j2ee.deployment.EARConfigBuilder.addModules(EARConfigBui
lder.java:614)

        at
org.apache.geronimo.j2ee.deployment.EARConfigBuilder.getEarPlan(EARConfigBui
lder.java:226)

.

 

Am I checking out the right branch?  Or should I check out:

 


/geronimo/branches/1.0


 


I read in the user group many reference to checking out the 'head' as the
best way to build the source.  What exactly is the 'head'?

 

I am using maven 1.0.2, so according to the user group, it should be able to
find the global repository inherited from the parent, so why does it still
fail?

 

Henry

  _____  

From: Sachin Patel [mailto:sppatel2@gmail.com] 
Sent: Wednesday, December 21, 2005 6:34 PM
To: user@geronimo.apache.org
Subject: Re: fail to build with

 

The build instructions are incorrect.  First you'll want to invoke maven -o
m:fresh-checkout

 

Then to build and generate both distributions, (Jetty/Tomcat) invoke...

 

maven new

 

- sachin

 






 

On Dec 21, 2005, at 9:28 PM, Henry Hwang wrote:






I have check out with svn the trunk folder of Geronimo and updated it:

 

>svn checkout  <https://svn.apache.org/repos/asf/geronimo/trunk>
https://svn.apache.org/repos/asf/geronimo/trunk geronimo

>svn update

 

At revision 358434.

 

Afterward, I did at the root folder of geronimo

 

>maven m:co

>maven m:rebuild-all

 

Then I ran:

>maven

 

It ran for a while, then fail on this target:

 

 

+----------------------------------------

| configurations Daytrader using derby deployed on tomcat

| Memory: 81M/96M

+----------------------------------------

Attempting to download geronimo-gbean-deployer-1.0-SNAPSHOT.car.

Attempting to download j2ee-deployer-1.0-SNAPSHOT.car.

Attempting to download tomcat-deployer-1.0-SNAPSHOT.car.

Attempting to download j2ee-server-1.0-SNAPSHOT.car.

Attempting to download geronimo-daytrader-derby-db-1.0-SNAPSHOT.jar.

Attempting to download daytrader-ear-1.0-SNAPSHOT.ear.

Attempting to download geronimo-system-1.0-SNAPSHOT.jar.

Attempting to download geronimo-activation-1.0-SNAPSHOT.jar.

Attempting to download geronimo-j2ee-1.0-SNAPSHOT.jar.

Attempting to download geronimo-core-1.0-SNAPSHOT.jar.

Attempting to download geronimo-common-1.0-SNAPSHOT.jar.

Attempting to download geronimo-connector-1.0-SNAPSHOT.jar.

Attempting to download geronimo-naming-1.0-SNAPSHOT.jar.

Attempting to download geronimo-timer-1.0-SNAPSHOT.jar.

Attempting to download geronimo-transaction-1.0-SNAPSHOT.jar.

Attempting to download geronimo-security-1.0-SNAPSHOT.jar.

Attempting to download geronimo-webservices-1.0-SNAPSHOT.jar.

Attempting to download geronimo-jmxremoting-1.0-SNAPSHOT.jar.

Attempting to download geronimo-client-1.0-SNAPSHOT.jar.

Attempting to download geronimo-axis-1.0-SNAPSHOT.jar.

Attempting to download geronimo-tomcat-1.0-SNAPSHOT.jar.

Attempting to download openejb-core-2.0-SNAPSHOT.jar.

car:prepare-plan:

 

car:package:

 

car:install:

 

 

build:end:

 

build:start:

 

multiproject:install-callback:

    [echo] Running car:install for Daytrader using derby deployed on tomcat

Retrieving document at 'WEB-INF/wsdl/TradeServices.wsdl'.

120598 [main] ERROR org.apache.geronimo.plugin.packaging.PackageBuilder  -
org.apache.geronimo.common.DeploymentException: a connector is missing in
repository: activemq/activemq-ra/3.2.1/rar

org.apache.geronimo.common.DeploymentException: a connector is missing in
repository: activemq/activemq-ra/3.2.1/rar

        at
org.apache.geronimo.j2ee.deployment.EARConfigBuilder.addModules(EARConfigBui
lder.java:614)

        at
org.apache.geronimo.j2ee.deployment.EARConfigBuilder.getEarPlan(EARConfigBui
lder.java:226)

        at
org.apache.geronimo.j2ee.deployment.EARConfigBuilder.getDeploymentPlan(EARCo
nfigBuilder.java:122)

        at
org.apache.geronimo.j2ee.deployment.EARConfigBuilder$$FastClassByCGLIB$$38e5
6ec6.invoke(<generated>)

        at net.sf.cglib.reflect.FastMethod.invoke(FastMethod.java:53)

        at
org.apache.geronimo.gbean.runtime.FastMethodInvoker.invoke(FastMethodInvoker
.java:38)

        at
org.apache.geronimo.gbean.runtime.GBeanOperation.invoke(GBeanOperation.java:
118)

        at
org.apache.geronimo.gbean.runtime.GBeanInstance.invoke(GBeanInstance.java:80
0)

        at
org.apache.geronimo.gbean.runtime.RawInvoker.invoke(RawInvoker.java:57)

        at
org.apache.geronimo.kernel.basic.RawOperationInvoker.invoke(RawOperationInvo
ker.java:36)

        at
org.apache.geronimo.kernel.basic.ProxyMethodInterceptor.intercept(ProxyMetho
dInterceptor.java:96)

        at
org.apache.geronimo.deployment.ConfigurationBuilder$$EnhancerByCGLIB$$8eec00
11.getDeploymentPlan(<generated>)

        at org.apache.geronimo.deployment.Deployer.deploy(Deployer.java:219)

        at
org.apache.geronimo.deployment.Deployer$$FastClassByCGLIB$$734a235d.invoke(<
generated>)

        at net.sf.cglib.reflect.FastMethod.invoke(FastMethod.java:53)

        at
org.apache.geronimo.gbean.runtime.FastMethodInvoker.invoke(FastMethodInvoker
.java:38)

        at
org.apache.geronimo.gbean.runtime.GBeanOperation.invoke(GBeanOperation.java:
118)

        at
org.apache.geronimo.gbean.runtime.GBeanInstance.invoke(GBeanInstance.java:83
5)

        at
org.apache.geronimo.kernel.basic.BasicKernel.invoke(BasicKernel.java:178)

        at
org.apache.geronimo.plugin.packaging.PackageBuilder.invokeDeployer(PackageBu
ilder.java:375)

        at
org.apache.geronimo.plugin.packaging.PackageBuilder.execute(PackageBuilder.j
ava:284)

        at sun.reflect.GeneratedMethodAccessor359.invoke(Unknown Source)

        at
sun.reflect.DelegatingMethodAccessorImpl.invoke(DelegatingMethodAccessorImpl
.java:25)

        at java.lang.reflect.Method.invoke(Method.java:324)

        at
org.apache.geronimo.plugin.packaging.PackageBuilderShell.execute(PackageBuil
derShell.java:222)

        at sun.reflect.GeneratedMethodAccessor346.invoke(Unknown Source)

        at
sun.reflect.DelegatingMethodAccessorImpl.invoke(DelegatingMethodAccessorImpl
.java:25)

        at java.lang.reflect.Method.invoke(Method.java:324)

        at
org.apache.commons.jelly.impl.DynamicBeanTag.doTag(DynamicBeanTag.java:230)

        at
org.apache.commons.jelly.impl.StaticTagScript.run(StaticTagScript.java:145)

        at
org.apache.commons.jelly.impl.ScriptBlock.run(ScriptBlock.java:135)

        at
org.apache.maven.jelly.tags.werkz.MavenGoalTag.runBodyTag(MavenGoalTag.java:
79)

        at
org.apache.maven.jelly.tags.werkz.MavenGoalTag$MavenGoalAction.performAction
(MavenGoalTag.java:110)

        at com.werken.werkz.Goal.fire(Goal.java:639)

        at com.werken.werkz.Goal.attain(Goal.java:575)

        at com.werken.werkz.Goal.attainPrecursors(Goal.java:488)

        at com.werken.werkz.Goal.attain(Goal.java:573)

        at com.werken.werkz.WerkzProject.attainGoal(WerkzProject.java:193)

        at
org.apache.maven.jelly.tags.werkz.MavenAttainGoalTag.doTag(MavenAttainGoalTa
g.java:127)

        at org.apache.commons.jelly.impl.TagScript.run(TagScript.java:279)

        at
org.apache.commons.jelly.impl.ScriptBlock.run(ScriptBlock.java:135)

        at
org.apache.maven.jelly.tags.werkz.MavenGoalTag.runBodyTag(MavenGoalTag.java:
79)

        at
org.apache.maven.jelly.tags.werkz.MavenGoalTag$MavenGoalAction.performAction
(MavenGoalTag.java:110)

        at com.werken.werkz.Goal.fire(Goal.java:639)

        at com.werken.werkz.Goal.attain(Goal.java:575)

        at
org.apache.maven.plugin.PluginManager.attainGoals(PluginManager.java:671)

        at org.apache.maven.MavenSession.attainGoals(MavenSession.java:263)

        at
org.apache.maven.jelly.tags.maven.ReactorTag.doTag(ReactorTag.java:368)

        at org.apache.commons.jelly.impl.TagScript.run(TagScript.java:279)

        at
org.apache.commons.jelly.impl.ScriptBlock.run(ScriptBlock.java:135)

        at
org.apache.maven.jelly.tags.werkz.MavenGoalTag.runBodyTag(MavenGoalTag.java:
79)

        at
org.apache.maven.jelly.tags.werkz.MavenGoalTag$MavenGoalAction.performAction
(MavenGoalTag.java:110)

        at com.werken.werkz.Goal.fire(Goal.java:639)

        at com.werken.werkz.Goal.attain(Goal.java:575)

        at com.werken.werkz.WerkzProject.attainGoal(WerkzProject.java:193)

        at
org.apache.maven.jelly.tags.werkz.MavenAttainGoalTag.doTag(MavenAttainGoalTa
g.java:127)

        at org.apache.commons.jelly.impl.TagScript.run(TagScript.java:279)

        at
org.apache.commons.jelly.impl.ScriptBlock.run(ScriptBlock.java:135)

        at
org.apache.maven.jelly.tags.werkz.MavenGoalTag.runBodyTag(MavenGoalTag.java:
79)

        at
org.apache.maven.jelly.tags.werkz.MavenGoalTag$MavenGoalAction.performAction
(MavenGoalTag.java:110)

        at com.werken.werkz.Goal.fire(Goal.java:639)

        at com.werken.werkz.Goal.attain(Goal.java:575)

        at
org.apache.maven.plugin.PluginManager.attainGoals(PluginManager.java:671)

        at org.apache.maven.MavenSession.attainGoals(MavenSession.java:263)

        at org.apache.maven.cli.App.doMain(App.java:488)

        at org.apache.maven.cli.App.main(App.java:1239)

        at sun.reflect.NativeMethodAccessorImpl.invoke0(Native Method)

        at
sun.reflect.NativeMethodAccessorImpl.invoke(NativeMethodAccessorImpl.java:39
)

        at
sun.reflect.DelegatingMethodAccessorImpl.invoke(DelegatingMethodAccessorImpl
.java:25)

        at java.lang.reflect.Method.invoke(Method.java:324)

        at com.werken.forehead.Forehead.run(Forehead.java:551)

        at com.werken.forehead.Forehead.main(Forehead.java:581)

17:36:27,434 ERROR [PackageBuilder]
org.apache.geronimo.common.DeploymentException: a connector is missing in
repository: activemq/activemq-ra/3.2.1/rar

org.apache.geronimo.common.DeploymentException: a connector is missing in
repository: activemq/activemq-ra/3.2.1/rar

        at
org.apache.geronimo.j2ee.deployment.EARConfigBuilder.addModules(EARConfigBui
lder.java:614)

        at
org.apache.geronimo.j2ee.deployment.EARConfigBuilder.getEarPlan(EARConfigBui
lder.java:226)

        at
org.apache.geronimo.j2ee.deployment.EARConfigBuilder.getDeploymentPlan(EARCo
nfigBuilder.java:122)

        at
org.apache.geronimo.j2ee.deployment.EARConfigBuilder$$FastClassByCGLIB$$38e5
6ec6.invoke(<generated>)

        at net.sf.cglib.reflect.FastMethod.invoke(FastMethod.java:53)

        at
org.apache.geronimo.gbean.runtime.FastMethodInvoker.invoke(FastMethodInvoker
.java:38)

        at
org.apache.geronimo.gbean.runtime.GBeanOperation.invoke(GBeanOperation.java:
118)

        at
org.apache.geronimo.gbean.runtime.GBeanInstance.invoke(GBeanInstance.java:80
0)

        at
org.apache.geronimo.gbean.runtime.RawInvoker.invoke(RawInvoker.java:57)

        at
org.apache.geronimo.kernel.basic.RawOperationInvoker.invoke(RawOperationInvo
ker.java:36)

        at
org.apache.geronimo.kernel.basic.ProxyMethodInterceptor.intercept(ProxyMetho
dInterceptor.java:96)

        at
org.apache.geronimo.deployment.ConfigurationBuilder$$EnhancerByCGLIB$$8eec00
11.getDeploymentPlan(<generated>)

        at org.apache.geronimo.deployment.Deployer.deploy(Deployer.java:219)

        at
org.apache.geronimo.deployment.Deployer$$FastClassByCGLIB$$734a235d.invoke(<
generated>)

        at net.sf.cglib.reflect.FastMethod.invoke(FastMethod.java:53)

        at
org.apache.geronimo.gbean.runtime.FastMethodInvoker.invoke(FastMethodInvoker
.java:38)

        at
org.apache.geronimo.gbean.runtime.GBeanOperation.invoke(GBeanOperation.java:
118)

        at
org.apache.geronimo.gbean.runtime.GBeanInstance.invoke(GBeanInstance.java:83
5)

        at
org.apache.geronimo.kernel.basic.BasicKernel.invoke(BasicKernel.java:178)

        at
org.apache.geronimo.plugin.packaging.PackageBuilder.invokeDeployer(PackageBu
ilder.java:375)

        at
org.apache.geronimo.plugin.packaging.PackageBuilder.execute(PackageBuilder.j
ava:284)

        at sun.reflect.GeneratedMethodAccessor359.invoke(Unknown Source)

        at
sun.reflect.DelegatingMethodAccessorImpl.invoke(DelegatingMethodAccessorImpl
.java:25)

        at java.lang.reflect.Method.invoke(Method.java:324)

        at
org.apache.geronimo.plugin.packaging.PackageBuilderShell.execute(PackageBuil
derShell.java:222)

        at sun.reflect.GeneratedMethodAccessor346.invoke(Unknown Source)

        at
sun.reflect.DelegatingMethodAccessorImpl.invoke(DelegatingMethodAccessorImpl
.java:25)

        at java.lang.reflect.Method.invoke(Method.java:324)

        at
org.apache.commons.jelly.impl.DynamicBeanTag.doTag(DynamicBeanTag.java:230)

        at
org.apache.commons.jelly.impl.StaticTagScript.run(StaticTagScript.java:145)

        at
org.apache.commons.jelly.impl.ScriptBlock.run(ScriptBlock.java:135)

        at
org.apache.maven.jelly.tags.werkz.MavenGoalTag.runBodyTag(MavenGoalTag.java:
79)

        at
org.apache.maven.jelly.tags.werkz.MavenGoalTag$MavenGoalAction.performAction
(MavenGoalTag.java:110)

        at com.werken.werkz.Goal.fire(Goal.java:639)

        at com.werken.werkz.Goal.attain(Goal.java:575)

        at com.werken.werkz.Goal.attainPrecursors(Goal.java:488)

        at com.werken.werkz.Goal.attain(Goal.java:573)

        at com.werken.werkz.WerkzProject.attainGoal(WerkzProject.java:193)

        at
org.apache.maven.jelly.tags.werkz.MavenAttainGoalTag.doTag(MavenAttainGoalTa
g.java:127)

        at org.apache.commons.jelly.impl.TagScript.run(TagScript.java:279)

        at
org.apache.commons.jelly.impl.ScriptBlock.run(ScriptBlock.java:135)

        at
org.apache.maven.jelly.tags.werkz.MavenGoalTag.runBodyTag(MavenGoalTag.java:
79)

        at
org.apache.maven.jelly.tags.werkz.MavenGoalTag$MavenGoalAction.performAction
(MavenGoalTag.java:110)

        at com.werken.werkz.Goal.fire(Goal.java:639)

        at com.werken.werkz.Goal.attain(Goal.java:575)

        at
org.apache.maven.plugin.PluginManager.attainGoals(PluginManager.java:671)

        at org.apache.maven.MavenSession.attainGoals(MavenSession.java:263)

        at
org.apache.maven.jelly.tags.maven.ReactorTag.doTag(ReactorTag.java:368)

        at org.apache.commons.jelly.impl.TagScript.run(TagScript.java:279)

        at
org.apache.commons.jelly.impl.ScriptBlock.run(ScriptBlock.java:135)

        at
org.apache.maven.jelly.tags.werkz.MavenGoalTag.runBodyTag(MavenGoalTag.java:
79)

        at
org.apache.maven.jelly.tags.werkz.MavenGoalTag$MavenGoalAction.performAction
(MavenGoalTag.java:110)

        at com.werken.werkz.Goal.fire(Goal.java:639)

        at com.werken.werkz.Goal.attain(Goal.java:575)

        at com.werken.werkz.WerkzProject.attainGoal(WerkzProject.java:193)

        at
org.apache.maven.jelly.tags.werkz.MavenAttainGoalTag.doTag(MavenAttainGoalTa
g.java:127)

        at org.apache.commons.jelly.impl.TagScript.run(TagScript.java:279)

        at
org.apache.commons.jelly.impl.ScriptBlock.run(ScriptBlock.java:135)

        at
org.apache.maven.jelly.tags.werkz.MavenGoalTag.runBodyTag(MavenGoalTag.java:
79)

        at
org.apache.maven.jelly.tags.werkz.MavenGoalTag$MavenGoalAction.performAction
(MavenGoalTag.java:110)

        at com.werken.werkz.Goal.fire(Goal.java:639)

        at com.werken.werkz.Goal.attain(Goal.java:575)

        at
org.apache.maven.plugin.PluginManager.attainGoals(PluginManager.java:671)

        at org.apache.maven.MavenSession.attainGoals(MavenSession.java:263)

        at org.apache.maven.cli.App.doMain(App.java:488)

        at org.apache.maven.cli.App.main(App.java:1239)

        at sun.reflect.NativeMethodAccessorImpl.invoke0(Native Method)

        at
sun.reflect.NativeMethodAccessorImpl.invoke(NativeMethodAccessorImpl.java:39
)

        at
sun.reflect.DelegatingMethodAccessorImpl.invoke(DelegatingMethodAccessorImpl
.java:25)

        at java.lang.reflect.Method.invoke(Method.java:324)

        at com.werken.forehead.Forehead.run(Forehead.java:551)

        at com.werken.forehead.Forehead.main(Forehead.java:581)

java.lang.reflect.InvocationTargetException: null

java.lang.reflect.InvocationTargetException

        at sun.reflect.GeneratedMethodAccessor359.invoke(Unknown Source)

        at
sun.reflect.DelegatingMethodAccessorImpl.invoke(DelegatingMethodAccessorImpl
.java:25)

        at java.lang.reflect.Method.invoke(Method.java:324)

        at
org.apache.geronimo.plugin.packaging.PackageBuilderShell.execute(PackageBuil
derShell.java:222)

        at sun.reflect.GeneratedMethodAccessor346.invoke(Unknown Source)

        at
sun.reflect.DelegatingMethodAccessorImpl.invoke(DelegatingMethodAccessorImpl
.java:25)

        at java.lang.reflect.Method.invoke(Method.java:324)

        at
org.apache.commons.jelly.impl.DynamicBeanTag.doTag(DynamicBeanTag.java:230)

        at
org.apache.commons.jelly.impl.StaticTagScript.run(StaticTagScript.java:145)

        at
org.apache.commons.jelly.impl.ScriptBlock.run(ScriptBlock.java:135)

        at
org.apache.maven.jelly.tags.werkz.MavenGoalTag.runBodyTag(MavenGoalTag.java:
79)

        at
org.apache.maven.jelly.tags.werkz.MavenGoalTag$MavenGoalAction.performAction
(MavenGoalTag.java:110)

        at com.werken.werkz.Goal.fire(Goal.java:639)

        at com.werken.werkz.Goal.attain(Goal.java:575)

        at com.werken.werkz.Goal.attainPrecursors(Goal.java:488)

        at com.werken.werkz.Goal.attain(Goal.java:573)

        at com.werken.werkz.WerkzProject.attainGoal(WerkzProject.java:193)

        at
org.apache.maven.jelly.tags.werkz.MavenAttainGoalTag.doTag(MavenAttainGoalTa
g.java:127)

        at org.apache.commons.jelly.impl.TagScript.run(TagScript.java:279)

        at
org.apache.commons.jelly.impl.ScriptBlock.run(ScriptBlock.java:135)

        at
org.apache.maven.jelly.tags.werkz.MavenGoalTag.runBodyTag(MavenGoalTag.java:
79)

        at
org.apache.maven.jelly.tags.werkz.MavenGoalTag$MavenGoalAction.performAction
(MavenGoalTag.java:110)

        at com.werken.werkz.Goal.fire(Goal.java:639)

        at com.werken.werkz.Goal.attain(Goal.java:575)

        at
org.apache.maven.plugin.PluginManager.attainGoals(PluginManager.java:671)

        at org.apache.maven.MavenSession.attainGoals(MavenSession.java:263)

        at
org.apache.maven.jelly.tags.maven.ReactorTag.doTag(ReactorTag.java:368)

        at org.apache.commons.jelly.impl.TagScript.run(TagScript.java:279)

        at
org.apache.commons.jelly.impl.ScriptBlock.run(ScriptBlock.java:135)

        at
org.apache.maven.jelly.tags.werkz.MavenGoalTag.runBodyTag(MavenGoalTag.java:
79)

        at
org.apache.maven.jelly.tags.werkz.MavenGoalTag$MavenGoalAction.performAction
(MavenGoalTag.java:110)

        at com.werken.werkz.Goal.fire(Goal.java:639)

        at com.werken.werkz.Goal.attain(Goal.java:575)

        at com.werken.werkz.WerkzProject.attainGoal(WerkzProject.java:193)

        at
org.apache.maven.jelly.tags.werkz.MavenAttainGoalTag.doTag(MavenAttainGoalTa
g.java:127)

        at org.apache.commons.jelly.impl.TagScript.run(TagScript.java:279)

        at
org.apache.commons.jelly.impl.ScriptBlock.run(ScriptBlock.java:135)

        at
org.apache.maven.jelly.tags.werkz.MavenGoalTag.runBodyTag(MavenGoalTag.java:
79)

        at
org.apache.maven.jelly.tags.werkz.MavenGoalTag$MavenGoalAction.performAction
(MavenGoalTag.java:110)

        at com.werken.werkz.Goal.fire(Goal.java:639)

        at com.werken.werkz.Goal.attain(Goal.java:575)

        at
org.apache.maven.plugin.PluginManager.attainGoals(PluginManager.java:671)

        at org.apache.maven.MavenSession.attainGoals(MavenSession.java:263)

        at org.apache.maven.cli.App.doMain(App.java:488)

        at org.apache.maven.cli.App.main(App.java:1239)

        at sun.reflect.NativeMethodAccessorImpl.invoke0(Native Method)

        at
sun.reflect.NativeMethodAccessorImpl.invoke(NativeMethodAccessorImpl.java:39
)

        at
sun.reflect.DelegatingMethodAccessorImpl.invoke(DelegatingMethodAccessorImpl
.java:25)

        at java.lang.reflect.Method.invoke(Method.java:324)

        at com.werken.forehead.Forehead.run(Forehead.java:551)

        at com.werken.forehead.Forehead.main(Forehead.java:581)

Caused by: org.apache.geronimo.common.DeploymentException: a connector is
missing in repository: activemq/activemq-ra/3.2.1/rar

        at
org.apache.geronimo.j2ee.deployment.EARConfigBuilder.addModules(EARConfigBui
lder.java:614)

        at
org.apache.geronimo.j2ee.deployment.EARConfigBuilder.getEarPlan(EARConfigBui
lder.java:226)

        at
org.apache.geronimo.j2ee.deployment.EARConfigBuilder.getDeploymentPlan(EARCo
nfigBuilder.java:122)

        at
org.apache.geronimo.j2ee.deployment.EARConfigBuilder$$FastClassByCGLIB$$38e5
6ec6.invoke(<generated>)

        at net.sf.cglib.reflect.FastMethod.invoke(FastMethod.java:53)

        at
org.apache.geronimo.gbean.runtime.FastMethodInvoker.invoke(FastMethodInvoker
.java:38)

        at
org.apache.geronimo.gbean.runtime.GBeanOperation.invoke(GBeanOperation.java:
118)

        at
org.apache.geronimo.gbean.runtime.GBeanInstance.invoke(GBeanInstance.java:80
0)

        at
org.apache.geronimo.gbean.runtime.RawInvoker.invoke(RawInvoker.java:57)

        at
org.apache.geronimo.kernel.basic.RawOperationInvoker.invoke(RawOperationInvo
ker.java:36)

        at
org.apache.geronimo.kernel.basic.ProxyMethodInterceptor.intercept(ProxyMetho
dInterceptor.java:96)

        at
org.apache.geronimo.deployment.ConfigurationBuilder$$EnhancerByCGLIB$$8eec00
11.getDeploymentPlan(<generated>)

        at org.apache.geronimo.deployment.Deployer.deploy(Deployer.java:219)

        at
org.apache.geronimo.deployment.Deployer$$FastClassByCGLIB$$734a235d.invoke(<
generated>)

        at net.sf.cglib.reflect.FastMethod.invoke(FastMethod.java:53)

        at
org.apache.geronimo.gbean.runtime.FastMethodInvoker.invoke(FastMethodInvoker
.java:38)

        at
org.apache.geronimo.gbean.runtime.GBeanOperation.invoke(GBeanOperation.java:
118)

        at
org.apache.geronimo.gbean.runtime.GBeanInstance.invoke(GBeanInstance.java:83
5)

        at
org.apache.geronimo.kernel.basic.BasicKernel.invoke(BasicKernel.java:178)

        at
org.apache.geronimo.plugin.packaging.PackageBuilder.invokeDeployer(PackageBu
ilder.java:375)

        at
org.apache.geronimo.plugin.packaging.PackageBuilder.execute(PackageBuilder.j
ava:284)

        ... 51 more

 

BUILD FAILED

File......
/home/hhwang/qaprojs/configappservers/geronim1.0M5/svn_src/geronimo/maven.xm
l

Element... maven:reactor

Line...... 58

Column.... 112

Unable to obtain goal [multiproject:install-callback] --
/home/hhwang/.maven/cache/geronimo-packaging-plugin-1.1.1/plugin.jelly:68:15
: <car:package> null

Total time: 27 minutes 57 seconds

Finished at: Wed Dec 21 17:36:28 PST 2005

 

 

I tried remove .maven directory at home, and rebuild, but got the same
error.

 

Henry






 





 


Mime
View raw message