geronimo-scm mailing list archives

Site index · List index
Message view « Date » · « Thread »
Top « Date » · « Thread »
From Apache Jenkins Server <jenk...@builds.apache.org>
Subject Build failed in Jenkins: GeronimoConfig #108
Date Thu, 17 May 2018 03:03:50 GMT
See <https://builds.apache.org/job/GeronimoConfig/108/display/redirect?page=changes>

Changes:

[rmannibucau] proxy based impl

------------------------------------------
[...truncated 6.01 KB...]
At revision 1831746

Parsing POMs
Downloaded artifact http://repo.maven.apache.org/maven2/org/jboss/arquillian/arquillian-bom/1.1.14.Final/arquillian-bom-1.1.14.Final.pom
Modules changed, recalculating dependency graph
Established TCP socket on 36326
maven33-agent.jar already up to date
maven33-interceptor.jar already up to date
maven3-interceptor-commons.jar already up to date
[GeronimoConfig] $ /home/jenkins/tools/java/latest1.8/bin/java -Xmx2g -Xms256m -cp /home/jenkins/jenkins-slave/maven33-agent.jar:/home/jenkins/tools/maven/apache-maven-3.3.3/boot/plexus-classworlds-2.5.2.jar:/home/jenkins/tools/maven/apache-maven-3.3.3/conf/logging
jenkins.maven3.agent.Maven33Main /home/jenkins/tools/maven/apache-maven-3.3.3 /home/jenkins/jenkins-slave/slave.jar
/home/jenkins/jenkins-slave/maven33-interceptor.jar /home/jenkins/jenkins-slave/maven3-interceptor-commons.jar
36326
<===[JENKINS REMOTING CAPACITY]===>   channel started
Executing Maven:  -B -f <https://builds.apache.org/job/GeronimoConfig/ws/pom.xml> -Dmaven.repo.local=/home/jenkins/jenkins-slave/maven-repositories/0
clean install source:jar deploy -U -Peclipse-repo
[INFO] Scanning for projects...
[INFO] ------------------------------------------------------------------------
[INFO] Reactor Build Order:
[INFO] 
[INFO] Geronimo Microprofile Configuration
[INFO] Geronimo Microprofile Configuration :: Impl
[INFO]                                                                         
[INFO] ------------------------------------------------------------------------
[INFO] Building Geronimo Microprofile Configuration 1.2-SNAPSHOT
[INFO] ------------------------------------------------------------------------
[INFO] 
[INFO] --- maven-clean-plugin:3.0.0:clean (default-clean) @ geronimo-config ---
[INFO] 
[INFO] --- apache-rat-plugin:0.12:check (rat-check) @ geronimo-config ---
[INFO] Enabled default license matchers.
[INFO] Will parse SCM ignores for exclusions...
[INFO] Finished adding exclusions from SCM ignore files.
[INFO] 62 implicit excludes (use -debug for more details).
[INFO] Exclude: .travis.yml.*
[INFO] Exclude: *.log
[INFO] 4 resources included (use -debug for more details)
[INFO] Rat check: Summary over all files. Unapproved: 0, unknown: 0, generated: 0, approved:
2 licenses.
[INFO] 
[INFO] --- maven-enforcer-plugin:1.4.1:enforce (enforce-versions) @ geronimo-config ---
[INFO] 
[INFO] --- maven-remote-resources-plugin:1.5:process (process-resource-bundles) @ geronimo-config
---
[INFO] 
[INFO] --- maven-site-plugin:3.5.1:attach-descriptor (attach-descriptor) @ geronimo-config
---
[INFO] 
[INFO] --- maven-install-plugin:2.5.2:install (default-install) @ geronimo-config ---
[INFO] Installing <https://builds.apache.org/job/GeronimoConfig/ws/pom.xml> to /home/jenkins/jenkins-slave/maven-repositories/0/org/apache/geronimo/config/geronimo-config/1.2-SNAPSHOT/geronimo-config-1.2-SNAPSHOT.pom
[INFO] 
[INFO] >>> maven-source-plugin:3.0.0:jar (default-cli) > generate-sources @ geronimo-config
>>>
[INFO] 
[INFO] --- apache-rat-plugin:0.12:check (rat-check) @ geronimo-config ---
[INFO] Enabled default license matchers.
[INFO] Will parse SCM ignores for exclusions...
[INFO] Finished adding exclusions from SCM ignore files.
[INFO] 62 implicit excludes (use -debug for more details).
[INFO] Exclude: .travis.yml.*
[INFO] Exclude: *.log
[INFO] 4 resources included (use -debug for more details)
[INFO] Rat check: Summary over all files. Unapproved: 0, unknown: 0, generated: 0, approved:
2 licenses.
[INFO] 
[INFO] --- maven-enforcer-plugin:1.4.1:enforce (enforce-versions) @ geronimo-config ---
[WARNING] Failed to getClass for org.apache.maven.plugins.source.SourceJarMojo
[INFO] 
[INFO] <<< maven-source-plugin:3.0.0:jar (default-cli) < generate-sources @ geronimo-config
<<<
[INFO] 
[INFO] --- maven-source-plugin:3.0.0:jar (default-cli) @ geronimo-config ---
[INFO] 
[INFO] --- apache-rat-plugin:0.12:check (rat-check) @ geronimo-config ---
[INFO] Enabled default license matchers.
[INFO] Will parse SCM ignores for exclusions...
[INFO] Finished adding exclusions from SCM ignore files.
[INFO] 62 implicit excludes (use -debug for more details).
[INFO] Exclude: .travis.yml.*
[INFO] Exclude: *.log
[INFO] 4 resources included (use -debug for more details)
[INFO] Rat check: Summary over all files. Unapproved: 0, unknown: 0, generated: 0, approved:
2 licenses.
[INFO] 
[INFO] --- maven-enforcer-plugin:1.4.1:enforce (enforce-versions) @ geronimo-config ---
[INFO] 
[INFO] --- maven-remote-resources-plugin:1.5:process (process-resource-bundles) @ geronimo-config
---
[INFO] 
[INFO] --- maven-site-plugin:3.5.1:attach-descriptor (attach-descriptor) @ geronimo-config
---
[INFO] 
[INFO] --- maven-install-plugin:2.5.2:install (default-install) @ geronimo-config ---
[INFO] Installing <https://builds.apache.org/job/GeronimoConfig/ws/pom.xml> to /home/jenkins/jenkins-slave/maven-repositories/0/org/apache/geronimo/config/geronimo-config/1.2-SNAPSHOT/geronimo-config-1.2-SNAPSHOT.pom
[INFO] 
[INFO] --- maven-deploy-plugin:2.8.2:deploy (default-deploy) @ geronimo-config ---
[INFO] Downloading: https://repository.apache.org/content/repositories/snapshots/org/apache/geronimo/config/geronimo-config/1.2-SNAPSHOT/maven-metadata.xml
[INFO] Downloaded: https://repository.apache.org/content/repositories/snapshots/org/apache/geronimo/config/geronimo-config/1.2-SNAPSHOT/maven-metadata.xml
(614 B at 0.5 KB/sec)
[INFO] Uploading: https://repository.apache.org/content/repositories/snapshots/org/apache/geronimo/config/geronimo-config/1.2-SNAPSHOT/geronimo-config-1.2-20180517.030327-6.pom
[INFO] Uploaded: https://repository.apache.org/content/repositories/snapshots/org/apache/geronimo/config/geronimo-config/1.2-SNAPSHOT/geronimo-config-1.2-20180517.030327-6.pom
(5 KB at 3.8 KB/sec)
[INFO] Downloading: https://repository.apache.org/content/repositories/snapshots/org/apache/geronimo/config/geronimo-config/maven-metadata.xml
[INFO] Downloaded: https://repository.apache.org/content/repositories/snapshots/org/apache/geronimo/config/geronimo-config/maven-metadata.xml
(357 B at 0.5 KB/sec)
[INFO] Uploading: https://repository.apache.org/content/repositories/snapshots/org/apache/geronimo/config/geronimo-config/1.2-SNAPSHOT/maven-metadata.xml
[INFO] Uploaded: https://repository.apache.org/content/repositories/snapshots/org/apache/geronimo/config/geronimo-config/1.2-SNAPSHOT/maven-metadata.xml
(614 B at 0.6 KB/sec)
[INFO] Uploading: https://repository.apache.org/content/repositories/snapshots/org/apache/geronimo/config/geronimo-config/maven-metadata.xml
[INFO] Uploaded: https://repository.apache.org/content/repositories/snapshots/org/apache/geronimo/config/geronimo-config/maven-metadata.xml
(357 B at 0.4 KB/sec)
[INFO]                                                                         
[INFO] ------------------------------------------------------------------------
[INFO] Building Geronimo Microprofile Configuration :: Impl 1.2-SNAPSHOT
[INFO] ------------------------------------------------------------------------
[INFO] Downloading: http://repository.apache.org/snapshots/org/eclipse/microprofile/config/microprofile-config-api/1.3-SNAPSHOT/maven-metadata.xml
[INFO] Downloading: http://repository.apache.org/snapshots/org/eclipse/microprofile/config/microprofile-config-api/1.3-SNAPSHOT/microprofile-config-api-1.3-SNAPSHOT.pom
[WARNING] The POM for org.eclipse.microprofile.config:microprofile-config-api:jar:1.3-SNAPSHOT
is missing, no dependency information available
[INFO] Downloading: http://repository.apache.org/snapshots/org/eclipse/microprofile/config/microprofile-config-tck/1.3-SNAPSHOT/maven-metadata.xml
[INFO] Downloading: http://repository.apache.org/snapshots/org/eclipse/microprofile/config/microprofile-config-tck/1.3-SNAPSHOT/microprofile-config-tck-1.3-SNAPSHOT.pom
[WARNING] The POM for org.eclipse.microprofile.config:microprofile-config-tck:jar:1.3-SNAPSHOT
is missing, no dependency information available
[INFO] Downloading: https://repo.maven.apache.org/maven2/org/testng/testng/6.9.9/testng-6.9.9.pom
[INFO] Downloaded: https://repo.maven.apache.org/maven2/org/testng/testng/6.9.9/testng-6.9.9.pom
(3 KB at 30.2 KB/sec)
[INFO] Downloading: https://repo.maven.apache.org/maven2/com/beust/jcommander/1.48/jcommander-1.48.pom
[INFO] Downloaded: https://repo.maven.apache.org/maven2/com/beust/jcommander/1.48/jcommander-1.48.pom
(10 KB at 477.6 KB/sec)
[INFO] Downloading: https://repo.maven.apache.org/maven2/org/apache/geronimo/specs/geronimo-annotation_1.2_spec/1.0/geronimo-annotation_1.2_spec-1.0.pom
[INFO] Downloaded: https://repo.maven.apache.org/maven2/org/apache/geronimo/specs/geronimo-annotation_1.2_spec/1.0/geronimo-annotation_1.2_spec-1.0.pom
(4 KB at 165.9 KB/sec)
[INFO] Downloading: https://repo.maven.apache.org/maven2/org/jboss/arquillian/testng/arquillian-testng-container/1.1.14.Final/arquillian-testng-container-1.1.14.Final.pom
[INFO] Downloaded: https://repo.maven.apache.org/maven2/org/jboss/arquillian/testng/arquillian-testng-container/1.1.14.Final/arquillian-testng-container-1.1.14.Final.pom
(4 KB at 189.9 KB/sec)
[INFO] Downloading: https://repo.maven.apache.org/maven2/org/jboss/arquillian/arquillian-build/1.1.14.Final/arquillian-build-1.1.14.Final.pom
[INFO] Downloaded: https://repo.maven.apache.org/maven2/org/jboss/arquillian/arquillian-build/1.1.14.Final/arquillian-build-1.1.14.Final.pom
(4 KB at 185.7 KB/sec)
[INFO] Downloading: https://repo.maven.apache.org/maven2/org/jboss/arquillian/arquillian-parent/1.1.14.Final/arquillian-parent-1.1.14.Final.pom
[INFO] Downloaded: https://repo.maven.apache.org/maven2/org/jboss/arquillian/arquillian-parent/1.1.14.Final/arquillian-parent-1.1.14.Final.pom
(5 KB at 279.2 KB/sec)
[INFO] Downloading: https://repo.maven.apache.org/maven2/org/jboss/arquillian/testng/arquillian-testng-core/1.1.14.Final/arquillian-testng-core-1.1.14.Final.pom
[INFO] Downloaded: https://repo.maven.apache.org/maven2/org/jboss/arquillian/testng/arquillian-testng-core/1.1.14.Final/arquillian-testng-core-1.1.14.Final.pom
(3 KB at 121.7 KB/sec)
[INFO] Downloading: https://repo.maven.apache.org/maven2/org/jboss/arquillian/test/arquillian-test-spi/1.1.14.Final/arquillian-test-spi-1.1.14.Final.pom
[INFO] Downloaded: https://repo.maven.apache.org/maven2/org/jboss/arquillian/test/arquillian-test-spi/1.1.14.Final/arquillian-test-spi-1.1.14.Final.pom
(2 KB at 90.2 KB/sec)
[INFO] Downloading: https://repo.maven.apache.org/maven2/org/jboss/arquillian/core/arquillian-core-spi/1.1.14.Final/arquillian-core-spi-1.1.14.Final.pom
[INFO] Downloaded: https://repo.maven.apache.org/maven2/org/jboss/arquillian/core/arquillian-core-spi/1.1.14.Final/arquillian-core-spi-1.1.14.Final.pom
(2 KB at 60.4 KB/sec)
[INFO] Downloading: https://repo.maven.apache.org/maven2/org/jboss/arquillian/core/arquillian-core-api/1.1.14.Final/arquillian-core-api-1.1.14.Final.pom
[INFO] Downloaded: https://repo.maven.apache.org/maven2/org/jboss/arquillian/core/arquillian-core-api/1.1.14.Final/arquillian-core-api-1.1.14.Final.pom
(2 KB at 57.2 KB/sec)
[INFO] Downloading: https://repo.maven.apache.org/maven2/org/jboss/arquillian/test/arquillian-test-api/1.1.14.Final/arquillian-test-api-1.1.14.Final.pom
[INFO] Downloaded: https://repo.maven.apache.org/maven2/org/jboss/arquillian/test/arquillian-test-api/1.1.14.Final/arquillian-test-api-1.1.14.Final.pom
(2 KB at 67.7 KB/sec)
[INFO] Downloading: https://repo.maven.apache.org/maven2/org/jboss/arquillian/container/arquillian-container-test-api/1.1.14.Final/arquillian-container-test-api-1.1.14.Final.pom
[INFO] Downloaded: https://repo.maven.apache.org/maven2/org/jboss/arquillian/container/arquillian-container-test-api/1.1.14.Final/arquillian-container-test-api-1.1.14.Final.pom
(2 KB at 64.5 KB/sec)
[INFO] Downloading: https://repo.maven.apache.org/maven2/org/jboss/arquillian/container/arquillian-container-test-spi/1.1.14.Final/arquillian-container-test-spi-1.1.14.Final.pom
[INFO] Downloaded: https://repo.maven.apache.org/maven2/org/jboss/arquillian/container/arquillian-container-test-spi/1.1.14.Final/arquillian-container-test-spi-1.1.14.Final.pom
(2 KB at 66.3 KB/sec)
[INFO] Downloading: https://repo.maven.apache.org/maven2/org/jboss/arquillian/container/arquillian-container-spi/1.1.14.Final/arquillian-container-spi-1.1.14.Final.pom
[INFO] Downloaded: https://repo.maven.apache.org/maven2/org/jboss/arquillian/container/arquillian-container-spi/1.1.14.Final/arquillian-container-spi-1.1.14.Final.pom
(3 KB at 136.4 KB/sec)
[INFO] Downloading: https://repo.maven.apache.org/maven2/org/jboss/arquillian/config/arquillian-config-api/1.1.14.Final/arquillian-config-api-1.1.14.Final.pom
[INFO] Downloaded: https://repo.maven.apache.org/maven2/org/jboss/arquillian/config/arquillian-config-api/1.1.14.Final/arquillian-config-api-1.1.14.Final.pom
(2 KB at 74.9 KB/sec)
[INFO] Downloading: https://repo.maven.apache.org/maven2/org/jboss/arquillian/config/arquillian-config-impl-base/1.1.14.Final/arquillian-config-impl-base-1.1.14.Final.pom
[INFO] Downloaded: https://repo.maven.apache.org/maven2/org/jboss/arquillian/config/arquillian-config-impl-base/1.1.14.Final/arquillian-config-impl-base-1.1.14.Final.pom
(3 KB at 140.0 KB/sec)
[INFO] Downloading: https://repo.maven.apache.org/maven2/org/jboss/arquillian/core/arquillian-core-impl-base/1.1.14.Final/arquillian-core-impl-base-1.1.14.Final.pom
[INFO] Downloaded: https://repo.maven.apache.org/maven2/org/jboss/arquillian/core/arquillian-core-impl-base/1.1.14.Final/arquillian-core-impl-base-1.1.14.Final.pom
(2 KB at 104.5 KB/sec)
[INFO] Downloading: https://repo.maven.apache.org/maven2/org/jboss/arquillian/test/arquillian-test-impl-base/1.1.14.Final/arquillian-test-impl-base-1.1.14.Final.pom
[INFO] Downloaded: https://repo.maven.apache.org/maven2/org/jboss/arquillian/test/arquillian-test-impl-base/1.1.14.Final/arquillian-test-impl-base-1.1.14.Final.pom
(3 KB at 119.0 KB/sec)
[INFO] Downloading: https://repo.maven.apache.org/maven2/org/jboss/arquillian/container/arquillian-container-impl-base/1.1.14.Final/arquillian-container-impl-base-1.1.14.Final.pom
[INFO] Downloaded: https://repo.maven.apache.org/maven2/org/jboss/arquillian/container/arquillian-container-impl-base/1.1.14.Final/arquillian-container-impl-base-1.1.14.Final.pom
(4 KB at 201.3 KB/sec)
[INFO] Downloading: https://repo.maven.apache.org/maven2/org/jboss/arquillian/container/arquillian-container-test-impl-base/1.1.14.Final/arquillian-container-test-impl-base-1.1.14.Final.pom
[INFO] Downloaded: https://repo.maven.apache.org/maven2/org/jboss/arquillian/container/arquillian-container-test-impl-base/1.1.14.Final/arquillian-container-test-impl-base-1.1.14.Final.pom
(4 KB at 196.9 KB/sec)
[INFO] Downloading: https://repo.maven.apache.org/maven2/org/apache/geronimo/specs/geronimo-jcdi_1.1_spec/1.0/geronimo-jcdi_1.1_spec-1.0.pom
[INFO] Downloaded: https://repo.maven.apache.org/maven2/org/apache/geronimo/specs/geronimo-jcdi_1.1_spec/1.0/geronimo-jcdi_1.1_spec-1.0.pom
(5 KB at 245.3 KB/sec)
[INFO] Downloading: https://repo.maven.apache.org/maven2/org/apache/geronimo/specs/geronimo-interceptor_1.2_spec/1.0/geronimo-interceptor_1.2_spec-1.0.pom
[INFO] Downloaded: https://repo.maven.apache.org/maven2/org/apache/geronimo/specs/geronimo-interceptor_1.2_spec/1.0/geronimo-interceptor_1.2_spec-1.0.pom
(3 KB at 166.1 KB/sec)
[INFO] Downloading: https://repo.maven.apache.org/maven2/org/apache/geronimo/specs/geronimo-el_2.2_spec/1.0.2/geronimo-el_2.2_spec-1.0.2.pom
[INFO] Downloaded: https://repo.maven.apache.org/maven2/org/apache/geronimo/specs/geronimo-el_2.2_spec/1.0.2/geronimo-el_2.2_spec-1.0.2.pom
(4 KB at 40.5 KB/sec)
[INFO] Downloading: https://repo.maven.apache.org/maven2/org/apache/openwebbeans/openwebbeans-spi/1.7.4/openwebbeans-spi-1.7.4.pom
[INFO] Downloaded: https://repo.maven.apache.org/maven2/org/apache/openwebbeans/openwebbeans-spi/1.7.4/openwebbeans-spi-1.7.4.pom
(3 KB at 175.6 KB/sec)
[INFO] Downloading: https://repo.maven.apache.org/maven2/org/apache/openwebbeans/openwebbeans/1.7.4/openwebbeans-1.7.4.pom
[INFO] Downloaded: https://repo.maven.apache.org/maven2/org/apache/openwebbeans/openwebbeans/1.7.4/openwebbeans-1.7.4.pom
(31 KB at 1474.6 KB/sec)
[INFO] Downloading: https://repo.maven.apache.org/maven2/org/apache/openwebbeans/openwebbeans-impl/1.7.4/openwebbeans-impl-1.7.4.pom
[INFO] Downloaded: https://repo.maven.apache.org/maven2/org/apache/openwebbeans/openwebbeans-impl/1.7.4/openwebbeans-impl-1.7.4.pom
(7 KB at 282.9 KB/sec)
[INFO] Downloading: https://repo.maven.apache.org/maven2/org/apache/xbean/xbean-finder-shaded/4.5/xbean-finder-shaded-4.5.pom
[INFO] Downloaded: https://repo.maven.apache.org/maven2/org/apache/xbean/xbean-finder-shaded/4.5/xbean-finder-shaded-4.5.pom
(5 KB at 271.0 KB/sec)
[INFO] Downloading: https://repo.maven.apache.org/maven2/org/apache/xbean/xbean-asm5-shaded/4.5/xbean-asm5-shaded-4.5.pom
[INFO] Downloaded: https://repo.maven.apache.org/maven2/org/apache/xbean/xbean-asm5-shaded/4.5/xbean-asm5-shaded-4.5.pom
(4 KB at 181.7 KB/sec)
[INFO] Downloading: https://repo.maven.apache.org/maven2/org/apache/openwebbeans/arquillian/owb-arquillian-standalone/1.7.4/owb-arquillian-standalone-1.7.4.pom
[INFO] Downloaded: https://repo.maven.apache.org/maven2/org/apache/openwebbeans/arquillian/owb-arquillian-standalone/1.7.4/owb-arquillian-standalone-1.7.4.pom
(4 KB at 17.9 KB/sec)
[INFO] Downloading: https://repo.maven.apache.org/maven2/org/apache/openwebbeans/arquillian/owb-arquillian-parent/1.7.4/owb-arquillian-parent-1.7.4.pom
[INFO] Downloaded: https://repo.maven.apache.org/maven2/org/apache/openwebbeans/arquillian/owb-arquillian-parent/1.7.4/owb-arquillian-parent-1.7.4.pom
(3 KB at 12.8 KB/sec)
[INFO] Downloading: https://repo.maven.apache.org/maven2/org/jboss/arquillian/testenricher/arquillian-testenricher-cdi/1.1.14.Final/arquillian-testenricher-cdi-1.1.14.Final.pom
[INFO] Downloaded: https://repo.maven.apache.org/maven2/org/jboss/arquillian/testenricher/arquillian-testenricher-cdi/1.1.14.Final/arquillian-testenricher-cdi-1.1.14.Final.pom
(4 KB at 39.5 KB/sec)
[INFO] Downloading: http://repository.apache.org/snapshots/org/eclipse/microprofile/config/microprofile-config-api/1.3-SNAPSHOT/microprofile-config-api-1.3-SNAPSHOT.jar
[INFO] Downloading: http://repository.apache.org/snapshots/org/eclipse/microprofile/config/microprofile-config-tck/1.3-SNAPSHOT/microprofile-config-tck-1.3-SNAPSHOT.jar
[INFO] Downloading: https://repo.maven.apache.org/maven2/org/testng/testng/6.9.9/testng-6.9.9.jar
[INFO] Downloading: https://repo.maven.apache.org/maven2/com/beust/jcommander/1.48/jcommander-1.48.jar
[INFO] Downloading: https://repo.maven.apache.org/maven2/org/apache/geronimo/specs/geronimo-annotation_1.2_spec/1.0/geronimo-annotation_1.2_spec-1.0.jar
[INFO] Downloading: https://repo.maven.apache.org/maven2/org/jboss/arquillian/testng/arquillian-testng-container/1.1.14.Final/arquillian-testng-container-1.1.14.Final.jar
[INFO] Downloading: https://repo.maven.apache.org/maven2/org/jboss/arquillian/testng/arquillian-testng-core/1.1.14.Final/arquillian-testng-core-1.1.14.Final.jar
[INFO] Downloaded: https://repo.maven.apache.org/maven2/org/jboss/arquillian/testng/arquillian-testng-container/1.1.14.Final/arquillian-testng-container-1.1.14.Final.jar
(9 KB at 278.1 KB/sec)
[INFO] Downloading: https://repo.maven.apache.org/maven2/org/jboss/arquillian/test/arquillian-test-api/1.1.14.Final/arquillian-test-api-1.1.14.Final.jar
[INFO] Downloaded: https://repo.maven.apache.org/maven2/org/jboss/arquillian/testng/arquillian-testng-core/1.1.14.Final/arquillian-testng-core-1.1.14.Final.jar
(14 KB at 391.7 KB/sec)
[INFO] Downloading: https://repo.maven.apache.org/maven2/org/jboss/arquillian/core/arquillian-core-api/1.1.14.Final/arquillian-core-api-1.1.14.Final.jar
[INFO] Downloaded: https://repo.maven.apache.org/maven2/org/apache/geronimo/specs/geronimo-annotation_1.2_spec/1.0/geronimo-annotation_1.2_spec-1.0.jar
(16 KB at 401.9 KB/sec)
[INFO] Downloading: https://repo.maven.apache.org/maven2/org/jboss/arquillian/test/arquillian-test-spi/1.1.14.Final/arquillian-test-spi-1.1.14.Final.jar
[INFO] Downloaded: https://repo.maven.apache.org/maven2/com/beust/jcommander/1.48/jcommander-1.48.jar
(63 KB at 1476.6 KB/sec)
[INFO] Downloading: https://repo.maven.apache.org/maven2/org/jboss/arquillian/core/arquillian-core-spi/1.1.14.Final/arquillian-core-spi-1.1.14.Final.jar
[INFO] Downloaded: https://repo.maven.apache.org/maven2/org/jboss/arquillian/core/arquillian-core-api/1.1.14.Final/arquillian-core-api-1.1.14.Final.jar
(10 KB at 194.1 KB/sec)
[INFO] Downloading: https://repo.maven.apache.org/maven2/org/jboss/arquillian/container/arquillian-container-test-api/1.1.14.Final/arquillian-container-test-api-1.1.14.Final.jar
[INFO] Downloaded: https://repo.maven.apache.org/maven2/org/jboss/arquillian/test/arquillian-test-api/1.1.14.Final/arquillian-test-api-1.1.14.Final.jar
(4 KB at 67.8 KB/sec)
[INFO] Downloading: https://repo.maven.apache.org/maven2/org/jboss/arquillian/container/arquillian-container-test-spi/1.1.14.Final/arquillian-container-test-spi-1.1.14.Final.jar
[INFO] Downloaded: https://repo.maven.apache.org/maven2/org/jboss/arquillian/test/arquillian-test-spi/1.1.14.Final/arquillian-test-spi-1.1.14.Final.jar
(45 KB at 777.8 KB/sec)
[INFO] Downloading: https://repo.maven.apache.org/maven2/org/jboss/arquillian/core/arquillian-core-impl-base/1.1.14.Final/arquillian-core-impl-base-1.1.14.Final.jar
[INFO] Downloaded: https://repo.maven.apache.org/maven2/org/jboss/arquillian/core/arquillian-core-spi/1.1.14.Final/arquillian-core-spi-1.1.14.Final.jar
(28 KB at 465.5 KB/sec)
[INFO] Downloading: https://repo.maven.apache.org/maven2/org/jboss/arquillian/test/arquillian-test-impl-base/1.1.14.Final/arquillian-test-impl-base-1.1.14.Final.jar
[INFO] Downloaded: https://repo.maven.apache.org/maven2/org/jboss/arquillian/container/arquillian-container-test-api/1.1.14.Final/arquillian-container-test-api-1.1.14.Final.jar
(9 KB at 132.3 KB/sec)
[INFO] Downloading: https://repo.maven.apache.org/maven2/org/jboss/arquillian/container/arquillian-container-impl-base/1.1.14.Final/arquillian-container-impl-base-1.1.14.Final.jar
[INFO] Downloaded: https://repo.maven.apache.org/maven2/org/jboss/arquillian/container/arquillian-container-test-spi/1.1.14.Final/arquillian-container-test-spi-1.1.14.Final.jar
(26 KB at 376.5 KB/sec)
[INFO] Downloading: https://repo.maven.apache.org/maven2/org/jboss/arquillian/config/arquillian-config-api/1.1.14.Final/arquillian-config-api-1.1.14.Final.jar
[INFO] Downloaded: https://repo.maven.apache.org/maven2/org/jboss/arquillian/core/arquillian-core-impl-base/1.1.14.Final/arquillian-core-impl-base-1.1.14.Final.jar
(65 KB at 844.7 KB/sec)
[INFO] Downloading: https://repo.maven.apache.org/maven2/org/jboss/arquillian/config/arquillian-config-impl-base/1.1.14.Final/arquillian-config-impl-base-1.1.14.Final.jar
[INFO] Downloaded: https://repo.maven.apache.org/maven2/org/jboss/arquillian/test/arquillian-test-impl-base/1.1.14.Final/arquillian-test-impl-base-1.1.14.Final.jar
(29 KB at 364.5 KB/sec)
[INFO] Downloading: https://repo.maven.apache.org/maven2/org/jboss/arquillian/container/arquillian-container-test-impl-base/1.1.14.Final/arquillian-container-test-impl-base-1.1.14.Final.jar
[INFO] Downloaded: https://repo.maven.apache.org/maven2/org/jboss/arquillian/config/arquillian-config-api/1.1.14.Final/arquillian-config-api-1.1.14.Final.jar
(8 KB at 88.0 KB/sec)
[INFO] Downloading: https://repo.maven.apache.org/maven2/org/apache/geronimo/specs/geronimo-jcdi_1.1_spec/1.0/geronimo-jcdi_1.1_spec-1.0.jar
[INFO] Downloaded: https://repo.maven.apache.org/maven2/org/jboss/arquillian/container/arquillian-container-impl-base/1.1.14.Final/arquillian-container-impl-base-1.1.14.Final.jar
(80 KB at 919.4 KB/sec)
[INFO] Downloading: https://repo.maven.apache.org/maven2/org/apache/geronimo/specs/geronimo-interceptor_1.2_spec/1.0/geronimo-interceptor_1.2_spec-1.0.jar
[INFO] Downloaded: https://repo.maven.apache.org/maven2/org/jboss/arquillian/config/arquillian-config-impl-base/1.1.14.Final/arquillian-config-impl-base-1.1.14.Final.jar
(43 KB at 452.1 KB/sec)
[INFO] Downloading: https://repo.maven.apache.org/maven2/org/apache/geronimo/specs/geronimo-el_2.2_spec/1.0.2/geronimo-el_2.2_spec-1.0.2.jar
[INFO] Downloaded: https://repo.maven.apache.org/maven2/org/jboss/arquillian/container/arquillian-container-test-impl-base/1.1.14.Final/arquillian-container-test-impl-base-1.1.14.Final.jar
(110 KB at 1070.9 KB/sec)
[INFO] Downloading: https://repo.maven.apache.org/maven2/org/apache/openwebbeans/openwebbeans-spi/1.7.4/openwebbeans-spi-1.7.4.jar
[INFO] Downloaded: https://repo.maven.apache.org/maven2/org/apache/geronimo/specs/geronimo-interceptor_1.2_spec/1.0/geronimo-interceptor_1.2_spec-1.0.jar
(13 KB at 111.7 KB/sec)
[INFO] Downloading: https://repo.maven.apache.org/maven2/org/apache/openwebbeans/openwebbeans-impl/1.7.4/openwebbeans-impl-1.7.4.jar
[INFO] Downloaded: https://repo.maven.apache.org/maven2/org/apache/geronimo/specs/geronimo-jcdi_1.1_spec/1.0/geronimo-jcdi_1.1_spec-1.0.jar
(66 KB at 604.7 KB/sec)
[INFO] Downloading: https://repo.maven.apache.org/maven2/org/apache/xbean/xbean-finder-shaded/4.5/xbean-finder-shaded-4.5.jar
[INFO] Downloaded: https://repo.maven.apache.org/maven2/org/testng/testng/6.9.9/testng-6.9.9.jar
(850 KB at 7200.9 KB/sec)
[INFO] Downloading: https://repo.maven.apache.org/maven2/org/apache/xbean/xbean-asm5-shaded/4.5/xbean-asm5-shaded-4.5.jar
[INFO] Downloaded: https://repo.maven.apache.org/maven2/org/apache/openwebbeans/openwebbeans-spi/1.7.4/openwebbeans-spi-1.7.4.jar
(22 KB at 179.0 KB/sec)
[INFO] Downloading: https://repo.maven.apache.org/maven2/org/apache/openwebbeans/arquillian/owb-arquillian-standalone/1.7.4/owb-arquillian-standalone-1.7.4.jar
[INFO] Downloaded: https://repo.maven.apache.org/maven2/org/apache/xbean/xbean-finder-shaded/4.5/xbean-finder-shaded-4.5.jar
(154 KB at 1131.9 KB/sec)
[INFO] Downloading: https://repo.maven.apache.org/maven2/org/jboss/arquillian/container/arquillian-container-spi/1.1.14.Final/arquillian-container-spi-1.1.14.Final.jar
[INFO] Downloaded: https://repo.maven.apache.org/maven2/org/apache/xbean/xbean-asm5-shaded/4.5/xbean-asm5-shaded-4.5.jar
(142 KB at 1023.7 KB/sec)
[INFO] Downloading: https://repo.maven.apache.org/maven2/org/jboss/arquillian/testenricher/arquillian-testenricher-cdi/1.1.14.Final/arquillian-testenricher-cdi-1.1.14.Final.jar
[INFO] Downloaded: https://repo.maven.apache.org/maven2/org/jboss/arquillian/container/arquillian-container-spi/1.1.14.Final/arquillian-container-spi-1.1.14.Final.jar
(52 KB at 332.7 KB/sec)
[INFO] Downloaded: https://repo.maven.apache.org/maven2/org/apache/openwebbeans/openwebbeans-impl/1.7.4/openwebbeans-impl-1.7.4.jar
(665 KB at 4151.3 KB/sec)
[INFO] Downloaded: https://repo.maven.apache.org/maven2/org/apache/geronimo/specs/geronimo-el_2.2_spec/1.0.2/geronimo-el_2.2_spec-1.0.2.jar
(47 KB at 236.0 KB/sec)
[INFO] Downloaded: https://repo.maven.apache.org/maven2/org/jboss/arquillian/testenricher/arquillian-testenricher-cdi/1.1.14.Final/arquillian-testenricher-cdi-1.1.14.Final.jar
(28 KB at 118.9 KB/sec)
[INFO] Downloaded: https://repo.maven.apache.org/maven2/org/apache/openwebbeans/arquillian/owb-arquillian-standalone/1.7.4/owb-arquillian-standalone-1.7.4.jar
(31 KB at 69.5 KB/sec)
[INFO] ------------------------------------------------------------------------
[INFO] Reactor Summary:
[INFO] 
[INFO] Geronimo Microprofile Configuration ................ SUCCESS [ 13.789 s]
[INFO] Geronimo Microprofile Configuration :: Impl ........ FAILURE [  3.800 s]
[INFO] ------------------------------------------------------------------------
[INFO] BUILD FAILURE
[INFO] ------------------------------------------------------------------------
[INFO] Total time: 28.172 s
[INFO] Finished at: 2018-05-17T03:03:45+00:00
[INFO] Final Memory: 32M/367M
[INFO] ------------------------------------------------------------------------
[WARNING] The requested profile "eclipse-repo" could not be activated because it does not
exist.
Waiting for Jenkins to finish collecting data
[ERROR] Failed to execute goal on project geronimo-config-impl: Could not resolve dependencies
for project org.apache.geronimo.config:geronimo-config-impl:jar:1.2-SNAPSHOT: The following
artifacts could not be resolved: org.eclipse.microprofile.config:microprofile-config-api:jar:1.3-SNAPSHOT,
org.eclipse.microprofile.config:microprofile-config-tck:jar:1.3-SNAPSHOT: Could not find artifact
org.eclipse.microprofile.config:microprofile-config-api:jar:1.3-SNAPSHOT in Nexus (http://repository.apache.org/snapshots)
-> [Help 1]
[ERROR] 
[ERROR] To see the full stack trace of the errors, re-run Maven with the -e switch.
[ERROR] Re-run Maven using the -X switch to enable full debug logging.
[ERROR] 
[ERROR] For more information about the errors and possible solutions, please read the following
articles:
[ERROR] [Help 1] http://cwiki.apache.org/confluence/display/MAVEN/DependencyResolutionException
[ERROR] 
[ERROR] After correcting the problems, you can resume the build with the command
[ERROR]   mvn <goals> -rf :geronimo-config-impl
[JENKINS] Archiving <https://builds.apache.org/job/GeronimoConfig/ws/impl/pom.xml> to
org.apache.geronimo.config/geronimo-config-impl/1.2-SNAPSHOT/geronimo-config-impl-1.2-SNAPSHOT.pom
[JENKINS] Archiving <https://builds.apache.org/job/GeronimoConfig/ws/pom.xml> to org.apache.geronimo.config/geronimo-config/1.2-SNAPSHOT/geronimo-config-1.2-SNAPSHOT.pom
Sending e-mails to: scm@geronimo.apache.org
channel stopped

Mime
View raw message