geronimo-scm mailing list archives

Site index · List index
Message view « Date » · « Thread »
Top « Date » · « Thread »
From pra...@apache.org
Subject [BUILD] 2.0: Successful
Date Tue, 09 Oct 2007 11:52:48 GMT
Geronimo Revision: 583089 built with tests included
 
See the full build-0600.log file at http://people.apache.org/~prasad/binaries/2.0/20071009/build-0600.log
 
Download the binaries from http://people.apache.org/~prasad/binaries/2.0/20071009
[INFO] BUILD SUCCESSFUL
[INFO] ------------------------------------------------------------------------
[INFO] Total time: 24 minutes 45 seconds
[INFO] Finished at: Tue Oct 09 06:33:38 EDT 2007
[INFO] Final Memory: 202M/1003M
[INFO] ------------------------------------------------------------------------
 
TESTSUITE RESULTS (Failures only)
=================================
See detailed results at http://people.apache.org/~prasad/testsuite/ResultsSummary.html
See the full test-0600.log file at http://people.apache.org/~prasad/binaries/2.0/20071009/test-0600.log
 
[INFO] Running console-testsuite.basic-console
[INFO] Tests run: 38, Failures: 38, Errors: 0, Skipped: 0, Time elapsed: 1,142.353 sec <<<
FAILURE!
[INFO] Running console-testsuite.advance-test
[INFO] Tests run: 12, Failures: 12, Errors: 0, Skipped: 0, Time elapsed: 361.613 sec <<<
FAILURE!
[INFO] Running org.apache.geronimo.testsuite.corba.helloworld.ClientCORBATest
[INFO] Running corba-testsuite.corba-mytime
[INFO] Tests run: 1, Failures: 1, Errors: 0, Skipped: 0, Time elapsed: 30.081 sec <<<
FAILURE!
[INFO] Running deployment-testsuite.deployment
[INFO] Tests run: 2, Failures: 1, Errors: 0, Skipped: 0, Time elapsed: 30.154 sec <<<
FAILURE!
[INFO] Running deployment-testsuite.jca-cms
[INFO] Tests run: 2, Failures: 2, Errors: 0, Skipped: 0, Time elapsed: 60.218 sec <<<
FAILURE!
[INFO] Running enterprise-testsuite.jms
[INFO] Tests run: 1, Failures: 1, Errors: 0, Skipped: 0, Time elapsed: 30.146 sec <<<
FAILURE!
[INFO] Running jpa-testsuite.jpa
[INFO] Tests run: 1, Failures: 1, Errors: 0, Skipped: 0, Time elapsed: 30.11 sec <<<
FAILURE!
[INFO] Running sec-testsuite.security
[INFO] Tests run: 2, Failures: 2, Errors: 0, Skipped: 0, Time elapsed: 60.195 sec <<<
FAILURE!
[INFO] Running web-testsuite.jsps
[INFO] Tests run: 4, Failures: 4, Errors: 0, Skipped: 0, Time elapsed: 120.217 sec <<<
FAILURE!
[INFO] Running web-testsuite.myfaces
[INFO] Tests run: 1, Failures: 1, Errors: 0, Skipped: 0, Time elapsed: 30.119 sec <<<
FAILURE!
[INFO] Running web-testsuite.security
[INFO] Tests run: 1, Failures: 1, Errors: 0, Skipped: 0, Time elapsed: 30.131 sec <<<
FAILURE!
[INFO] Running web-testsuite.references
[INFO] Tests run: 1, Failures: 1, Errors: 0, Skipped: 0, Time elapsed: 30.116 sec <<<
FAILURE!
[INFO] Running web-testsuite.servlets
[INFO] Tests run: 2, Failures: 2, Errors: 0, Skipped: 0, Time elapsed: 60.207 sec <<<
FAILURE!
[INFO] Running web-testsuite.jetty
[INFO] Tests run: 2, Failures: 2, Errors: 0, Skipped: 0, Time elapsed: 60.082 sec <<<
FAILURE!
[INFO] Running org.apache.geronimo.testsuite.testset.JaxWSTest
[INFO] Tests run: 5, Failures: 5, Errors: 0, Skipped: 0, Time elapsed: 150.199 sec <<<
FAILURE!
[INFO] Running org.apache.geronimo.testsuite.testset.ClientJAXWSTest
[INFO] Tests run: 1, Failures: 1, Errors: 0, Skipped: 0, Time elapsed: 0.332 sec <<<
FAILURE!
[INFO] Running org.apache.geronimo.testsuite.testset.JaxWSTest
[INFO] Tests run: 3, Failures: 2, Errors: 0, Skipped: 0, Time elapsed: 60.645 sec <<<
FAILURE!
[INFO] Running org.apache.geronimo.testsuite.testset.WebJAXRTest
[INFO] Tests run: 2, Failures: 2, Errors: 0, Skipped: 0, Time elapsed: 60.206 sec <<<
FAILURE!
[INFO] Running org.apache.geronimo.testsuite.testset.EJBJAXRTest
[INFO] Running org.apache.geronimo.testsuite.testset.ClientJAXRTest
[INFO] Running org.apache.geronimo.testsuite.testset.WebStaxTest
[INFO] Tests run: 2, Failures: 2, Errors: 0, Skipped: 0, Time elapsed: 60.188 sec <<<
FAILURE!
[INFO] Running org.apache.geronimo.testsuite.testset.EJBStaxTest
[INFO] Running org.apache.geronimo.testsuite.testset.ClientStaxTest
[INFO] Running org.apache.geronimo.testsuite.testset.WSTest
[INFO] Tests run: 4, Failures: 4, Errors: 0, Skipped: 0, Time elapsed: 120.419 sec <<<
FAILURE!
[INFO] Running org.apache.geronimo.testsuite.testset.WebJAXBTest
[INFO] Tests run: 2, Failures: 2, Errors: 0, Skipped: 0, Time elapsed: 60.239 sec <<<
FAILURE!
[INFO] Running org.apache.geronimo.testsuite.testset.EJBJAXBTest
[INFO] Running org.apache.geronimo.testsuite.testset.ClientJAXBTest
[INFO] Running org.apache.geronimo.testsuite.testset.WebSAAJTest
[INFO] Tests run: 2, Failures: 2, Errors: 0, Skipped: 0, Time elapsed: 60.326 sec <<<
FAILURE!
[INFO] Running org.apache.geronimo.testsuite.testset.ClientSAAJTest
[INFO] Running org.apache.geronimo.testsuite.testset.JaxRPCTest
[INFO] Tests run: 2, Failures: 2, Errors: 0, Skipped: 0, Time elapsed: 60.301 sec <<<
FAILURE!
[INFO] Running org.apache.geronimo.testsuite.testset.JaxRPCTest
[INFO] Tests run: 3, Failures: 2, Errors: 0, Skipped: 0, Time elapsed: 60.573 sec <<<
FAILURE!
 

Mime
View raw message