geronimo-scm mailing list archives

Site index · List index
Message view « Date » · « Thread »
Top « Date » · « Thread »
From pra...@apache.org
Subject [BUILD] 2.0: Successful
Date Tue, 09 Oct 2007 05:47:00 GMT
Geronimo Revision: 583038 built with tests included
 
See the full build-0000.log file at http://people.apache.org/~prasad/binaries/2.0/20071009/build-0000.log
 
Download the binaries from http://people.apache.org/~prasad/binaries/2.0/20071009
[INFO] BUILD SUCCESSFUL
[INFO] ------------------------------------------------------------------------
[INFO] Total time: 23 minutes 22 seconds
[INFO] Finished at: Tue Oct 09 00:29:05 EDT 2007
[INFO] Final Memory: 202M/997M
[INFO] ------------------------------------------------------------------------
 
TESTSUITE RESULTS (Failures only)
=================================
See detailed results at http://people.apache.org/~prasad/testsuite/ResultsSummary.html
See the full test-0000.log file at http://people.apache.org/~prasad/binaries/2.0/20071009/test-0000.log
 
[INFO] Running console-testsuite.basic-console
[INFO] Tests run: 38, Failures: 38, Errors: 0, Skipped: 0, Time elapsed: 1,142.01 sec <<<
FAILURE!
[INFO] Running console-testsuite.advance-test
[INFO] Tests run: 12, Failures: 12, Errors: 0, Skipped: 0, Time elapsed: 361.721 sec <<<
FAILURE!
[INFO] Running org.apache.geronimo.testsuite.corba.helloworld.ClientCORBATest
[INFO] Running corba-testsuite.corba-mytime
[INFO] Tests run: 1, Failures: 1, Errors: 0, Skipped: 0, Time elapsed: 30.136 sec <<<
FAILURE!
[INFO] Running deployment-testsuite.deployment
[INFO] Tests run: 2, Failures: 1, Errors: 0, Skipped: 0, Time elapsed: 30.173 sec <<<
FAILURE!
[INFO] Running deployment-testsuite.jca-cms
[INFO] Tests run: 2, Failures: 2, Errors: 0, Skipped: 0, Time elapsed: 60.217 sec <<<
FAILURE!
[INFO] Running enterprise-testsuite.jms
[INFO] Tests run: 1, Failures: 1, Errors: 0, Skipped: 0, Time elapsed: 30.134 sec <<<
FAILURE!
[INFO] Running jpa-testsuite.jpa
[INFO] Tests run: 1, Failures: 1, Errors: 0, Skipped: 0, Time elapsed: 30.112 sec <<<
FAILURE!
[INFO] Running sec-testsuite.security
[INFO] Tests run: 2, Failures: 2, Errors: 0, Skipped: 0, Time elapsed: 60.195 sec <<<
FAILURE!
[INFO] Running web-testsuite.jsps
[INFO] Tests run: 4, Failures: 4, Errors: 0, Skipped: 0, Time elapsed: 120.248 sec <<<
FAILURE!
[INFO] Running web-testsuite.myfaces
[INFO] Tests run: 1, Failures: 1, Errors: 0, Skipped: 0, Time elapsed: 30.124 sec <<<
FAILURE!
[INFO] Running web-testsuite.security
[INFO] Tests run: 1, Failures: 1, Errors: 0, Skipped: 0, Time elapsed: 30.146 sec <<<
FAILURE!
[INFO] Running web-testsuite.references
[INFO] Tests run: 1, Failures: 1, Errors: 0, Skipped: 0, Time elapsed: 30.146 sec <<<
FAILURE!
[INFO] Running web-testsuite.servlets
[INFO] Tests run: 2, Failures: 2, Errors: 0, Skipped: 0, Time elapsed: 60.173 sec <<<
FAILURE!
[INFO] Running web-testsuite.jetty
[INFO] Tests run: 2, Failures: 2, Errors: 0, Skipped: 0, Time elapsed: 60.094 sec <<<
FAILURE!
[INFO] Running org.apache.geronimo.testsuite.testset.JaxWSTest
[INFO] Tests run: 5, Failures: 5, Errors: 0, Skipped: 0, Time elapsed: 150.195 sec <<<
FAILURE!
[INFO] Running org.apache.geronimo.testsuite.testset.ClientJAXWSTest
[INFO] Tests run: 1, Failures: 1, Errors: 0, Skipped: 0, Time elapsed: 0.247 sec <<<
FAILURE!
[INFO] Running org.apache.geronimo.testsuite.testset.JaxWSTest
[INFO] Tests run: 3, Failures: 2, Errors: 0, Skipped: 0, Time elapsed: 60.795 sec <<<
FAILURE!
[INFO] Running org.apache.geronimo.testsuite.testset.WebJAXRTest
[INFO] Tests run: 2, Failures: 2, Errors: 0, Skipped: 0, Time elapsed: 60.184 sec <<<
FAILURE!
[INFO] Running org.apache.geronimo.testsuite.testset.EJBJAXRTest
[INFO] Running org.apache.geronimo.testsuite.testset.ClientJAXRTest
[INFO] Running org.apache.geronimo.testsuite.testset.WebStaxTest
[INFO] Tests run: 2, Failures: 2, Errors: 0, Skipped: 0, Time elapsed: 60.186 sec <<<
FAILURE!
[INFO] Running org.apache.geronimo.testsuite.testset.EJBStaxTest
[INFO] Running org.apache.geronimo.testsuite.testset.ClientStaxTest
[INFO] Running org.apache.geronimo.testsuite.testset.WSTest
[INFO] Tests run: 4, Failures: 4, Errors: 0, Skipped: 0, Time elapsed: 120.281 sec <<<
FAILURE!
[INFO] Running org.apache.geronimo.testsuite.testset.WebJAXBTest
[INFO] Tests run: 2, Failures: 2, Errors: 0, Skipped: 0, Time elapsed: 60.288 sec <<<
FAILURE!
[INFO] Running org.apache.geronimo.testsuite.testset.EJBJAXBTest
[INFO] Running org.apache.geronimo.testsuite.testset.ClientJAXBTest
[INFO] Running org.apache.geronimo.testsuite.testset.WebSAAJTest
[INFO] Tests run: 2, Failures: 2, Errors: 0, Skipped: 0, Time elapsed: 60.414 sec <<<
FAILURE!
[INFO] Running org.apache.geronimo.testsuite.testset.ClientSAAJTest
[INFO] Running org.apache.geronimo.testsuite.testset.JaxRPCTest
[INFO] Tests run: 2, Failures: 2, Errors: 0, Skipped: 0, Time elapsed: 60.284 sec <<<
FAILURE!
[INFO] Running org.apache.geronimo.testsuite.testset.JaxRPCTest
[INFO] Tests run: 3, Failures: 2, Errors: 0, Skipped: 0, Time elapsed: 60.625 sec <<<
FAILURE!
 

Mime
View raw message