geronimo-scm mailing list archives

Site index · List index
Message view « Date » · « Thread »
Top « Date » · « Thread »
From pra...@apache.org
Subject [BUILD] 2.0: Successful
Date Tue, 09 Oct 2007 02:18:50 GMT
Geronimo Revision: 582985 built with tests included
 
See the full build-1800.log file at http://people.apache.org/~prasad/binaries/2.0/20071008/build-1800.log
 
Download the binaries from http://people.apache.org/~prasad/binaries/2.0/20071008
[INFO] BUILD SUCCESSFUL
[INFO] ------------------------------------------------------------------------
[INFO] Total time: 29 minutes 18 seconds
[INFO] Finished at: Mon Oct 08 18:37:50 EDT 2007
[INFO] Final Memory: 202M/995M
[INFO] ------------------------------------------------------------------------
 
TESTSUITE RESULTS (Failures only)
=================================
See detailed results at http://people.apache.org/~prasad/testsuite/ResultsSummary.html
See the full test-1800.log file at http://people.apache.org/~prasad/binaries/2.0/20071008/test-1800.log
 
[INFO] Running console-testsuite.basic-console
[INFO] Tests run: 38, Failures: 38, Errors: 0, Skipped: 0, Time elapsed: 1,142.797 sec <<<
FAILURE!
--
[INFO] Running console-testsuite.advance-test
[INFO] Tests run: 12, Failures: 12, Errors: 0, Skipped: 0, Time elapsed: 361.615 sec <<<
FAILURE!
--
[INFO] Running corba-testsuite.corba-mytime
[INFO] Tests run: 1, Failures: 1, Errors: 0, Skipped: 0, Time elapsed: 30.088 sec <<<
FAILURE!
--
[INFO] Running deployment-testsuite.deployment
[INFO] Tests run: 2, Failures: 1, Errors: 0, Skipped: 0, Time elapsed: 30.141 sec <<<
FAILURE!
--
[INFO] Running deployment-testsuite.jca-cms
[INFO] Tests run: 2, Failures: 2, Errors: 0, Skipped: 0, Time elapsed: 60.161 sec <<<
FAILURE!
--
[INFO] Running enterprise-testsuite.jms
[INFO] Tests run: 1, Failures: 1, Errors: 0, Skipped: 0, Time elapsed: 30.129 sec <<<
FAILURE!
--
[INFO] Running jpa-testsuite.jpa
[INFO] Tests run: 1, Failures: 1, Errors: 0, Skipped: 0, Time elapsed: 30.155 sec <<<
FAILURE!
--
[INFO] Running sec-testsuite.security
[INFO] Tests run: 2, Failures: 2, Errors: 0, Skipped: 0, Time elapsed: 60.194 sec <<<
FAILURE!
--
[INFO] Running web-testsuite.jsps
[INFO] Tests run: 4, Failures: 4, Errors: 0, Skipped: 0, Time elapsed: 120.274 sec <<<
FAILURE!
--
[INFO] Running web-testsuite.myfaces
[INFO] Tests run: 1, Failures: 1, Errors: 0, Skipped: 0, Time elapsed: 30.123 sec <<<
FAILURE!
--
[INFO] Running web-testsuite.security
[INFO] Tests run: 1, Failures: 1, Errors: 0, Skipped: 0, Time elapsed: 30.135 sec <<<
FAILURE!
--
[INFO] Running web-testsuite.references
[INFO] Tests run: 1, Failures: 1, Errors: 0, Skipped: 0, Time elapsed: 30.163 sec <<<
FAILURE!
--
[INFO] Running web-testsuite.servlets
[INFO] Tests run: 2, Failures: 2, Errors: 0, Skipped: 0, Time elapsed: 60.199 sec <<<
FAILURE!
--
[INFO] Running web-testsuite.jetty
[INFO] Tests run: 2, Failures: 2, Errors: 0, Skipped: 0, Time elapsed: 60.096 sec <<<
FAILURE!
--
[INFO] Running org.apache.geronimo.testsuite.testset.JaxWSTest
[INFO] Tests run: 5, Failures: 5, Errors: 0, Skipped: 0, Time elapsed: 2,000.418 sec <<<
FAILURE!
--
[INFO] 	... 27 more
[INFO] Tests run: 1, Failures: 1, Errors: 0, Skipped: 0, Time elapsed: 0.255 sec <<<
FAILURE!
--
[INFO] Hello foo bar
[INFO] Tests run: 3, Failures: 2, Errors: 0, Skipped: 0, Time elapsed: 800.897 sec <<<
FAILURE!
--
[INFO] Running org.apache.geronimo.testsuite.testset.WebJAXRTest
[INFO] Tests run: 2, Failures: 2, Errors: 0, Skipped: 0, Time elapsed: 800.233 sec <<<
FAILURE!
--
[INFO] Running org.apache.geronimo.testsuite.testset.WebStaxTest
[INFO] Tests run: 2, Failures: 2, Errors: 0, Skipped: 0, Time elapsed: 800.207 sec <<<
FAILURE!
--
[INFO] Running org.apache.geronimo.testsuite.testset.WSTest
[INFO] Tests run: 4, Failures: 4, Errors: 0, Skipped: 0, Time elapsed: 1,600.285 sec <<<
FAILURE!
--
[INFO] Running org.apache.geronimo.testsuite.testset.WebJAXBTest
[INFO] Tests run: 2, Failures: 2, Errors: 0, Skipped: 0, Time elapsed: 800.212 sec <<<
FAILURE!
--
[INFO] Running org.apache.geronimo.testsuite.testset.WebSAAJTest
[INFO] Tests run: 2, Failures: 2, Errors: 0, Skipped: 0, Time elapsed: 800.274 sec <<<
FAILURE!
--
[INFO] Running org.apache.geronimo.testsuite.testset.JaxRPCTest
[INFO] Tests run: 2, Failures: 2, Errors: 0, Skipped: 0, Time elapsed: 800.27 sec <<<
FAILURE!
--
[INFO] Running org.apache.geronimo.testsuite.testset.JaxRPCTest
[INFO] Tests run: 3, Failures: 2, Errors: 0, Skipped: 0, Time elapsed: 800.796 sec <<<
FAILURE!
 

Mime
View raw message