geronimo-scm mailing list archives

Site index · List index
Message view « Date » · « Thread »
Top « Date » · « Thread »
From pra...@apache.org
Subject [BUILD] 2.1: Successful
Date Sat, 06 Oct 2007 11:20:10 GMT
OpenEJB trunk at 582463
Geronimo Revision: 582475 built with tests included
 
See the full build-0600.log file at http://people.apache.org/~prasad/binaries/trunk/20071006/build-0600.log
 
Download the binaries from http://people.apache.org/~prasad/binaries/trunk/20071006
[INFO] BUILD SUCCESSFUL
[INFO] ------------------------------------------------------------------------
[INFO] Total time: 26 minutes 13 seconds
[INFO] Finished at: Sat Oct 06 06:33:26 EDT 2007
[INFO] Final Memory: 212M/1011M
[INFO] ------------------------------------------------------------------------
 
TESTSUITE RESULTS (Failures only)
=================================
See detailed results at http://people.apache.org/~prasad/testsuite/ResultsSummary.html
See the full test-0600.log file at http://people.apache.org/~prasad/binaries/trunk/20071006/test-0600.log
 
[INFO] Running enterprise-testsuite.jms
[INFO] Tests run: 1, Failures: 1, Errors: 0, Skipped: 0, Time elapsed: 0.305 sec <<<
FAILURE!
--
[INFO] Running org.apache.geronimo.testsuite.testset.EJBJAXBTest
[INFO] Tests run: 1, Failures: 1, Errors: 0, Skipped: 0, Time elapsed: 0.233 sec <<<
FAILURE!
--
[INFO] Running org.apache.geronimo.testsuite.testset.EJBJAXRTest
[INFO] Tests run: 1, Failures: 1, Errors: 0, Skipped: 0, Time elapsed: 0.278 sec <<<
FAILURE!
--
[INFO] Running org.apache.geronimo.testsuite.testset.JaxRPCTest
[INFO] Tests run: 3, Failures: 1, Errors: 0, Skipped: 0, Time elapsed: 1.754 sec <<<
FAILURE!
--
[INFO] Running org.apache.geronimo.testsuite.testset.EJBStaxTest
[INFO] Tests run: 1, Failures: 1, Errors: 0, Skipped: 0, Time elapsed: 0.262 sec <<<
FAILURE!
--
[INFO] Running org.apache.geronimo.testsuite.testset.JaxWSTest
[INFO] Tests run: 4, Failures: 1, Errors: 0, Skipped: 0, Time elapsed: 0.839 sec <<<
FAILURE!
 

Mime
View raw message