geronimo-scm mailing list archives

Site index · List index
Message view « Date » · « Thread »
Top « Date » · « Thread »
From pra...@apache.org
Subject [BUILD] 2.1: Successful
Date Sat, 06 Oct 2007 03:16:34 GMT
OpenEJB trunk at 582429
Geronimo Revision: 582432 built with tests included
 
See the full build-2200.log file at http://people.apache.org/~prasad/binaries/trunk/20071005/build-2200.log
 
Download the binaries from http://people.apache.org/~prasad/binaries/trunk/20071005
[INFO] BUILD SUCCESSFUL
[INFO] ------------------------------------------------------------------------
[INFO] Total time: 26 minutes 28 seconds
[INFO] Finished at: Fri Oct 05 22:31:20 EDT 2007
[INFO] Final Memory: 212M/1013M
[INFO] ------------------------------------------------------------------------
 
TESTSUITE RESULTS (Failures only)
=================================
See detailed results at http://people.apache.org/~prasad/testsuite/ResultsSummary.html
See the full test-2200.log file at http://people.apache.org/~prasad/binaries/trunk/20071005/test-2200.log
 
[INFO] Running enterprise-testsuite.jms
[INFO] Tests run: 1, Failures: 1, Errors: 0, Skipped: 0, Time elapsed: 0.307 sec <<<
FAILURE!
--
[INFO] Running org.apache.geronimo.testsuite.testset.EJBJAXBTest
[INFO] Tests run: 1, Failures: 1, Errors: 0, Skipped: 0, Time elapsed: 0.261 sec <<<
FAILURE!
--
[INFO] Running org.apache.geronimo.testsuite.testset.EJBJAXRTest
[INFO] Tests run: 1, Failures: 1, Errors: 0, Skipped: 0, Time elapsed: 0.257 sec <<<
FAILURE!
--
[INFO] Running org.apache.geronimo.testsuite.testset.JaxRPCTest
[INFO] Tests run: 3, Failures: 1, Errors: 0, Skipped: 0, Time elapsed: 1.755 sec <<<
FAILURE!
--
[INFO] Running org.apache.geronimo.testsuite.testset.EJBStaxTest
[INFO] Tests run: 1, Failures: 1, Errors: 0, Skipped: 0, Time elapsed: 0.223 sec <<<
FAILURE!
--
[INFO] Running org.apache.geronimo.testsuite.testset.JaxWSTest
[INFO] Tests run: 4, Failures: 1, Errors: 0, Skipped: 0, Time elapsed: 0.831 sec <<<
FAILURE!
 

Mime
View raw message