geronimo-scm mailing list archives

Site index · List index
Message view « Date » · « Thread »
Top « Date » · « Thread »
From pra...@apache.org
Subject [BUILD] 2.0: Successful
Date Fri, 05 Oct 2007 17:01:52 GMT
Geronimo Revision: 582319 built with tests included
 
See the full build-1200.log file at http://people.apache.org/~prasad/binaries/2.0/20071005/build-1200.log
 
Download the binaries from http://people.apache.org/~prasad/binaries/2.0/20071005
[INFO] BUILD SUCCESSFUL
[INFO] ------------------------------------------------------------------------
[INFO] Total time: 24 minutes 35 seconds
[INFO] Finished at: Fri Oct 05 12:47:39 EDT 2007
[INFO] Final Memory: 203M/1002M
[INFO] ------------------------------------------------------------------------
 
TESTSUITE RESULTS (Failures only)
=================================
See detailed results at http://people.apache.org/~prasad/testsuite/ResultsSummary.html
See the full test-1200.log file at http://people.apache.org/~prasad/binaries/2.0/20071005/test-1200.log
 
[INFO] Running console-testsuite.basic-console
[INFO] Tests run: 38, Failures: 38, Errors: 0, Skipped: 0, Time elapsed: 1,141.968 sec <<<
FAILURE!
 
[INFO]   testDBViewerLink(org.apache.geronimo.testsuite.console.DBViewerPortletTest)
[INFO]   testDatabasePoolLink(org.apache.geronimo.testsuite.console.DatabasePoolPortletTest)
[INFO]   testDeploymentLink(org.apache.geronimo.testsuite.console.DeploymentPortletTest)
[INFO]   testDerbyLogViewerLink(org.apache.geronimo.testsuite.console.DerbyLogViewerPortletTest)
[INFO]   testImportExportLink(org.apache.geronimo.testsuite.console.ImportExportPortletTest)
[INFO]   testInternalDBLink(org.apache.geronimo.testsuite.console.InternalDBPortletTest)
[INFO]   testJMSBrokerLink(org.apache.geronimo.testsuite.console.JMSBrokerPortletTest)
[INFO]   testJMSConnectorLink(org.apache.geronimo.testsuite.console.JMSConnectorPortletTest)
[INFO]   testJMSResourceLink(org.apache.geronimo.testsuite.console.JMSResourcePortletTest)
[INFO]   testJMXManagerLink(org.apache.geronimo.testsuite.console.JMXManagerPortletTest)
[INFO]   testJavaSystemInfoLink(org.apache.geronimo.testsuite.console.JavaSystemInfoPortletTest)
[INFO]   testKeystoresLink(org.apache.geronimo.testsuite.console.KeystoresPortletTest)
[INFO]   testLDAPManagerLink(org.apache.geronimo.testsuite.console.LDAPManagerPortletTest)
[INFO]   testServerInfoLink(org.apache.geronimo.testsuite.console.LinkCheckTest)
[INFO]   testLogManagerLink(org.apache.geronimo.testsuite.console.LogManagerPortletTest)
[INFO]   testLogViewerLink(org.apache.geronimo.testsuite.console.LogViewerPortletTest)
[INFO]   testRepositoryViewLink(org.apache.geronimo.testsuite.console.RepositoryViewPortletTest)
[INFO]   testRunSQLLink(org.apache.geronimo.testsuite.console.RunSQLPortletTest)
[INFO]   testSEGroupsLink(org.apache.geronimo.testsuite.console.SEGroupsPortletTest)
[INFO]   testSEUsersLink(org.apache.geronimo.testsuite.console.SEUsersPortletTest)
[INFO]   testSecurityRealmLink(org.apache.geronimo.testsuite.console.SecurityRealmPortletTest)
[INFO]   testServerInfoLink(org.apache.geronimo.testsuite.console.ServerInfoPortletTest)
[INFO]   testServerManagerLink(org.apache.geronimo.testsuite.console.ServerManagerPortletTest)
[INFO]   testLoginAndLogout(org.apache.geronimo.testsuite.console.SimpleLoginTest)
[INFO]   testClickSomeLinks(org.apache.geronimo.testsuite.console.SimpleLoginTest)
[INFO]   testThreadPoolLink(org.apache.geronimo.testsuite.console.ThreadPoolPortletTest)
[INFO]   testWebAccessLogViewerLink(org.apache.geronimo.testsuite.console.WebAccessLogViewerPortletTest)
[INFO]   testWebManagerLink(org.apache.geronimo.testsuite.console.WebManagerPortletTest)
[INFO]   testWelcomeLink(org.apache.geronimo.testsuite.console.WelcomePortletTest)
[INFO] 
[INFO] Tests run: 38, Failures: 38, Errors: 0, Skipped: 0
[INFO] 
[INFO] [ERROR] There are test failures.
[INFO] [INFO] [tools:verify-legal-files {execution: verify-legal-files}]
[INFO] [INFO] Checking legal files in: basic-2.0.2-SNAPSHOT.jar
[INFO] [INFO] [install:install]
[INFO] [INFO] Installing /home/prasad/geronimo/2.0/testsuite/console-testsuite/basic/target/basic-2.0.2-SNAPSHOT.jar
to /home/prasad/.m2/repository/org/apache/geronimo/testsuite/basic/2.0.2-SNAPSHOT/basic-2.0.2-SNAPSHOT.jar
[INFO] Downloading: http://jtidy.sourceforge.net/snapshots/xerces/dom3-xml-apis/1.0/dom3-xml-apis-1.0.pom
[INFO] Downloading: http://download.java.net/maven/1//xerces/poms/dom3-xml-apis-1.0.pom
[INFO] Downloading: http://people.apache.org/repo/m2-incubating-repository//xerces/dom3-xml-apis/1.0/dom3-xml-apis-1.0.pom
[INFO] Downloading: http://repo1.maven.org/maven2/xerces/dom3-xml-apis/1.0/dom3-xml-apis-1.0.pom
[INFO] Downloading: http://download.java.net/maven/1//xerces/poms/dom3-xml-apis-1.0.pom
[INFO] Downloading: http://people.apache.org/repo/m2-incubating-repository//xerces/dom3-xml-apis/1.0/dom3-xml-apis-1.0.pom
[INFO] Downloading: http://repo1.maven.org/maven2/xerces/dom3-xml-apis/1.0/dom3-xml-apis-1.0.pom
[INFO] [INFO] [testsuite:generate-surefire-xml {execution: generate-surefire-xml}]
[INFO] [INFO] Updating directory: /home/prasad/geronimo/2.0/testsuite/console-testsuite/target/surefire-reports
[INFO] [INFO] Loading surefire xml for xmlproperty: /home/prasad/geronimo/2.0/testsuite/console-testsuite/basic/target/surefire-reports/TEST-console-testsuite.basic-console.xml
[INFO] [INFO] ------------------------------------------------------------------------
[INFO] [ERROR] BUILD ERROR
[INFO] [INFO] ------------------------------------------------------------------------
[INFO] [INFO] For input string: "1,141.892"
[INFO] 
[INFO] [INFO] ------------------------------------------------------------------------
[INFO] [INFO] Trace
[INFO] org.apache.maven.lifecycle.LifecycleExecutionException: For input string: "1,141.892"
[INFO] 	at org.apache.maven.lifecycle.DefaultLifecycleExecutor.executeGoals(DefaultLifecycleExecutor.java:564)
[INFO] 	at org.apache.maven.lifecycle.DefaultLifecycleExecutor.executeGoalWithLifecycle(DefaultLifecycleExecutor.java:480)
[INFO] 	at org.apache.maven.lifecycle.DefaultLifecycleExecutor.executeGoal(DefaultLifecycleExecutor.java:459)
[INFO] 	at org.apache.maven.lifecycle.DefaultLifecycleExecutor.executeGoalAndHandleFailures(DefaultLifecycleExecutor.java:311)
[INFO] 	at org.apache.maven.lifecycle.DefaultLifecycleExecutor.executeTaskSegments(DefaultLifecycleExecutor.java:278)
[INFO] 	at org.apache.maven.lifecycle.DefaultLifecycleExecutor.execute(DefaultLifecycleExecutor.java:143)
[INFO] 	at org.apache.maven.DefaultMaven.doExecute(DefaultMaven.java:334)
[INFO] 	at org.apache.maven.DefaultMaven.execute(DefaultMaven.java:125)
[INFO] 	at org.apache.maven.cli.MavenCli.main(MavenCli.java:280)
[INFO] 	at sun.reflect.NativeMethodAccessorImpl.invoke0(Native Method)
[INFO] 	at sun.reflect.NativeMethodAccessorImpl.invoke(NativeMethodAccessorImpl.java:39)
[INFO] 	at sun.reflect.DelegatingMethodAccessorImpl.invoke(DelegatingMethodAccessorImpl.java:25)
[INFO] 	at java.lang.reflect.Method.invoke(Method.java:585)
[INFO] 	at org.codehaus.classworlds.Launcher.launchEnhanced(Launcher.java:315)
[INFO] 	at org.codehaus.classworlds.Launcher.launch(Launcher.java:255)
[INFO] 	at org.codehaus.classworlds.Launcher.mainWithExitCode(Launcher.java:430)
[INFO] 	at org.codehaus.classworlds.Launcher.main(Launcher.java:375)
[INFO] Caused by: org.apache.maven.plugin.MojoExecutionException: For input string: "1,141.892"
[INFO] 	at org.codehaus.mojo.pluginsupport.MojoSupport.execute(MojoSupport.java:137)
[INFO] 	at org.apache.maven.plugin.DefaultPluginManager.executeMojo(DefaultPluginManager.java:443)
[INFO] 	at org.apache.maven.lifecycle.DefaultLifecycleExecutor.executeGoals(DefaultLifecycleExecutor.java:539)
[INFO] 	... 16 more
[INFO] Caused by: java.lang.NumberFormatException: For input string: "1,141.892"
[INFO] 	at sun.misc.FloatingDecimal.readJavaFormatString(FloatingDecimal.java:1224)
[INFO] 	at java.lang.Float.parseFloat(Float.java:394)
[INFO] 	at org.apache.geronimo.mavenplugins.testsuite.SurefireXMLGeneratorMojo.doExecute(SurefireXMLGeneratorMojo.java:181)
[INFO] 	at org.codehaus.mojo.pluginsupport.MojoSupport.execute(MojoSupport.java:122)
[INFO] 	... 18 more
[INFO] [INFO] ------------------------------------------------------------------------
[INFO] [INFO] Total time: 19 minutes 34 seconds
[INFO] [INFO] Finished at: Fri Oct 05 13:11:54 EDT 2007
[INFO] [INFO] Final Memory: 18M/555M
[INFO] [INFO] ------------------------------------------------------------------------
[INFO] ------------------------------------------------------------------------
[ERROR] BUILD ERROR
[INFO] ------------------------------------------------------------------------
[INFO] exec returned: 1

[INFO] ------------------------------------------------------------------------
[INFO] For more information, run Maven with the -e switch
[INFO] ------------------------------------------------------------------------
[INFO] Total time: 21 minutes 4 seconds
[INFO] Finished at: Fri Oct 05 13:11:54 EDT 2007
[INFO] Final Memory: 22M/550M
[INFO] ------------------------------------------------------------------------

Mime
View raw message