geronimo-scm mailing list archives

Site index · List index
Message view « Date » · « Thread »
Top « Date » · « Thread »
From pra...@apache.org
Subject [BUILD] 2.1: Successful
Date Wed, 03 Oct 2007 07:17:26 GMT
OpenEJB trunk at 581454
Geronimo Revision: 581502 built with tests included
 
See the full build-0200.log file at http://people.apache.org/~prasad/binaries/trunk/20071003/build-0200.log
 
Download the binaries from http://people.apache.org/~prasad/binaries/trunk/20071003
[INFO] BUILD SUCCESSFUL
[INFO] ------------------------------------------------------------------------
[INFO] Total time: 25 minutes 57 seconds
[INFO] Finished at: Wed Oct 03 02:31:38 EDT 2007
[INFO] Final Memory: 213M/1010M
[INFO] ------------------------------------------------------------------------
 
TESTSUITE RESULTS (Failures only)
=================================
See detailed results at http://people.apache.org/~prasad/testsuite/ResultsSummary.html
See the full test-0200.log file at http://people.apache.org/~prasad/binaries/trunk/20071003/test-0200.log
 
[INFO] Running deployment-testsuite.jca-cms
[INFO] Tests run: 1, Failures: 1, Errors: 0, Skipped: 0, Time elapsed: 0.311 sec <<<
FAILURE!
--
[INFO] Running org.apache.geronimo.testsuite.testset.EJBJAXBTest
[INFO] Tests run: 1, Failures: 1, Errors: 0, Skipped: 0, Time elapsed: 0.198 sec <<<
FAILURE!
--
[INFO] Running org.apache.geronimo.testsuite.testset.EJBJAXRTest
[INFO] Tests run: 1, Failures: 1, Errors: 0, Skipped: 0, Time elapsed: 0.192 sec <<<
FAILURE!
--
[INFO] Running org.apache.geronimo.testsuite.testset.JaxRPCTest
[INFO] Tests run: 3, Failures: 1, Errors: 0, Skipped: 0, Time elapsed: 0.529 sec <<<
FAILURE!
--
[INFO] Running org.apache.geronimo.testsuite.testset.EJBStaxTest
[INFO] Tests run: 1, Failures: 1, Errors: 0, Skipped: 0, Time elapsed: 0.202 sec <<<
FAILURE!
--
[INFO] Running org.apache.geronimo.testsuite.testset.JaxWSTest
[INFO] Tests run: 4, Failures: 1, Errors: 0, Skipped: 0, Time elapsed: 0.783 sec <<<
FAILURE!
 

Mime
View raw message