geronimo-scm mailing list archives

Site index · List index
Message view « Date » · « Thread »
Top « Date » · « Thread »
From pra...@apache.org
Subject [BUILD] 2.1: Successful
Date Tue, 02 Oct 2007 11:19:52 GMT
OpenEJB trunk at 581146
Geronimo Revision: 581177 built with tests included
 
See the full build-0600.log file at http://people.apache.org/~prasad/binaries/trunk/20071002/build-0600.log
 
Download the binaries from http://people.apache.org/~prasad/binaries/trunk/20071002
[INFO] BUILD SUCCESSFUL
[INFO] ------------------------------------------------------------------------
[INFO] Total time: 26 minutes 53 seconds
[INFO] Finished at: Tue Oct 02 06:33:49 EDT 2007
[INFO] Final Memory: 210M/1011M
[INFO] ------------------------------------------------------------------------
 
TESTSUITE RESULTS (Failures only)
=================================
See detailed results at http://people.apache.org/~prasad/testsuite/ResultsSummary.html
See the full test-0600.log file at http://people.apache.org/~prasad/binaries/trunk/20071002/test-0600.log
 
[INFO] Running deployment-testsuite.jca-cms
[INFO] Tests run: 1, Failures: 1, Errors: 0, Skipped: 0, Time elapsed: 0.279 sec <<<
FAILURE!
--
[INFO] Running org.apache.geronimo.testsuite.testset.EJBJAXBTest
[INFO] Tests run: 1, Failures: 1, Errors: 0, Skipped: 0, Time elapsed: 0.23 sec <<<
FAILURE!
--
[INFO] Running org.apache.geronimo.testsuite.testset.EJBJAXRTest
[INFO] Tests run: 1, Failures: 1, Errors: 0, Skipped: 0, Time elapsed: 0.294 sec <<<
FAILURE!
--
[INFO] Running org.apache.geronimo.testsuite.testset.JaxRPCTest
[INFO] Tests run: 3, Failures: 1, Errors: 0, Skipped: 0, Time elapsed: 0.54 sec <<<
FAILURE!
--
[INFO] Running org.apache.geronimo.testsuite.testset.EJBStaxTest
[INFO] Tests run: 1, Failures: 1, Errors: 0, Skipped: 0, Time elapsed: 0.258 sec <<<
FAILURE!
--
[INFO] Running org.apache.geronimo.testsuite.testset.JaxWSTest
[INFO] Tests run: 4, Failures: 1, Errors: 0, Skipped: 0, Time elapsed: 0.796 sec <<<
FAILURE!
 

Mime
View raw message