geronimo-scm mailing list archives

Site index · List index
Message view « Date » · « Thread »
Top « Date » · « Thread »
From pra...@apache.org
Subject [BUILD] 2.1: Successful
Date Sat, 29 Sep 2007 03:15:06 GMT
OpenEJB trunk at 580523
Geronimo Revision: 580530 built with tests included
 
See the full build-2200.log file at http://people.apache.org/~prasad/binaries/trunk/20070928/build-2200.log
 
Download the binaries from http://people.apache.org/~prasad/binaries/trunk/20070928
[INFO] BUILD SUCCESSFUL
[INFO] ------------------------------------------------------------------------
[INFO] Total time: 25 minutes 50 seconds
[INFO] Finished at: Fri Sep 28 22:28:51 EDT 2007
[INFO] Final Memory: 218M/996M
[INFO] ------------------------------------------------------------------------
 
TESTSUITE RESULTS (Failures only)
=================================
See detailed results at http://people.apache.org/~prasad/testsuite/ResultsSummary.html
See the full test-2200.log file at http://people.apache.org/~prasad/binaries/trunk/20070928/test-2200.log
 
[INFO] Running corba-testsuite.corba-mytime
[INFO] Tests run: 1, Failures: 1, Errors: 0, Skipped: 0, Time elapsed: 6.282 sec <<<
FAILURE!
--
[INFO] Running deployment-testsuite.jca-cms
[INFO] Tests run: 1, Failures: 1, Errors: 0, Skipped: 0, Time elapsed: 0.31 sec <<<
FAILURE!
--
[INFO] Running web-testsuite.tomcat
[INFO] Tests run: 1, Failures: 1, Errors: 0, Skipped: 0, Time elapsed: 0.268 sec <<<
FAILURE!
--
[INFO] Running web-testsuite.jetty
[INFO] Tests run: 1, Failures: 1, Errors: 0, Skipped: 0, Time elapsed: 30.244 sec <<<
FAILURE!
--
[INFO] Running org.apache.geronimo.testsuite.testset.EJBJAXBTest
[INFO] Tests run: 1, Failures: 1, Errors: 0, Skipped: 0, Time elapsed: 0.201 sec <<<
FAILURE!
--
[INFO] Running org.apache.geronimo.testsuite.testset.EJBJAXRTest
[INFO] Tests run: 1, Failures: 1, Errors: 0, Skipped: 0, Time elapsed: 0.201 sec <<<
FAILURE!
--
[INFO] Running org.apache.geronimo.testsuite.testset.JaxRPCTest
[INFO] Tests run: 3, Failures: 1, Errors: 0, Skipped: 0, Time elapsed: 0.51 sec <<<
FAILURE!
--
[INFO] Running org.apache.geronimo.testsuite.testset.EJBStaxTest
[INFO] Tests run: 1, Failures: 1, Errors: 0, Skipped: 0, Time elapsed: 0.198 sec <<<
FAILURE!
 

Mime
View raw message