geronimo-scm mailing list archives

Site index · List index
Message view « Date » · « Thread »
Top « Date » · « Thread »
From pra...@apache.org
Subject [BUILD] 2.0: Successful
Date Tue, 25 Sep 2007 09:36:38 GMT
OpenEJB trunk at 
Geronimo Revision: 579111 built with tests included
 
See the full build-0400.log file at http://people.apache.org/~prasad/binaries/2.0/20070925/build-0400.log
Download the binaries from http://people.apache.org/~prasad/binaries/2.0/20070925
 
[INFO] BUILD SUCCESSFUL
[INFO] ------------------------------------------------------------------------
[INFO] Total time: 19 minutes 32 seconds
[INFO] Finished at: Tue Sep 25 05:02:25 EDT 2007
[INFO] Final Memory: 200M/971M
[INFO] ------------------------------------------------------------------------
 
TESTSUITE RESULTS (Failures only)
=================================
See detailed results at http://people.apache.org/~prasad/testsuite/ResultsSummary.html
 
[INFO] Running console-testsuite.advance-test
[INFO] Tests run: 12, Failures: 1, Errors: 0, Skipped: 0, Time elapsed: 150.953 sec <<<
FAILURE!
--
[INFO] Running deployment-testsuite.deployment
[INFO] Tests run: 2, Failures: 1, Errors: 0, Skipped: 0, Time elapsed: 0.617 sec <<<
FAILURE!
--
[INFO] Running deployment-testsuite.jca-cms
[INFO] Tests run: 1, Failures: 1, Errors: 0, Skipped: 0, Time elapsed: 0.372 sec <<<
FAILURE!
--
[INFO] Running enterprise-testsuite.jms
[INFO] Tests run: 1, Failures: 1, Errors: 0, Skipped: 0, Time elapsed: 0.306 sec <<<
FAILURE!
--
[INFO] Powered by Jetty://
[INFO] Tests run: 2, Failures: 2, Errors: 0, Skipped: 0, Time elapsed: 0.705 sec <<<
FAILURE!
--
[INFO] Running web-testsuite.jsps
[INFO] Tests run: 4, Failures: 2, Errors: 0, Skipped: 0, Time elapsed: 10.333 sec <<<
FAILURE!
--
[INFO] Running web-testsuite.myfaces
[INFO] Tests run: 1, Failures: 1, Errors: 0, Skipped: 0, Time elapsed: 4.747 sec <<<
FAILURE!
--
[INFO] Running web-testsuite.security
[INFO] Tests run: 1, Failures: 1, Errors: 0, Skipped: 0, Time elapsed: 0.229 sec <<<
FAILURE!
--
[INFO] Running web-testsuite.servlets
[INFO] Tests run: 2, Failures: 2, Errors: 0, Skipped: 0, Time elapsed: 0.472 sec <<<
FAILURE!
--
[INFO] Running web-testsuite.jetty
[INFO] Tests run: 1, Failures: 1, Errors: 0, Skipped: 0, Time elapsed: 30.079 sec <<<
FAILURE!
--
[INFO] Running org.apache.geronimo.testsuite.testset.EJBJAXRTest
[INFO] Tests run: 1, Failures: 1, Errors: 0, Skipped: 0, Time elapsed: 0.253 sec <<<
FAILURE!
--
[INFO] Running org.apache.geronimo.testsuite.testset.EJBStaxTest
[INFO] Tests run: 1, Failures: 1, Errors: 0, Skipped: 0, Time elapsed: 0.27 sec <<<
FAILURE!
--
[INFO] Running org.apache.geronimo.testsuite.testset.EJBJAXBTest
[INFO] Tests run: 1, Failures: 1, Errors: 0, Skipped: 0, Time elapsed: 0.257 sec <<<
FAILURE!
--
[INFO] <?xml version="1.0" encoding="UTF-8"?><soapenv:Envelope xmlns:soapenv="http://schemas.xmlsoap.org/soap/envelope/"
xmlns:xsd="http://www.w3.org/2001/XMLSchema" xmlns:xsi="http://www.w3.org/2001/XMLSchema-instance"><soapenv:Body><greetMeResponse
xmlns="http://org.apache.org/greeter"><out xsi:type="xsd:string" xmlns="">Hello foo
bar</out></greetMeResponse></soapenv:Body></soapenv:Envelope>
[INFO] Tests run: 3, Failures: 1, Errors: 0, Skipped: 0, Time elapsed: 0.444 sec <<<
FAILURE!
 

Mime
View raw message