geronimo-scm mailing list archives

Site index · List index
Message view « Date » · « Thread »
Top « Date » · « Thread »
From pra...@apache.org
Subject [BUILD] 2.0: Successful for Revision: 574826
Date Wed, 12 Sep 2007 09:25:47 GMT
OpenEJB trunk at 574825
Geronimo Revision: 574826 built with tests included
 
See the full build-0400.log file at http://people.apache.org/~prasad/binaries/2.0/20070912/build-0400.log
Download the binaries from http://people.apache.org/~prasad/binaries/2.0/20070912
 
[INFO] BUILD SUCCESSFUL
[INFO] ------------------------------------------------------------------------
[INFO] Total time: 22 minutes 51 seconds
[INFO] Finished at: Wed Sep 12 04:49:29 EDT 2007
[INFO] Final Memory: 186M/999M
[INFO] ------------------------------------------------------------------------
 
TESTSUITE RESULTS (Failures only)
=================================
See detailed results at http://people.apache.org/~prasad/testsuite/ResultsSummary.html
 
[INFO] Running console-testsuite.advance-test
[INFO] Tests run: 12, Failures: 1, Errors: 0, Skipped: 0, Time elapsed: 155.076 sec <<<
FAILURE!
--
[INFO] Running deployment-testsuite.deployment
[INFO] Tests run: 2, Failures: 1, Errors: 0, Skipped: 0, Time elapsed: 0.62 sec <<<
FAILURE!
--
[INFO] Running deployment-testsuite.jca-cms
[INFO] Tests run: 1, Failures: 1, Errors: 0, Skipped: 0, Time elapsed: 0.384 sec <<<
FAILURE!
--
[INFO] Running enterprise-testsuite.jms
[INFO] Tests run: 1, Failures: 1, Errors: 0, Skipped: 0, Time elapsed: 0.301 sec <<<
FAILURE!
--
[INFO] Powered by Jetty://
[INFO] Tests run: 2, Failures: 2, Errors: 0, Skipped: 0, Time elapsed: 0.676 sec <<<
FAILURE!
--
[INFO] Running web-testsuite.jsps
[INFO] Tests run: 4, Failures: 2, Errors: 0, Skipped: 0, Time elapsed: 9.187 sec <<<
FAILURE!
--
[INFO] Running web-testsuite.myfaces
[INFO] Tests run: 1, Failures: 1, Errors: 0, Skipped: 0, Time elapsed: 4.638 sec <<<
FAILURE!
--
[INFO] Running web-testsuite.security
[INFO] Tests run: 1, Failures: 1, Errors: 0, Skipped: 0, Time elapsed: 0.239 sec <<<
FAILURE!
--
[INFO] Running web-testsuite.servlets
[INFO] Tests run: 2, Failures: 2, Errors: 0, Skipped: 0, Time elapsed: 0.534 sec <<<
FAILURE!
--
[INFO] Running web-testsuite.jetty
[INFO] Tests run: 1, Failures: 1, Errors: 0, Skipped: 0, Time elapsed: 30.079 sec <<<
FAILURE!
--
[INFO] Running org.apache.geronimo.testsuite.testset.EJBJAXRTest
[INFO] Tests run: 1, Failures: 1, Errors: 0, Skipped: 0, Time elapsed: 0.265 sec <<<
FAILURE!
--
[INFO] Running org.apache.geronimo.testsuite.testset.EJBStaxTest
[INFO] Tests run: 1, Failures: 1, Errors: 0, Skipped: 0, Time elapsed: 0.218 sec <<<
FAILURE!
--
[INFO] Running org.apache.geronimo.testsuite.testset.EJBJAXBTest
[INFO] Tests run: 1, Failures: 1, Errors: 0, Skipped: 0, Time elapsed: 0.217 sec <<<
FAILURE!
--
[INFO] <?xml version="1.0" encoding="UTF-8"?><soapenv:Envelope xmlns:soapenv="http://schemas.xmlsoap.org/soap/envelope/"
xmlns:xsd="http://www.w3.org/2001/XMLSchema" xmlns:xsi="http://www.w3.org/2001/XMLSchema-instance"><soapenv:Body><greetMeResponse
xmlns="http://org.apache.org/greeter"><out xsi:type="xsd:string" xmlns="">Hello foo
bar</out></greetMeResponse></soapenv:Body></soapenv:Envelope>
[INFO] Tests run: 3, Failures: 1, Errors: 0, Skipped: 0, Time elapsed: 0.711 sec <<<
FAILURE!
 

Mime
View raw message