geronimo-scm mailing list archives

Site index · List index
Message view « Date » · « Thread »
Top « Date » · « Thread »
From pra...@apache.org
Subject [BUILD] 2.0: Successful for Revision: 569232
Date Fri, 24 Aug 2007 04:08:17 GMT
OpenEJB trunk at 569232
Geronimo Revision: 569232 built with tests skipped
 
See the full build-2300.log file at http://people.apache.org/~prasad/binaries/2.0/20070823/build-2300.log
Download the binaries from http://people.apache.org/~prasad/binaries/2.0/20070823
 
[INFO] BUILD SUCCESSFUL
[INFO] ------------------------------------------------------------------------
[INFO] Total time: 18 minutes 46 seconds
[INFO] Finished at: Thu Aug 23 23:31:07 EDT 2007
[INFO] Final Memory: 199M/968M
[INFO] ------------------------------------------------------------------------
 
TESTSUITE RESULTS (Failures only)
=================================
See detailed results at http://people.apache.org/~prasad/testsuite/ResultsSummary.html
 
[INFO] Running console-testsuite.advance-test
[INFO] Tests run: 13, Failures: 10, Errors: 0, Skipped: 0, Time elapsed: 62.727 sec <<<
FAILURE!
--
[INFO] Running deployment-testsuite.deployment
[INFO] Tests run: 2, Failures: 1, Errors: 0, Skipped: 0, Time elapsed: 0.608 sec <<<
FAILURE!
--
[INFO] Running deployment-testsuite.jca-cms
[INFO] Tests run: 1, Failures: 1, Errors: 0, Skipped: 0, Time elapsed: 0.347 sec <<<
FAILURE!
--
[INFO] Running enterprise-testsuite.jms
[INFO] Tests run: 1, Failures: 1, Errors: 0, Skipped: 0, Time elapsed: 0.278 sec <<<
FAILURE!
--
[INFO] Powered by Jetty://
[INFO] Tests run: 2, Failures: 2, Errors: 0, Skipped: 0, Time elapsed: 0.65 sec <<<
FAILURE!
--
[INFO] Running web-testsuite.jsps
[INFO] Tests run: 4, Failures: 2, Errors: 0, Skipped: 0, Time elapsed: 9.47 sec <<<
FAILURE!
--
[INFO] Running web-testsuite.myfaces
[INFO] Tests run: 1, Failures: 1, Errors: 0, Skipped: 0, Time elapsed: 4.828 sec <<<
FAILURE!
--
[INFO] Running web-testsuite.security
[INFO] Tests run: 1, Failures: 1, Errors: 0, Skipped: 0, Time elapsed: 0.236 sec <<<
FAILURE!
--
[INFO] Running web-testsuite.servlets
[INFO] Tests run: 2, Failures: 2, Errors: 0, Skipped: 0, Time elapsed: 0.584 sec <<<
FAILURE!
--
[INFO] Running web-testsuite.jetty
[INFO] Tests run: 1, Failures: 1, Errors: 0, Skipped: 0, Time elapsed: 30.13 sec <<<
FAILURE!
--
[INFO] Running org.apache.geronimo.testsuite.testset.EJBJAXRTest
[INFO] Tests run: 1, Failures: 1, Errors: 0, Skipped: 0, Time elapsed: 0.256 sec <<<
FAILURE!
--
[INFO] Running org.apache.geronimo.testsuite.testset.EJBStaxTest
[INFO] Tests run: 1, Failures: 1, Errors: 0, Skipped: 0, Time elapsed: 0.261 sec <<<
FAILURE!
--
[INFO] Running org.apache.geronimo.testsuite.testset.EJBJAXBTest
[INFO] Tests run: 1, Failures: 1, Errors: 0, Skipped: 0, Time elapsed: 0.253 sec <<<
FAILURE!
--
[INFO] <?xml version="1.0" encoding="UTF-8"?><soapenv:Envelope xmlns:soapenv="http://schemas.xmlsoap.org/soap/envelope/"
xmlns:xsd="http://www.w3.org/2001/XMLSchema" xmlns:xsi="http://www.w3.org/2001/XMLSchema-instance"><soapenv:Body><greetMeResponse
xmlns="http://org.apache.org/greeter"><out xsi:type="xsd:string" xmlns="">Hello foo
bar</out></greetMeResponse></soapenv:Body></soapenv:Envelope>
[INFO] Tests run: 3, Failures: 1, Errors: 0, Skipped: 0, Time elapsed: 0.686 sec <<<
FAILURE!
 

Mime
View raw message