geronimo-scm mailing list archives

Site index · List index
Message view « Date » · « Thread »
Top « Date » · « Thread »
From pra...@apache.org
Subject [BUILD] Failed for Revision: 505670
Date Sat, 10 Feb 2007 10:03:23 GMT
Revision: 505670 built with tests included
See the full build-050038.log file at http://people.apache.org/~prasad/binaries/20070210/build-050038.log
 
[INFO]    task-segment: [install]
[INFO] ----------------------------------------------------------------------------
[INFO] [tools:require-java-version {execution: validate-java-version}]
[INFO] [tools:copy-legal-files {execution: install-legal-files}]
[INFO] Created dir: /home/prasad/geronimo/trunk/testsupport/test-deployment-javaee_5/test-war-javaee_5/target/classes/META-INF
[INFO] Copying 2 files to /home/prasad/geronimo/trunk/testsupport/test-deployment-javaee_5/test-war-javaee_5/target/classes/META-INF
[INFO] [resources:resources]
[INFO] Using default encoding to copy filtered resources.
[INFO] [compiler:compile]
[INFO] No sources to compile
[INFO] [resources:testResources]
[INFO] Using default encoding to copy filtered resources.
[INFO] [compiler:testCompile]
[INFO] No sources to compile
[INFO] [surefire:test]
[INFO] No tests to run.
[INFO] [war:war]
[INFO] Exploding webapp...
[INFO] Assembling webapp test-war-javaee_5 in /home/prasad/geronimo/trunk/testsupport/test-deployment-javaee_5/test-war-javaee_5/target/test-war-javaee_5-2.0-SNAPSHOT
[INFO] Copy webapp webResources to /home/prasad/geronimo/trunk/testsupport/test-deployment-javaee_5/test-war-javaee_5/target/test-war-javaee_5-2.0-SNAPSHOT
[INFO] Building jar: /home/prasad/geronimo/trunk/testsupport/test-deployment-javaee_5/test-war-javaee_5/target/test-war-javaee_5-2.0-SNAPSHOT/WEB-INF/lib/test-war-javaee_5-2.0-SNAPSHOT.jar
[INFO] Generating war /home/prasad/geronimo/trunk/testsupport/test-deployment-javaee_5/test-war-javaee_5/target/test-war-javaee_5-2.0-SNAPSHOT.war
[INFO] Building war: /home/prasad/geronimo/trunk/testsupport/test-deployment-javaee_5/test-war-javaee_5/target/test-war-javaee_5-2.0-SNAPSHOT.war
[INFO] [install:install]
[INFO] Installing /home/prasad/geronimo/trunk/testsupport/test-deployment-javaee_5/test-war-javaee_5/target/test-war-javaee_5-2.0-SNAPSHOT.war
to /home/prasad/.m2/repository/org/apache/geronimo/testsupport/test-war-javaee_5/2.0-SNAPSHOT/test-war-javaee_5-2.0-SNAPSHOT.war
[INFO] ----------------------------------------------------------------------------
[INFO] Building Geronimo Test Support, Test Deployment JAVAEE 5 :: RAR
[INFO]    task-segment: [install]
[INFO] ----------------------------------------------------------------------------
[INFO] [tools:require-java-version {execution: validate-java-version}]
[INFO] [tools:copy-legal-files {execution: install-legal-files}]
[INFO] Created dir: /home/prasad/geronimo/trunk/testsupport/test-deployment-javaee_5/test-rar-javaee_5/target/classes/META-INF
[INFO] Copying 2 files to /home/prasad/geronimo/trunk/testsupport/test-deployment-javaee_5/test-rar-javaee_5/target/classes/META-INF
[INFO] [resources:resources]
[INFO] Using default encoding to copy filtered resources.
[INFO] [compiler:compile]
[INFO] No sources to compile
[INFO] [resources:testResources]
[INFO] Using default encoding to copy filtered resources.
[INFO] [compiler:testCompile]
[INFO] No sources to compile
[INFO] [surefire:test]
[INFO] No tests to run.
[INFO] [rar:rar]
[INFO] Copy rar resources to /home/prasad/geronimo/trunk/testsupport/test-deployment-javaee_5/test-rar-javaee_5/target/test-rar-javaee_5-2.0-SNAPSHOT
[INFO] Using ra.xml /home/prasad/geronimo/trunk/testsupport/test-deployment-javaee_5/test-rar-javaee_5/src/main/rar/META-INF/ra.xml
[INFO] Could not find manifest file: /home/prasad/geronimo/trunk/testsupport/test-deployment-javaee_5/test-rar-javaee_5/src/main/rar/META-INF/MANIFEST.MF
- Generating one
[INFO] Building jar: /home/prasad/geronimo/trunk/testsupport/test-deployment-javaee_5/test-rar-javaee_5/target/test-rar-javaee_5-2.0-SNAPSHOT.rar
[INFO] [install:install]
[INFO] Installing /home/prasad/geronimo/trunk/testsupport/test-deployment-javaee_5/test-rar-javaee_5/target/test-rar-javaee_5-2.0-SNAPSHOT.rar
to /home/prasad/.m2/repository/org/apache/geronimo/testsupport/test-rar-javaee_5/2.0-SNAPSHOT/test-rar-javaee_5-2.0-SNAPSHOT.rar
[INFO] ----------------------------------------------------------------------------
[INFO] Building Geronimo Test Support, Test Deployment JAVAEE 5 :: EAR
[INFO]    task-segment: [install]
[INFO] ----------------------------------------------------------------------------
[INFO] [tools:require-java-version {execution: validate-java-version}]
[INFO] [ear:generate-application-xml]
[INFO] Generating application.xml
[INFO] [tools:copy-legal-files {execution: install-legal-files}]
[INFO] Created dir: /home/prasad/geronimo/trunk/testsupport/test-deployment-javaee_5/test-ear-javaee_5/target/classes/META-INF
[INFO] Copying 2 files to /home/prasad/geronimo/trunk/testsupport/test-deployment-javaee_5/test-ear-javaee_5/target/classes/META-INF
[INFO] [resources:resources]
[INFO] Using default encoding to copy filtered resources.
[INFO] [ear:ear]
[INFO] Copying artifact[war:org.apache.geronimo.testsupport:test-war-javaee_5:2.0-SNAPSHOT]
to[web.war]
[INFO] Copying artifact[ejb:org.apache.geronimo.testsupport:test-ejb-javaee_5:2.0-SNAPSHOT]
to[ejb.jar]
[INFO] Copying artifact[rar:org.apache.geronimo.testsupport:test-rar-javaee_5:2.0-SNAPSHOT]
to[rar.rar]
[INFO] Copy ear resources to /home/prasad/geronimo/trunk/testsupport/test-deployment-javaee_5/test-ear-javaee_5/target/test-ear-javaee_5-2.0-SNAPSHOT
[INFO] Could not find manifest file: /home/prasad/geronimo/trunk/testsupport/test-deployment-javaee_5/test-ear-javaee_5/src/main/application/META-INF/MANIFEST.MF
- Generating one
[INFO] Building jar: /home/prasad/geronimo/trunk/testsupport/test-deployment-javaee_5/test-ear-javaee_5/target/test-ear-javaee_5-2.0-SNAPSHOT.ear
[INFO] [install:install]
[INFO] Installing /home/prasad/geronimo/trunk/testsupport/test-deployment-javaee_5/test-ear-javaee_5/target/test-ear-javaee_5-2.0-SNAPSHOT.ear
to /home/prasad/.m2/repository/org/apache/geronimo/testsupport/test-ear-javaee_5/2.0-SNAPSHOT/test-ear-javaee_5-2.0-SNAPSHOT.ear
[INFO] ----------------------------------------------------------------------------
[INFO] Building Geronimo :: Modules
[INFO]    task-segment: [install]
[INFO] ----------------------------------------------------------------------------
[INFO] [tools:require-java-version {execution: validate-java-version}]
[INFO] [tools:copy-legal-files {execution: install-legal-files}]
[INFO] [site:attach-descriptor]
[INFO] [install:install]
[INFO] Installing /home/prasad/geronimo/trunk/modules/pom.xml to /home/prasad/.m2/repository/org/apache/geronimo/modules/modules/2.0-SNAPSHOT/modules-2.0-SNAPSHOT.pom
[INFO] ----------------------------------------------------------------------------
[INFO] Building Geronimo :: Activation
[INFO]    task-segment: [install]
[INFO] ----------------------------------------------------------------------------
[INFO] [tools:require-java-version {execution: validate-java-version}]
[INFO] [tools:copy-legal-files {execution: install-legal-files}]
[INFO] Created dir: /home/prasad/geronimo/trunk/modules/geronimo-activation/target/classes/META-INF
[INFO] Copying 2 files to /home/prasad/geronimo/trunk/modules/geronimo-activation/target/classes/META-INF
[INFO] [resources:resources]
[INFO] Using default encoding to copy filtered resources.
[INFO] snapshot org.apache.geronimo.specs:geronimo-activation_1.1_spec:1.0-SNAPSHOT: checking
for updates from apache-snapshots
[INFO] snapshot org.apache.geronimo.specs:geronimo-activation_1.1_spec:1.0-SNAPSHOT: checking
for updates from axis2-m2-repo
[INFO] snapshot org.apache.geronimo.specs:geronimo-activation_1.1_spec:1.0-SNAPSHOT: checking
for updates from codehaus-snapshots
[INFO] snapshot org.apache.geronimo.specs:geronimo-activation_1.1_spec:1.0-SNAPSHOT: checking
for updates from apache.snapshots
Downloading: http://people.apache.org/repo/m2-snapshot-repository/org/apache/geronimo/specs/geronimo-activation_1.1_spec/1.0-SNAPSHOT/geronimo-activation_1.1_spec-1.0-20061213.201610-3.pom
452/452b
452b downloaded
[INFO] snapshot org.apache.geronimo.javamail:geronimo-javamail_1.4_mail:1.0-SNAPSHOT: checking
for updates from apache-snapshots
[INFO] snapshot org.apache.geronimo.javamail:geronimo-javamail_1.4_mail:1.0-SNAPSHOT: checking
for updates from axis2-m2-repo
[INFO] snapshot org.apache.geronimo.javamail:geronimo-javamail_1.4_mail:1.0-SNAPSHOT: checking
for updates from codehaus-snapshots
[INFO] snapshot org.apache.geronimo.javamail:geronimo-javamail_1.4_mail:1.0-SNAPSHOT: checking
for updates from apache.snapshots
Downloading: http://people.apache.org/repo/m2-snapshot-repository/org/apache/geronimo/javamail/geronimo-javamail_1.4_mail/1.0-SNAPSHOT/geronimo-javamail_1.4_mail-1.0-20061213.042101-3.pom
2/2K
2K downloaded
[INFO] snapshot org.apache.geronimo.javamail:javamail:1.0-SNAPSHOT: checking for updates from
apache-snapshots
[INFO] snapshot org.apache.geronimo.javamail:javamail:1.0-SNAPSHOT: checking for updates from
axis2-m2-repo
[INFO] snapshot org.apache.geronimo.javamail:javamail:1.0-SNAPSHOT: checking for updates from
codehaus-snapshots
[INFO] snapshot org.apache.geronimo.javamail:javamail:1.0-SNAPSHOT: checking for updates from
apache.snapshots
Downloading: http://people.apache.org/repo/m2-snapshot-repository/org/apache/geronimo/javamail/javamail/1.0-SNAPSHOT/javamail-1.0-20061031.223401-5.pom
4/6K
5/6K
6/6K
6K downloaded
[INFO] snapshot org.apache.geronimo.javamail:geronimo-javamail_1.4_provider:1.0-SNAPSHOT:
checking for updates from apache-snapshots
[INFO] snapshot org.apache.geronimo.javamail:geronimo-javamail_1.4_provider:1.0-SNAPSHOT:
checking for updates from axis2-m2-repo
[INFO] snapshot org.apache.geronimo.javamail:geronimo-javamail_1.4_provider:1.0-SNAPSHOT:
checking for updates from codehaus-snapshots
[INFO] snapshot org.apache.geronimo.javamail:geronimo-javamail_1.4_provider:1.0-SNAPSHOT:
checking for updates from apache.snapshots
Downloading: http://people.apache.org/repo/m2-snapshot-repository/org/apache/geronimo/javamail/geronimo-javamail_1.4_provider/1.0-SNAPSHOT/geronimo-javamail_1.4_provider-1.0-20061213.042521-5.pom
880/880b
880b downloaded
[INFO] snapshot org.apache.geronimo.specs:geronimo-javamail_1.4_spec:1.0-SNAPSHOT: checking
for updates from apache-snapshots
[INFO] snapshot org.apache.geronimo.specs:geronimo-javamail_1.4_spec:1.0-SNAPSHOT: checking
for updates from axis2-m2-repo
[INFO] snapshot org.apache.geronimo.specs:geronimo-javamail_1.4_spec:1.0-SNAPSHOT: checking
for updates from codehaus-snapshots
[INFO] snapshot org.apache.geronimo.specs:geronimo-javamail_1.4_spec:1.0-SNAPSHOT: checking
for updates from apache.snapshots
Downloading: http://people.apache.org/repo/m2-snapshot-repository/org/apache/geronimo/specs/geronimo-javamail_1.4_spec/1.0-SNAPSHOT/geronimo-javamail_1.4_spec-1.0-20061213.201610-4.pom
697/697b
697b downloaded
Downloading: http://people.apache.org/repo/m2-snapshot-repository/org/apache/geronimo/javamail/geronimo-javamail_1.4_mail/1.0-SNAPSHOT/geronimo-javamail_1.4_mail-1.0-20061213.042101-3.jar
4/297K
8/297K
9/297K
10/297K
12/297K
13/297K
14/297K
16/297K
17/297K
18/297K
20/297K
21/297K
22/297K
24/297K
25/297K
26/297K
28/297K
29/297K
30/297K
32/297K
33/297K
36/297K
37/297K
38/297K
40/297K
41/297K
42/297K
44/297K
45/297K
46/297K
48/297K
49/297K
50/297K
52/297K
53/297K
54/297K
56/297K
57/297K
58/297K
60/297K
61/297K
62/297K
64/297K
66/297K
68/297K
69/297K
70/297K
72/297K
73/297K
74/297K
76/297K
77/297K
78/297K
80/297K
81/297K
82/297K
85/297K
86/297K
88/297K
89/297K
90/297K
93/297K
94/297K
96/297K
97/297K
98/297K
100/297K
101/297K
102/297K
104/297K
105/297K
106/297K
108/297K
109/297K
110/297K
113/297K
114/297K
116/297K
117/297K
118/297K
120/297K
121/297K
122/297K
124/297K
125/297K
126/297K
128/297K
129/297K
130/297K
132/297K
133/297K
134/297K
136/297K
138/297K
140/297K
141/297K
142/297K
144/297K
145/297K
146/297K
148/297K
149/297K
150/297K
152/297K
153/297K
154/297K
156/297K
157/297K
158/297K
160/297K
161/297K
162/297K
164/297K
165/297K
166/297K
168/297K
169/297K
170/29
 7K
172/297K
173/297K
174/297K
176/297K
177/297K
178/297K
180/297K
181/297K
182/297K
184/297K
185/297K
186/297K
188/297K
189/297K
190/297K
192/297K
193/297K
194/297K
196/297K
197/297K
198/297K
200/297K
201/297K
202/297K
204/297K
205/297K
206/297K
208/297K
209/297K
210/297K
212/297K
213/297K
214/297K
216/297K
217/297K
218/297K
220/297K
221/297K
222/297K
224/297K
225/297K
226/297K
228/297K
229/297K
230/297K
232/297K
233/297K
236/297K
237/297K
238/297K
240/297K
241/297K
242/297K
244/297K
245/297K
246/297K
248/297K
249/297K
250/297K
252/297K
253/297K
254/297K
256/297K
257/297K
258/297K
260/297K
261/297K
262/297K
264/297K
265/297K
266/297K
268/297K
269/297K
270/297K
272/297K
273/297K
274/297K
277/297K
278/297K
280/297K
281/297K
284/297K
285/297K
286/297K
288/297K
289/297K
290/297K
292/297K
293/297K
294/297K
296/297K
297/297K
297/297K
297K
downloaded
Downloading: http://people.apache.org/repo/m2-snapshot-repository/org/apache/geronimo/specs/geronimo-javamail_1.4_spec/1.0-SNAPSHOT/geronimo-javamail_1.4_spec-1.0-20061213.201610-4.jar
4/189K
8/189K
10/189K
12/189K
13/189K
14/189K
16/189K
17/189K
18/189K
20/189K
21/189K
22/189K
24/189K
25/189K
26/189K
28/189K
29/189K
30/189K
32/189K
33/189K
34/189K
37/189K
38/189K
40/189K
41/189K
42/189K
44/189K
45/189K
46/189K
48/189K
49/189K
50/189K
52/189K
53/189K
54/189K
56/189K
58/189K
60/189K
61/189K
62/189K
64/189K
66/189K
68/189K
69/189K
70/189K
72/189K
73/189K
74/189K
76/189K
77/189K
78/189K
80/189K
81/189K
82/189K
84/189K
85/189K
88/189K
89/189K
90/189K
92/189K
93/189K
94/189K
96/189K
97/189K
98/189K
100/189K
101/189K
102/189K
104/189K
105/189K
106/189K
108/189K
109/189K
110/189K
112/189K
113/189K
114/189K
116/189K
117/189K
118/189K
120/189K
121/189K
122/189K
124/189K
125/189K
126/189K
128/189K
130/189K
132/189K
134/189K
136/189K
137/189K
138/189K
140/189K
141/189K
142/189K
144/189K
145/189K
146/189K
148/189K
149/189K
150/189K
152/189K
153/189K
154/189K
156/189K
157/189K
158/189K
160/189K
161/189K
162/189K
164/189K
165/189K
166/189K
168/189K
169/189K
170/189K
172/
 189K
173/189K
174/189K
176/189K
177/189K
178/189K
180/189K
181/189K
182/189K
184/189K
185/189K
186/189K
189/189K
189K
downloaded
Downloading: http://people.apache.org/repo/m2-snapshot-repository/org/apache/geronimo/specs/geronimo-activation_1.1_spec/1.0-SNAPSHOT/geronimo-activation_1.1_spec-1.0-20061213.201610-3.jar
4/33K
8/33K
9/33K
10/33K
12/33K
13/33K
14/33K
16/33K
17/33K
18/33K
20/33K
21/33K
22/33K
24/33K
25/33K
26/33K
28/33K
29/33K
30/33K
32/33K
33/33K
33K
downloaded
Downloading: http://people.apache.org/repo/m2-snapshot-repository/org/apache/geronimo/javamail/geronimo-javamail_1.4_provider/1.0-SNAPSHOT/geronimo-javamail_1.4_provider-1.0-20061213.042521-5.jar
3/109K
5/109K
8/109K
9/109K
10/109K
12/109K
13/109K
14/109K
16/109K
17/109K
18/109K
20/109K
21/109K
22/109K
24/109K
26/109K
28/109K
29/109K
30/109K
32/109K
33/109K
34/109K
36/109K
37/109K
38/109K
40/109K
41/109K
42/109K
44/109K
45/109K
48/109K
49/109K
50/109K
52/109K
53/109K
56/109K
57/109K
58/109K
60/109K
61/109K
62/109K
64/109K
65/109K
66/109K
68/109K
70/109K
72/109K
73/109K
74/109K
76/109K
77/109K
78/109K
80/109K
81/109K
82/109K
84/109K
85/109K
86/109K
88/109K
89/109K
90/109K
92/109K
93/109K
94/109K
96/109K
97/109K
98/109K
100/109K
101/109K
102/109K
104/109K
105/109K
108/109K
109/109K
109K
downloaded
[INFO] [compiler:compile]
Compiling 8 source files to /home/prasad/geronimo/trunk/modules/geronimo-activation/target/classes
[INFO] [resources:testResources]
[INFO] Using default encoding to copy filtered resources.
Downloading: http://people.apache.org/repo/m2-snapshot-repository/org/apache/geronimo/javamail/geronimo-javamail_1.4_mail/1.0-SNAPSHOT/geronimo-javamail_1.4_mail-1.0-20061213.042101-3.pom
2/2K
2K downloaded
[INFO] [compiler:testCompile]
Compiling 4 source files to /home/prasad/geronimo/trunk/modules/geronimo-activation/target/test-classes
[INFO] [surefire:test]
Downloading: http://repository.codehaus.org/org/codehaus/plexus/plexus-utils/1.1/plexus-utils-1.1.jar
[WARNING] Unable to get resource from repository codehaus (http://repository.codehaus.org)
Downloading: http://repo1.maven.org/maven2/org/codehaus/plexus/plexus-utils/1.1/plexus-utils-1.1.jar
3/164K
5/164K
6/164K
9/164K
10/164K
11/164K
13/164K
14/164K
15/164K
18/164K
19/164K
22/164K
25/164K
26/164K
27/164K
29/164K
30/164K
31/164K
33/164K
34/164K
35/164K
37/164K
38/164K
39/164K
41/164K
42/164K
43/164K
45/164K
46/164K
47/164K
49/164K
50/164K
51/164K
53/164K
54/164K
55/164K
57/164K
58/164K
59/164K
61/164K
62/164K
63/164K
65/164K
66/164K
67/164K
69/164K
70/164K
73/164K
74/164K
75/164K
77/164K
78/164K
81/164K
82/164K
83/164K
85/164K
86/164K
87/164K
89/164K
90/164K
91/164K
94/164K
95/164K
97/164K
98/164K
99/164K
101/164K
102/164K
103/164K
105/164K
106/164K
107/164K
109/164K
110/164K
111/164K
113/164K
114/164K
115/164K
117/164K
118/164K
119/164K
121/164K
122/164K
123/164K
125/164K
126/164K
127/164K
130/164K
131/164K
133/164K
134/164K
135/164K
137/164K
138/164K
139/164K
141/164K
142/164K
143/164K
146/164K
147/164K
149/164K
150/164K
151/164K
153/164K
154/164K
156/164K
157/164K
158/164K
160/164K
161/164K
162/164K
164/164K
164/164K
164K
downloaded
Downloading: http://repository.codehaus.org/org/apache/maven/surefire/surefire-junit/2.0/surefire-junit-2.0.pom
[WARNING] Unable to get resource from repository codehaus (http://repository.codehaus.org)
Downloading: http://repo1.maven.org/maven2/org/apache/maven/surefire/surefire-junit/2.0/surefire-junit-2.0.pom
583/583b
583b downloaded
Downloading: http://repository.codehaus.org/org/apache/maven/surefire/surefire-providers/2.0/surefire-providers-2.0.pom
[WARNING] Unable to get resource from repository codehaus (http://repository.codehaus.org)
Downloading: http://repo1.maven.org/maven2/org/apache/maven/surefire/surefire-providers/2.0/surefire-providers-2.0.pom
1/1K
1K downloaded
Downloading: http://repository.codehaus.org/org/apache/maven/surefire/surefire-junit/2.0/surefire-junit-2.0.jar
[WARNING] Unable to get resource from repository codehaus (http://repository.codehaus.org)
Downloading: http://repo1.maven.org/maven2/org/apache/maven/surefire/surefire-junit/2.0/surefire-junit-2.0.jar
1/11K
2/11K
4/11K
5/11K
6/11K
8/11K
9/11K
10/11K
11/11K
11K downloaded
[INFO] Surefire report directory: /home/prasad/geronimo/trunk/modules/geronimo-activation/target/surefire-reports
Warning: -enableassertions not understood. Ignoring.
org.apache.maven.surefire.booter.SurefireExecutionException: while resolving class: org.apache.geronimo.testsupport.TestSupport;
nested exception is java.lang.NoClassDefFoundError: while resolving class: org.apache.geronimo.testsupport.TestSupport
java.lang.NoClassDefFoundError: while resolving class: org.apache.geronimo.testsupport.TestSupport
   at java.lang.VMClassLoader.resolveClass(java.lang.Class) (/usr/lib/libgcj.so.5.0.0)
   at _Jv_PrepareClass(java.lang.Class) (/usr/lib/libgcj.so.5.0.0)
   at _Jv_WaitForState(java.lang.Class, int) (/usr/lib/libgcj.so.5.0.0)
   at java.lang.VMClassLoader.linkClass0(java.lang.Class) (/usr/lib/libgcj.so.5.0.0)
   at java.lang.VMClassLoader.resolveClass(java.lang.Class) (/usr/lib/libgcj.so.5.0.0)
   at _Jv_PrepareClass(java.lang.Class) (/usr/lib/libgcj.so.5.0.0)
   at _Jv_WaitForState(java.lang.Class, int) (/usr/lib/libgcj.so.5.0.0)
   at java.lang.VMClassLoader.linkClass0(java.lang.Class) (/usr/lib/libgcj.so.5.0.0)
   at java.lang.VMClassLoader.resolveClass(java.lang.Class) (/usr/lib/libgcj.so.5.0.0)
   at java.lang.Class.initializeClass() (/usr/lib/libgcj.so.5.0.0)
   at java.lang.Class.isAssignableFrom(java.lang.Class) (/usr/lib/libgcj.so.5.0.0)
   at org.apache.maven.surefire.junit.JUnitDirectoryTestSuite.createTestSet(java.lang.Class,
java.lang.ClassLoader) (Unknown Source)
   at org.apache.maven.surefire.suite.AbstractDirectoryTestSuite.locateTestSets(java.lang.ClassLoader)
(Unknown Source)
   at org.apache.maven.surefire.Surefire.createSuiteFromDefinition(java.lang.Object[], java.lang.ClassLoader,
java.lang.ClassLoader) (Unknown Source)
   at org.apache.maven.surefire.Surefire.run(java.util.List, java.util.List, java.lang.ClassLoader,
java.lang.ClassLoader) (Unknown Source)
   at _Jv_CallAnyMethodA(java.lang.Object, java.lang.Class, _Jv_Method, boolean, boolean,
java.lang.Class[], jvalue, jvalue, boolean) (/usr/lib/libgcj.so.5.0.0)
   at _Jv_CallAnyMethodA(java.lang.Object, java.lang.Class, _Jv_Method, boolean, java.lang.Class[],
java.lang.Object[]) (/usr/lib/libgcj.so.5.0.0)
   at java.lang.reflect.Method.invoke(java.lang.Object, java.lang.Object[]) (/usr/lib/libgcj.so.5.0.0)
   at org.apache.maven.surefire.booter.SurefireBooter.runSuitesInProcess() (Unknown Source)
   at org.apache.maven.surefire.booter.SurefireBooter.main(java.lang.String[]) (Unknown Source)
Caused by: java.lang.ClassNotFoundException: java.lang.StringBuilder not found in [file:/home/prasad/geronimo/trunk/modules/geronimo-activation/target/classes/,
file:/home/prasad/geronimo/trunk/modules/geronimo-activation/target/test-classes/, file:/home/prasad/.m2/repository/org/apache/geronimo/javamail/geronimo-javamail_1.4_provider/1.0-SNAPSHOT/geronimo-javamail_1.4_provider-1.0-SNAPSHOT.jar,
file:/home/prasad/.m2/repository/junit/junit/3.8.1/junit-3.8.1.jar, file:/home/prasad/.m2/repository/org/apache/geronimo/javamail/geronimo-javamail_1.4_mail/1.0-SNAPSHOT/geronimo-javamail_1.4_mail-1.0-SNAPSHOT.jar,
file:/home/prasad/.m2/repository/org/apache/geronimo/specs/geronimo-javamail_1.4_spec/1.0-SNAPSHOT/geronimo-javamail_1.4_spec-1.0-SNAPSHOT.jar,
file:/home/prasad/.m2/repository/xmlbeans/xbean/2.0.0/xbean-2.0.0.jar, file:/home/prasad/.m2/repository/commons-logging/commons-logging/1.0.4/commons-logging-1.0.4.jar,
file:/home/prasad/.m2/repository/org/apache/geronimo/specs/gero
 nimo-activation_1.1_spec/1.0-SNAPSHOT/geronimo-activation_1.1_spec-1.0-SNAPSHOT.jar, file:/home/prasad/geronimo/trunk/testsupport/testsupport-common/target/testsupport-common-2.0-SNAPSHOT.jar,
file:/home/prasad/.m2/repository/stax/stax-api/1.0.1/stax-api-1.0.1.jar, file:/home/prasad/.m2/repository/log4j/log4j/1.2.14/log4j-1.2.14.jar,
file:/home/prasad/.m2/repository/org/apache/geronimo/genesis/config/logging-config/1.1/logging-config-1.1.jar]
   at java.net.URLClassLoader.findClass(java.lang.String) (/usr/lib/libgcj.so.5.0.0)
   at java.lang.ClassLoader.loadClass(java.lang.String, boolean) (/usr/lib/libgcj.so.5.0.0)
   at _Jv_FindClass(_Jv_Utf8Const, java.lang.ClassLoader) (/usr/lib/libgcj.so.5.0.0)
   at java.lang.Class.forName(java.lang.String, boolean, java.lang.ClassLoader) (/usr/lib/libgcj.so.5.0.0)
   at _Jv_BytecodeVerifier.verify_instructions_0() (/usr/lib/libgcj.so.5.0.0)
   at _Jv_VerifyMethod(_Jv_InterpMethod) (/usr/lib/libgcj.so.5.0.0)
   at _Jv_PrepareClass(java.lang.Class) (/usr/lib/libgcj.so.5.0.0)
   at _Jv_WaitForState(java.lang.Class, int) (/usr/lib/libgcj.so.5.0.0)
   at java.lang.VMClassLoader.linkClass0(java.lang.Class) (/usr/lib/libgcj.so.5.0.0)
   at java.lang.VMClassLoader.resolveClass(java.lang.Class) (/usr/lib/libgcj.so.5.0.0)
   ...19 more
[INFO] ------------------------------------------------------------------------
[ERROR] BUILD FAILURE
[INFO] ------------------------------------------------------------------------
[INFO] There are test failures.
[INFO] ------------------------------------------------------------------------
[INFO] For more information, run Maven with the -e switch
[INFO] ------------------------------------------------------------------------
[INFO] Total time: 1 minute 25 seconds
[INFO] Finished at: Sat Feb 10 05:03:00 EST 2007
[INFO] Final Memory: 51M/146M
[INFO] ------------------------------------------------------------------------

Mime
View raw message