geronimo-scm mailing list archives

Site index · List index
Message view « Date » · « Thread »
Top « Date » · « Thread »
From continuum <contin...@stan.gbuild.org>
Subject [continuum] BUILD FAILURE: Geronimo
Date Mon, 29 May 2006 18:17:17 GMT
Online report : http://ci.gbuild.org/continuum/servlet/continuum/target/ProjectBuild.vm/view/ProjectBuild/id/1/buildId/3634
Build statistics:
  State: Failed
  Previous State: Failed
  Started at: Mon, 29 May 2006 11:15:39 -0700
  Finished at: Mon, 29 May 2006 11:17:14 -0700
  Total time: 1m 35s
  Build Trigger: Forced
  Exit code: 70
  Building machine hostname: stan.gbuild.org
  Operating system : Linux(unknown)
  Java version : 1.4.2_08(Sun Microsystems Inc.)

Changes
      No files changed
  
****************************************************************************
Output:
****************************************************************************
 __  __
|  \/  |__ _Apache__ ___
| |\/| / _` \ V / -_) ' \  ~ intelligent projects ~
|_|  |_\__,_|\_/\___|_||_|  v. 1.1-beta-2

DEPRECATED: the default goal should be specified in the <build> section of project.xml
instead of maven.xml
DEPRECATED: the default goal should be specified in the <build> section of project.xml
instead of maven.xml
build:start:

clean:clean:
modules:clean:
modules:reactor:init:

    [echo] +----------------------------------------
    [echo] | Cleaning: applications/console-core 
    [echo] +----------------------------------------
    [echo] 
    [echo] +----------------------------------------
    [echo] | Cleaning: applications/console-ear 
    [echo] +----------------------------------------
    [echo] 
    [echo] +----------------------------------------
    [echo] | Cleaning: applications/console-framework 
    [echo] +----------------------------------------
    [echo] 
    [echo] +----------------------------------------
    [echo] | Cleaning: applications/console-standard 
    [echo] +----------------------------------------
    [echo] 
    [echo] +----------------------------------------
    [echo] | Cleaning: applications/demo 
    [echo] +----------------------------------------
    [echo] 
    [echo] +----------------------------------------
    [echo] | Cleaning: applications/ldap-realm-demo 
    [echo] +----------------------------------------
    [echo] 
    [echo] +----------------------------------------
    [echo] | Cleaning: applications/magicGball 
    [echo] +----------------------------------------
    [echo] 
    [echo] +----------------------------------------
    [echo] | Cleaning: applications/remote-deploy-lib 
    [echo] +----------------------------------------
    [echo] 
    [echo] +----------------------------------------
    [echo] | Cleaning: applications/remote-deploy 
    [echo] +----------------------------------------
    [echo] 
    [echo] +----------------------------------------
    [echo] | Cleaning: applications/uddi-db 
    [echo] +----------------------------------------
    [echo] 
    [echo] +----------------------------------------
    [echo] | Cleaning: applications/uddi-server 
    [echo] +----------------------------------------
    [echo] 
    [echo] +----------------------------------------
    [echo] | Cleaning: applications/welcome 
    [echo] +----------------------------------------
    [echo] 
    [echo] +----------------------------------------
    [echo] | Cleaning: modules/activation 
    [echo] +----------------------------------------
    [delete] Deleting directory /home/continuum/continuum-1.0.2/apps/continuum/work/1/modules/activation/target
    [echo] 
    [echo] +----------------------------------------
    [echo] | Cleaning: modules/activemq-embedded-rar 
    [echo] +----------------------------------------
    [delete] Deleting directory /home/continuum/continuum-1.0.2/apps/continuum/work/1/modules/activemq-embedded-rar/target
    [echo] 
    [echo] +----------------------------------------
    [echo] | Cleaning: modules/axis-builder 
    [echo] +----------------------------------------
    [echo] 
    [echo] +----------------------------------------
    [echo] | Cleaning: modules/axis 
    [echo] +----------------------------------------
    [echo] 
    [echo] +----------------------------------------
    [echo] | Cleaning: modules/client-builder 
    [echo] +----------------------------------------
    [echo] 
    [echo] +----------------------------------------
    [echo] | Cleaning: modules/client 
    [echo] +----------------------------------------
    [echo] 
    [echo] +----------------------------------------
    [echo] | Cleaning: modules/common 
    [echo] +----------------------------------------
    [delete] Deleting directory /home/continuum/continuum-1.0.2/apps/continuum/work/1/modules/common/target
    [echo] 
    [echo] +----------------------------------------
    [echo] | Cleaning: modules/connector-builder 
    [echo] +----------------------------------------
    [echo] 
    [echo] +----------------------------------------
    [echo] | Cleaning: modules/connector 
    [echo] +----------------------------------------
    [echo] 
    [echo] +----------------------------------------
    [echo] | Cleaning: modules/console-web 
    [echo] +----------------------------------------
    [echo] 
    [echo] +----------------------------------------
    [echo] | Cleaning: modules/converter 
    [echo] +----------------------------------------
    [echo] 
    [echo] +----------------------------------------
    [echo] | Cleaning: modules/core 
    [echo] +----------------------------------------
    [echo] 
    [echo] +----------------------------------------
    [echo] | Cleaning: modules/deploy-config 
    [echo] +----------------------------------------
    [echo] 
    [echo] +----------------------------------------
    [echo] | Cleaning: modules/deploy-jsr88 
    [echo] +----------------------------------------
    [echo] 
    [echo] +----------------------------------------
    [echo] | Cleaning: modules/deploy-tool 
    [echo] +----------------------------------------
    [echo] 
    [echo] +----------------------------------------
    [echo] | Cleaning: modules/deployment 
    [echo] +----------------------------------------
    [echo] 
    [echo] +----------------------------------------
    [echo] | Cleaning: modules/derby 
    [echo] +----------------------------------------
    [echo] 
    [echo] +----------------------------------------
    [echo] | Cleaning: modules/directory 
    [echo] +----------------------------------------
    [echo] 
    [echo] +----------------------------------------
    [echo] | Cleaning: modules/hot-deploy 
    [echo] +----------------------------------------
    [echo] 
    [echo] +----------------------------------------
    [echo] | Cleaning: modules/installer-processing 
    [echo] +----------------------------------------
    [echo] 
    [echo] +----------------------------------------
    [echo] | Cleaning: modules/installer-support 
    [echo] +----------------------------------------
    [echo] 
    [echo] +----------------------------------------
    [echo] | Cleaning: modules/j2ee-builder 
    [echo] +----------------------------------------
    [echo] 
    [echo] +----------------------------------------
    [echo] | Cleaning: modules/j2ee-schema 
    [echo] +----------------------------------------
    [echo] 
    [echo] +----------------------------------------
    [echo] | Cleaning: modules/j2ee 
    [echo] +----------------------------------------
    [echo] 
    [echo] +----------------------------------------
    [echo] | Cleaning: modules/javamail-transport 
    [echo] +----------------------------------------
    [echo] 
    [echo] +----------------------------------------
    [echo] | Cleaning: modules/jetty-builder 
    [echo] +----------------------------------------
    [echo] 
    [echo] +----------------------------------------
    [echo] | Cleaning: modules/jetty 
    [echo] +----------------------------------------
    [echo] 
    [echo] +----------------------------------------
    [echo] | Cleaning: modules/jmx-remoting 
    [echo] +----------------------------------------
    [echo] 
    [echo] +----------------------------------------
    [echo] | Cleaning: modules/kernel 
    [echo] +----------------------------------------
    [delete] Deleting directory /home/continuum/continuum-1.0.2/apps/continuum/work/1/modules/kernel/target
    [echo] 
    [echo] +----------------------------------------
    [echo] | Cleaning: modules/mail 
    [echo] +----------------------------------------
    [echo] 
    [echo] +----------------------------------------
    [echo] | Cleaning: modules/management 
    [echo] +----------------------------------------
    [echo] 
    [echo] +----------------------------------------
    [echo] | Cleaning: modules/naming-builder 
    [echo] +----------------------------------------
    [echo] 
    [echo] +----------------------------------------
    [echo] | Cleaning: modules/naming 
    [echo] +----------------------------------------
    [echo] 
    [echo] +----------------------------------------
    [echo] | Cleaning: modules/scripts 
    [echo] +----------------------------------------
    [echo] 
    [echo] +----------------------------------------
    [echo] | Cleaning: modules/security-builder 
    [echo] +----------------------------------------
    [echo] 
    [echo] +----------------------------------------
    [echo] | Cleaning: modules/security 
    [echo] +----------------------------------------
    [echo] 
    [echo] +----------------------------------------
    [echo] | Cleaning: modules/service-builder 
    [echo] +----------------------------------------
    [echo] 
    [echo] +----------------------------------------
    [echo] | Cleaning: modules/system 
    [echo] +----------------------------------------
    [delete] Deleting directory /home/continuum/continuum-1.0.2/apps/continuum/work/1/modules/system/target
    [echo] 
    [echo] +----------------------------------------
    [echo] | Cleaning: modules/test-ddbean 
    [echo] +----------------------------------------
    [echo] 
    [echo] +----------------------------------------
    [echo] | Cleaning: modules/timer 
    [echo] +----------------------------------------
    [echo] 
    [echo] +----------------------------------------
    [echo] | Cleaning: modules/tomcat-builder 
    [echo] +----------------------------------------
    [echo] 
    [echo] +----------------------------------------
    [echo] | Cleaning: modules/tomcat 
    [echo] +----------------------------------------
    [echo] 
    [echo] +----------------------------------------
    [echo] | Cleaning: modules/transaction 
    [echo] +----------------------------------------
    [echo] 
    [echo] +----------------------------------------
    [echo] | Cleaning: modules/upgrade 
    [echo] +----------------------------------------
    [echo] 
    [echo] +----------------------------------------
    [echo] | Cleaning: modules/util 
    [echo] +----------------------------------------
    [delete] Deleting directory /home/continuum/continuum-1.0.2/apps/continuum/work/1/modules/util/target
    [echo] 
    [echo] +----------------------------------------
    [echo] | Cleaning: modules/web-builder 
    [echo] +----------------------------------------
    [echo] 
    [echo] +----------------------------------------
    [echo] | Cleaning: modules/webservices 
    [echo] +----------------------------------------
    [echo] 
    [echo] +----------------------------------------
    [echo] | Cleaning: plugins/geronimo-assembly-plugin 
    [echo] +----------------------------------------
    [echo] 
    [echo] +----------------------------------------
    [echo] | Cleaning: plugins/geronimo-dependency-plugin 
    [echo] +----------------------------------------
    [echo] 
    [echo] +----------------------------------------
    [echo] | Cleaning: plugins/geronimo-deployment-plugin 
    [echo] +----------------------------------------
    [echo] 
    [echo] +----------------------------------------
    [echo] | Cleaning: plugins/geronimo-izpack-plugin 
    [echo] +----------------------------------------
    [echo] 
    [echo] +----------------------------------------
    [echo] | Cleaning: plugins/geronimo-packaging-plugin 
    [echo] +----------------------------------------
    [echo] 
    [echo] +----------------------------------------
    [echo] | Cleaning: target/geronimo-1.2-SNAPSHOT 
    [echo] +----------------------------------------

xdoc:clean:

Starting the reactor...
Our processing order:
Geronimo :: Activation
Geronimo :: ActiveMQ Embedded RAR
Geronimo :: Kernel
Geronimo :: Common
Geronimo :: Util
Geronimo :: System
Geronimo :: Deployment
Geronimo :: Deploy :: Common Config
Geronimo :: Management API
Geronimo :: Core
Geronimo :: J2EE
Geronimo :: J2EE Schema
Geronimo :: Service :: Builder
Geronimo :: Maven Dependency Plugin
Geronimo :: Naming
Geronimo :: Security
Geronimo :: Web Services
Geronimo :: Axis
Geronimo :: Test :: DDBeans
Geronimo :: Transaction
Geronimo :: Connector
Geronimo :: Security :: Builder
Geronimo :: J2EE
Geronimo :: Naming :: Builder
Geronimo :: Connector :: Builder
Geronimo :: Axis :: Builder
Geronimo :: Client
Geronimo :: Client Builder
Geronimo :: Console Web
Geronimo :: Configuration Converter
Geronimo :: Web :: Builder
Geronimo :: Deploy :: JSR-88
Geronimo :: Deploy :: CLI Tool
Geronimo :: Derby
Geronimo :: Directory
Geronimo :: Deploy :: Hot Deployer
Geronimo :: Installer Processing
Geronimo :: Installer Support
Geronimo :: JavaMail Transport
Geronimo :: Jetty
Geronimo :: Jetty :: Builder
Geronimo :: JMX Remoting
Geronimo :: Mail
Geronimo :: Scripts
Geronimo :: Timer
Geronimo :: Tomcat
Geronimo :: Tomcat :: Builder
Geronimo :: Upgrade
Geronimo :: Maven Assembly Plugin
Geronimo :: Maven Deployment Plugin
Geronimo :: IZPack Installer Build Plugin
Geronimo :: Maven Packaging Plugin
+----------------------------------------
| geronimo and geronimo-plugins Geronimo :: Activation
| Memory: 7M/12M
+----------------------------------------
DEPRECATED: the default goal should be specified in the <build> section of project.xml
instead of maven.xml

clean:

new1:
Attempting to download geronimo-javamail_1.3.1_spec-1.1-SNAPSHOT.jar.
build:start:

multiproject:install-callback:
    [echo] Running jar:install for Geronimo :: Activation
Attempting to download geronimo-common-1.1-SNAPSHOT.jar.
Attempting to download geronimo-kernel-1.1-SNAPSHOT.jar.
Attempting to download geronimo-deployment-1.1-SNAPSHOT.jar.
Attempting to download geronimo-deploy-jsr88-1.1-SNAPSHOT.jar.
Attempting to download geronimo-system-1.1-SNAPSHOT.jar.
java:prepare-filesystem:
    [mkdir] Created dir: /home/continuum/continuum-1.0.2/apps/continuum/work/1/modules/activation/target/classes

java:compile:
<depend closure="false" srcdir="1.4" dump="false" destdir="/home/continuum/continuum-1.0.2/apps/continuum/work/1/modules/activation/target/classes"></depend>
   [echo] Compiling to /home/continuum/continuum-1.0.2/apps/continuum/work/1/modules/activation/target/classes
    [javac] Compiling 8 source files to /home/continuum/continuum-1.0.2/apps/continuum/work/1/modules/activation/target/classes

java:jar-resources:
Copying 1 file to /home/continuum/continuum-1.0.2/apps/continuum/work/1/modules/activation/target/classes

test:prepare-filesystem:
    [mkdir] Created dir: /home/continuum/continuum-1.0.2/apps/continuum/work/1/modules/activation/target/test-classes
    [mkdir] Created dir: /home/continuum/continuum-1.0.2/apps/continuum/work/1/modules/activation/target/test-reports

test:test-resources:

test:compile:
    [javac] Compiling 5 source files to /home/continuum/continuum-1.0.2/apps/continuum/work/1/modules/activation/target/test-classes

test:test:
    [junit] Running org.apache.geronimo.activation.handlers.MailcapTest
    [junit] Tests run: 1, Failures: 0, Errors: 0, Time elapsed: 0.407 sec
    [junit] Running org.apache.geronimo.activation.handlers.TextHtmlTest
    [junit] Tests run: 3, Failures: 0, Errors: 0, Time elapsed: 0.027 sec
    [junit] Running org.apache.geronimo.activation.handlers.TextPlainTest
    [junit] Tests run: 3, Failures: 0, Errors: 0, Time elapsed: 0.024 sec
    [junit] Running org.apache.geronimo.activation.handlers.TextXmlTest
    [junit] Tests run: 3, Failures: 0, Errors: 0, Time elapsed: 0.011 sec
Running post goal: test:test
    [touch] Creating /home/continuum/continuum-1.0.2/apps/continuum/work/1/modules/activation/target/test-reports/tstamp

jar:jar:
    [jar] Building jar: /home/continuum/continuum-1.0.2/apps/continuum/work/1/modules/activation/target/geronimo-activation-1.2-SNAPSHOT.jar

jar:install:
    [echo] Installing...
Uploading to geronimo/jars/geronimo-activation-1.2-SNAPSHOT.jar: 
.................... (13K)
Uploading to geronimo/poms/geronimo-activation-1.2-SNAPSHOT.pom: 
.................... (10K)

+----------------------------------------
| geronimo and geronimo-plugins Geronimo :: ActiveMQ Embedded RAR
| Memory: 10M/16M
+----------------------------------------
DEPRECATED: the default goal should be specified in the <build> section of project.xml
instead of maven.xml
DEPRECATED: the default goal should be specified in the <build> section of project.xml
instead of maven.xml

build:end:

Attempting to download activemq-core-3.2.4-SNAPSHOT.jar.
Attempting to download activemq-ra-3.2.4-SNAPSHOT.jar.
build:start:

multiproject:install-callback:
    [echo] Running rar:install for Geronimo :: ActiveMQ Embedded RAR
rar:init:
    [mkdir] Created dir: /home/continuum/continuum-1.0.2/apps/continuum/work/1/modules/activemq-embedded-rar/target

rar:rar:
    [echo] Building rar ge-activemq-rar-1.2-SNAPSHOT with ra.xml "/home/continuum/continuum-1.0.2/apps/continuum/work/1/modules/activemq-embedded-rar/src/rar/META-INF/ra.xml"
    [echo] trying to include /home/continuum/continuum-1.0.2/apps/continuum/work/1/modules/activemq-embedded-rar/target/ge-activemq-rar-1.2-SNAPSHOT.jar
    [echo] Bundling: jar - activemq:activemq-core
    [echo] Bundling: jar - activemq:activemq-ra
    [mkdir] Created dir: /home/continuum/continuum-1.0.2/apps/continuum/work/1/modules/activemq-embedded-rar/target/rar
    [jar] Building jar: /home/continuum/continuum-1.0.2/apps/continuum/work/1/modules/activemq-embedded-rar/target/ge-activemq-rar-1.2-SNAPSHOT.rar

rar:install:
    [echo] Installing...
Uploading to geronimo/rars/ge-activemq-rar-1.2-SNAPSHOT.rar: 
.................... (949K)
Uploading to geronimo/poms/ge-activemq-rar-1.2-SNAPSHOT.pom: 
.................... (11K)

+----------------------------------------
| geronimo and geronimo-plugins Geronimo :: Kernel
| Memory: 10M/16M
+----------------------------------------
DEPRECATED: the default goal should be specified in the <build> section of project.xml
instead of maven.xml
DEPRECATED: the default goal should be specified in the <build> section of project.xml
instead of maven.xml

build:end:

build:start:

multiproject:install-callback:
    [echo] Running jar:install for Geronimo :: Kernel
Tag library requested that is not present: 'xmlbeans2:maven' in plugin: 'null'
java:prepare-filesystem:
    [mkdir] Created dir: /home/continuum/continuum-1.0.2/apps/continuum/work/1/modules/kernel/target/classes

java:compile:
<depend closure="false" srcdir="1.4" dump="false" destdir="/home/continuum/continuum-1.0.2/apps/continuum/work/1/modules/kernel/target/classes"></depend>
   [echo] Compiling to /home/continuum/continuum-1.0.2/apps/continuum/work/1/modules/kernel/target/classes
    [javac] Compiling 175 source files to /home/continuum/continuum-1.0.2/apps/continuum/work/1/modules/kernel/target/classes
    [javac] Note: Some input files use or override a deprecated API.
    [javac] Note: Recompile with -deprecation for details.

java:jar-resources:

test:prepare-filesystem:
    [mkdir] Created dir: /home/continuum/continuum-1.0.2/apps/continuum/work/1/modules/kernel/target/test-classes
    [mkdir] Created dir: /home/continuum/continuum-1.0.2/apps/continuum/work/1/modules/kernel/target/test-reports

test:test-resources:
Copying 2 files to /home/continuum/continuum-1.0.2/apps/continuum/work/1/modules/kernel/target/test-classes

test:compile:
    [javac] Compiling 28 source files to /home/continuum/continuum-1.0.2/apps/continuum/work/1/modules/kernel/target/test-classes

test:test:
    [junit] Running org.apache.geronimo.kernel.repository.ArtifactResolverTest
    [junit] Tests run: 4, Failures: 0, Errors: 0, Time elapsed: 0.382 sec
    [junit] Tests run: 9, Failures: 0, Errors: 0, Time elapsed: 0.028 sec
    [junit] Tests run: 4, Failures: 0, Errors: 0, Time elapsed: 0.485 sec
    [junit] Tests run: 1, Failures: 0, Errors: 0, Time elapsed: 0.06 sec
    [junit] Tests run: 1, Failures: 0, Errors: 0, Time elapsed: 0.024 sec
    [junit] Tests run: 10, Failures: 0, Errors: 0, Time elapsed: 0.012 sec
    [junit] Tests run: 3, Failures: 0, Errors: 0, Time elapsed: 1.133 sec
    [junit] Tests run: 18, Failures: 0, Errors: 0, Time elapsed: 0.92 sec
    [junit] Tests run: 1, Failures: 0, Errors: 0, Time elapsed: 0.113 sec
    [junit] Tests run: 7, Failures: 0, Errors: 0, Time elapsed: 1.06 sec
    [junit] Tests run: 7, Failures: 0, Errors: 0, Time elapsed: 0.052 sec
    [junit] Tests run: 8, Failures: 0, Errors: 0, Time elapsed: 0.869 sec
    [junit] Tests run: 4, Failures: 0, Errors: 0, Time elapsed: 0.014 sec
    [junit] Tests run: 1, Failures: 0, Errors: 0, Time elapsed: 0.355 sec
    [junit] Tests run: 14, Failures: 0, Errors: 0, Time elapsed: 0.381 sec
    [junit] Tests run: 5, Failures: 0, Errors: 0, Time elapsed: 0.003 sec
    [junit] Tests run: 3, Failures: 0, Errors: 0, Time elapsed: 0.004 sec
    [junit] Tests run: 4, Failures: 0, Errors: 0, Time elapsed: 0.017 sec
Running post goal: test:test
    [touch] Creating /home/continuum/continuum-1.0.2/apps/continuum/work/1/modules/kernel/target/test-reports/tstamp

jar:jar:
    [copy] Copying 1 file to /home/continuum/continuum-1.0.2/apps/continuum/work/1/modules/kernel/target/classes/META-INF
    [jar] Building jar: /home/continuum/continuum-1.0.2/apps/continuum/work/1/modules/kernel/target/geronimo-kernel-1.2-SNAPSHOT.jar

jar:install:
    [echo] Installing...
Uploading to geronimo/jars/geronimo-kernel-1.2-SNAPSHOT.jar: 
.................... (337K)
Uploading to geronimo/poms/geronimo-kernel-1.2-SNAPSHOT.pom: 
.................... (11K)

+----------------------------------------
| geronimo and geronimo-plugins Geronimo :: Common
| Memory: 18M/28M
+----------------------------------------
DEPRECATED: the default goal should be specified in the <build> section of project.xml
instead of maven.xml

build:end:

Attempting to download geronimo-kernel-1.2-SNAPSHOT.jar.
build:start:

multiproject:install-callback:
    [echo] Running jar:install for Geronimo :: Common
java:prepare-filesystem:
    [mkdir] Created dir: /home/continuum/continuum-1.0.2/apps/continuum/work/1/modules/common/target/classes

java:compile:
<depend closure="false" srcdir="1.4" dump="false" destdir="/home/continuum/continuum-1.0.2/apps/continuum/work/1/modules/common/target/classes"></depend>
   [echo] Compiling to /home/continuum/continuum-1.0.2/apps/continuum/work/1/modules/common/target/classes
    [javac] Compiling 43 source files to /home/continuum/continuum-1.0.2/apps/continuum/work/1/modules/common/target/classes

java:jar-resources:

test:prepare-filesystem:
    [mkdir] Created dir: /home/continuum/continuum-1.0.2/apps/continuum/work/1/modules/common/target/test-classes
    [mkdir] Created dir: /home/continuum/continuum-1.0.2/apps/continuum/work/1/modules/common/target/test-reports

test:test-resources:

test:compile:
    [javac] Compiling 17 source files to /home/continuum/continuum-1.0.2/apps/continuum/work/1/modules/common/target/test-classes

test:test:
    [junit] Running org.apache.geronimo.common.DeploymentExceptionTest
    [junit] Tests run: 1, Failures: 0, Errors: 0, Time elapsed: 0.021 sec
    [junit] Running org.apache.geronimo.common.GeronimoEnvironmentTest
    [junit] Tests run: 1, Failures: 0, Errors: 0, Time elapsed: 0.012 sec
    [junit] Running org.apache.geronimo.common.propertyeditor.ArrayListEditorTest
    [junit] Tests run: 4, Failures: 0, Errors: 0, Time elapsed: 0.026 sec
    [junit] Running org.apache.geronimo.common.propertyeditor.ArrayPropertyEditorAdapterTest
    [junit] Tests run: 2, Failures: 0, Errors: 0, Time elapsed: 0.027 sec
    [junit] Running org.apache.geronimo.common.propertyeditor.CollectionEditorTest
    [junit] Tests run: 4, Failures: 0, Errors: 0, Time elapsed: 0.02 sec
    [junit] Running org.apache.geronimo.common.propertyeditor.HashSetEditorTest
    [junit] Tests run: 4, Failures: 0, Errors: 0, Time elapsed: 0.02 sec
    [junit] Running org.apache.geronimo.common.propertyeditor.LinkedListEditorTest
    [junit] Tests run: 4, Failures: 0, Errors: 0, Time elapsed: 0.024 sec
    [junit] Running org.apache.geronimo.common.propertyeditor.ListEditorTest
    [junit] Tests run: 4, Failures: 0, Errors: 0, Time elapsed: 0.023 sec
    [junit] Running org.apache.geronimo.common.propertyeditor.PropertiesEditorTest
    [junit] Tests run: 4, Failures: 0, Errors: 0, Time elapsed: 0.024 sec
    [junit] Running org.apache.geronimo.common.propertyeditor.PropertyEditorsTest
    [junit] Tests run: 2, Failures: 0, Errors: 0, Time elapsed: 0.169 sec
    [junit] Running org.apache.geronimo.common.propertyeditor.SetEditorTest
    [junit] Tests run: 4, Failures: 0, Errors: 0, Time elapsed: 0.022 sec
    [junit] Running org.apache.geronimo.common.propertyeditor.StackEditorTest
    [junit] Tests run: 4, Failures: 0, Errors: 0, Time elapsed: 0.021 sec
    [junit] Running org.apache.geronimo.common.propertyeditor.TreeSetEditorTest
    [junit] Tests run: 4, Failures: 0, Errors: 0, Time elapsed: 0.022 sec
    [junit] Running org.apache.geronimo.common.propertyeditor.URLEditorTest
    [junit] Tests run: 5, Failures: 0, Errors: 0, Time elapsed: 4.801 sec
    [junit] Running org.apache.geronimo.common.propertyeditor.VectorEditorTest
    [junit] Tests run: 4, Failures: 0, Errors: 0, Time elapsed: 0.019 sec
Running post goal: test:test
    [touch] Creating /home/continuum/continuum-1.0.2/apps/continuum/work/1/modules/common/target/test-reports/tstamp

jar:jar:
    [jar] Building jar: /home/continuum/continuum-1.0.2/apps/continuum/work/1/modules/common/target/geronimo-common-1.2-SNAPSHOT.jar

jar:install:
    [echo] Installing...
Uploading to geronimo/jars/geronimo-common-1.2-SNAPSHOT.jar: 
.................... (36K)
Uploading to geronimo/poms/geronimo-common-1.2-SNAPSHOT.pom: 
.................... (10K)

+----------------------------------------
| geronimo and geronimo-plugins Geronimo :: Util
| Memory: 13M/28M
+----------------------------------------
DEPRECATED: the default goal should be specified in the <build> section of project.xml
instead of maven.xml

build:end:

build:start:

multiproject:install-callback:
    [echo] Running jar:install for Geronimo :: Util
java:prepare-filesystem:
    [mkdir] Created dir: /home/continuum/continuum-1.0.2/apps/continuum/work/1/modules/util/target/classes

java:compile:
<depend closure="false" srcdir="1.4" dump="false" destdir="/home/continuum/continuum-1.0.2/apps/continuum/work/1/modules/util/target/classes"></depend>
   [echo] Compiling to /home/continuum/continuum-1.0.2/apps/continuum/work/1/modules/util/target/classes
    [javac] Compiling 175 source files to /home/continuum/continuum-1.0.2/apps/continuum/work/1/modules/util/target/classes
    [javac] Note: Some input files use or override a deprecated API.
    [javac] Note: Recompile with -deprecation for details.

java:jar-resources:

test:prepare-filesystem:
    [mkdir] Created dir: /home/continuum/continuum-1.0.2/apps/continuum/work/1/modules/util/target/test-classes
    [mkdir] Created dir: /home/continuum/continuum-1.0.2/apps/continuum/work/1/modules/util/target/test-reports

test:test-resources:

test:compile:
    [javac] Compiling 1 source file to /home/continuum/continuum-1.0.2/apps/continuum/work/1/modules/util/target/test-classes

test:test:
    [junit] Running org.apache.geronimo.util.SimpleEncryptionTest
    [junit] Tests run: 1, Failures: 0, Errors: 0, Time elapsed: 0.499 sec
Running post goal: test:test
    [touch] Creating /home/continuum/continuum-1.0.2/apps/continuum/work/1/modules/util/target/test-reports/tstamp

jar:jar:
    [jar] Building jar: /home/continuum/continuum-1.0.2/apps/continuum/work/1/modules/util/target/geronimo-util-1.2-SNAPSHOT.jar

jar:install:
    [echo] Installing...
Uploading to geronimo/jars/geronimo-util-1.2-SNAPSHOT.jar: 
.................... (243K)
Uploading to geronimo/poms/geronimo-util-1.2-SNAPSHOT.pom: 
.................... (10K)

+----------------------------------------
| geronimo and geronimo-plugins Geronimo :: System
| Memory: 23M/28M
+----------------------------------------
DEPRECATED: the default goal should be specified in the <build> section of project.xml
instead of maven.xml
DEPRECATED: the default goal should be specified in the <build> section of project.xml
instead of maven.xml

build:end:

Attempting to download geronimo-common-1.2-SNAPSHOT.jar.
Attempting to download geronimo-util-1.2-SNAPSHOT.jar.
build:start:

multiproject:install-callback:
    [echo] Running jar:install for Geronimo :: System
java:prepare-filesystem:
    [mkdir] Created dir: /home/continuum/continuum-1.0.2/apps/continuum/work/1/modules/system/target/classes

java:compile:
<depend closure="false" srcdir="1.4" dump="false" destdir="/home/continuum/continuum-1.0.2/apps/continuum/work/1/modules/system/target/classes"></depend>
   [echo] Compiling to /home/continuum/continuum-1.0.2/apps/continuum/work/1/modules/system/target/classes
    [javac] Compiling 80 source files to /home/continuum/continuum-1.0.2/apps/continuum/work/1/modules/system/target/classes
    [javac] Note: /home/continuum/continuum-1.0.2/apps/continuum/work/1/modules/system/src/java/org/apache/geronimo/system/configuration/XMLSerializer.java
uses or overrides a deprecated API.
    [javac] Note: Recompile with -deprecation for details.
Running post goal: java:compile
    [mkdir] Created dir: /home/continuum/continuum-1.0.2/apps/continuum/work/1/modules/system/target/classes/META-INF
    [mkdir] Created dir: /home/continuum/continuum-1.0.2/apps/continuum/work/1/modules/system/target/classes/META-INF/schema
    [copy] Copying 2 files to /home/continuum/continuum-1.0.2/apps/continuum/work/1/modules/system/target/classes/META-INF/schema

java:jar-resources:

test:prepare-filesystem:
    [mkdir] Created dir: /home/continuum/continuum-1.0.2/apps/continuum/work/1/modules/system/target/test-classes
    [mkdir] Created dir: /home/continuum/continuum-1.0.2/apps/continuum/work/1/modules/system/target/test-reports

test:test-resources:
Copying 2 files to /home/continuum/continuum-1.0.2/apps/continuum/work/1/modules/system/target/test-classes/META-INF
Copying 3 files to /home/continuum/continuum-1.0.2/apps/continuum/work/1/modules/system/target/test-classes
Running post goal: test:test-resources
    [mkdir] Created dir: /home/continuum/continuum-1.0.2/apps/continuum/work/1/modules/system/target/tmp
    [mkdir] Created dir: /home/continuum/continuum-1.0.2/apps/continuum/work/1/modules/system/target/m1
    [mkdir] Created dir: /home/continuum/continuum-1.0.2/apps/continuum/work/1/modules/system/target/m2
    [copy] Copying 4 files to /home/continuum/continuum-1.0.2/apps/continuum/work/1/modules/system/target/m1
    [copy] Copying 4 files to /home/continuum/continuum-1.0.2/apps/continuum/work/1/modules/system/target/m2

test:compile:
    [javac] Compiling 16 source files to /home/continuum/continuum-1.0.2/apps/continuum/work/1/modules/system/target/test-classes

test:test:
    [junit] Running org.apache.geronimo.system.configuration.ConfigurationStoreUtilTest
    [junit] Tests run: 4, Failures: 0, Errors: 0, Time elapsed: 0.442 sec
    [junit] Running org.apache.geronimo.system.configuration.InPlaceConfigurationUtilTest
    [junit] Tests run: 3, Failures: 0, Errors: 0, Time elapsed: 0.446 sec
    [junit] Running org.apache.geronimo.system.configuration.LocalAttributeManagerTest
    [junit] Tests run: 6, Failures: 0, Errors: 0, Time elapsed: 0.501 sec
    [junit] Running org.apache.geronimo.system.configuration.ServerOverrideTest
    [junit] Tests run: 4, Failures: 0, Errors: 0, Time elapsed: 0.602 sec
    [junit] Running org.apache.geronimo.system.logging.log4j.XLevelTest
    [junit] Tests run: 4, Failures: 0, Errors: 0, Time elapsed: 0.328 sec
    [junit] Running org.apache.geronimo.system.plugin.PluginInstallerTest
    [junit] Tests run: 1, Failures: 0, Errors: 1, Time elapsed: 0.938 sec
    [junit] [ERROR] Test org.apache.geronimo.system.plugin.PluginInstallerTest FAILED
    [junit] Running org.apache.geronimo.system.properties.NamingPropertiesTest
    [junit] Tests run: 1, Failures: 0, Errors: 0, Time elapsed: 0.392 sec
    [junit] Running org.apache.geronimo.system.repository.Maven1RepositoryTest
    [junit] Tests run: 10, Failures: 0, Errors: 0, Time elapsed: 0.504 sec
    [junit] Running org.apache.geronimo.system.repository.Maven2RepositoryTest
    [junit] Tests run: 10, Failures: 0, Errors: 0, Time elapsed: 0.511 sec
    [junit] Running org.apache.geronimo.system.rmi.RMIClassLoaderSpiImplTest
    [junit] Tests run: 3, Failures: 0, Errors: 0, Time elapsed: 0.353 sec
    [junit] Running org.apache.geronimo.system.serverinfo.ServerInfoTest
    [junit] Tests run: 5, Failures: 0, Errors: 0, Time elapsed: 0.377 sec

BUILD FAILED
File...... /home/continuum/continuum-1.0.2/apps/continuum/work/1/maven.xml
Element... maven:reactor
Line...... 43
Column.... -1
Unable to obtain goal [multiproject:install-callback] -- /home/continuum/.maven/cache/maven-test-plugin-1.7/plugin.jelly:183:-1:
<fail> There were test failures.
Total time   : 1 minutes 34 seconds 
Finished at  : Monday, May 29, 2006 11:17:14 AM PDT


****************************************************************************



Mime
View raw message