geronimo-scm mailing list archives

Site index · List index
Message view « Date » · « Thread »
Top « Date » · « Thread »
From continuum <contin...@stan.gbuild.org>
Subject [continuum] BUILD FAILURE: Geronimo 1.1
Date Tue, 16 May 2006 14:12:06 GMT
Online report : http://ci.gbuild.org/continuum/servlet/continuum/target/ProjectBuild.vm/view/ProjectBuild/id/68/buildId/3373
Build statistics:
  State: Failed
  Previous State: Failed
  Started at: Tue, 16 May 2006 06:47:14 -0700
  Finished at: Tue, 16 May 2006 07:12:03 -0700
  Total time: 24m 48s
  Build Trigger: Forced
  Exit code: 70
  Building machine hostname: stan.gbuild.org
  Operating system : Linux(unknown)
  Java version : 1.4.2_08(Sun Microsystems Inc.)

Changes
                            modules/jetty-builder/src/java/org/apache/geronimo/jetty/deployment/JettyModuleBuilder.java
            modules/naming-builder/src/schema/geronimo-naming-1.1.xsd
            modules/naming-builder/src/java/org/apache/geronimo/naming/deployment/ENCConfigBuilder.java
            modules/naming/src/java/org/apache/geronimo/naming/reference/ORBReference.java
            modules/naming/src/java/org/apache/geronimo/naming/reference/HandleDelegateReference.java
            modules/naming/src/java/org/apache/geronimo/naming/reference/ConfigurationAwareReference.java
            modules/naming/src/java/org/apache/geronimo/naming/reference/ResourceReference.java
            modules/naming/src/java/org/apache/geronimo/naming/reference/GBeanReference.java
            modules/j2ee-schema/src/java/org/apache/geronimo/schema/SchemaConversionUtils.java
            modules/client-builder/src/schema/geronimo-application-client-1.1.xsd
            modules/client-builder/src/java/org/apache/geronimo/client/builder/AppClientModuleBuilder.java
            modules/tomcat-builder/src/java/org/apache/geronimo/tomcat/deployment/TomcatModuleBuilder.java
        
****************************************************************************
Output:
****************************************************************************
 __  __
|  \/  |__ _Apache__ ___
| |\/| / _` \ V / -_) ' \  ~ intelligent projects ~
|_|  |_\__,_|\_/\___|_||_|  v. 1.1-beta-2

DEPRECATED: the default goal should be specified in the <build> section of project.xml instead of maven.xml
DEPRECATED: the default goal should be specified in the <build> section of project.xml instead of maven.xml
build:start:

m:checkout:
    [exec] svn: PROPFIND request failed on '/openejb/branches/v2_1/openejb2'
    [exec] svn: PROPFIND of '/openejb/branches/v2_1/openejb2': could not connect to server (https://svn.codehaus.org)
    [exec] [ERROR] Result: 1
Starting the reactor...
Our processing order:

new:
new0:

Starting the reactor...
Our processing order:
new00:

Starting the reactor...
Our processing order:
Geronimo :: Activation
Geronimo :: ActiveMQ Embedded RAR
Geronimo :: Kernel
Geronimo :: Common
Geronimo :: Util
Geronimo :: System
Geronimo :: Deployment
Geronimo :: Deploy :: Common Config
Geronimo :: Management API
Geronimo :: Core
Geronimo :: J2EE
Geronimo :: J2EE Schema
Geronimo :: Service :: Builder
Geronimo :: Maven Dependency Plugin
Geronimo :: Naming
Geronimo :: Security
Geronimo :: Web Services
Geronimo :: Axis
Geronimo :: Test :: DDBeans
Geronimo :: Transaction
Geronimo :: Connector
Geronimo :: Security :: Builder
Geronimo :: J2EE
Geronimo :: Naming :: Builder
Geronimo :: Connector :: Builder
Geronimo :: Axis :: Builder
Geronimo :: Client
Geronimo :: Client Builder
Geronimo :: Console Web
Geronimo :: Configuration Converter
Geronimo :: Web :: Builder
Geronimo :: Deploy :: JSR-88
Geronimo :: Deploy :: CLI Tool
Geronimo :: Derby
Geronimo :: Directory
Geronimo :: Deploy :: Hot Deployer
Geronimo :: Installer Processing
Geronimo :: Installer Support
Geronimo :: JavaMail Transport
Geronimo :: Jetty
Geronimo :: Jetty :: Builder
Geronimo :: JMX Remoting
Geronimo :: Mail
Geronimo :: Scripts
Geronimo :: Timer
Geronimo :: Tomcat
Geronimo :: Tomcat :: Builder
Geronimo :: Upgrade
Geronimo :: Maven Assembly Plugin
Geronimo :: Maven Deployment Plugin
Geronimo :: IZPack Installer Build Plugin
Geronimo :: Maven Packaging Plugin
+----------------------------------------
| geronimo and geronimo-plugins Geronimo :: Activation
| Memory: 9M/9M
+----------------------------------------
DEPRECATED: the default goal should be specified in the <build> section of project.xml instead of maven.xml
new1:
Attempting to download geronimo-javamail_1.3.1_spec-1.1-SNAPSHOT.jar.
Error retrieving artifact from [http://dist.codehaus.org]: org.apache.maven.wagon.TransferFailedException: Connection refused
build:start:

multiproject:install-callback:
    [echo] Running jar:install for Geronimo :: Activation
Tag library requested that is not present: 'geronimo:deploy' in plugin: 'null'
java:prepare-filesystem:

java:compile:
<depend closure="false" srcdir="1.4" dump="false" destdir="/home/continuum/continuum-1.0.2/apps/continuum/work/68/modules/activation/target/classes"></depend>    [echo] Compiling to /home/continuum/continuum-1.0.2/apps/continuum/work/68/modules/activation/target/classes

java:jar-resources:

test:prepare-filesystem:

test:test-resources:

test:compile:

test:test:
    [echo] NOTICE: Skipping tests; they seem to have passed already
    [echo] No tests to run.
Running post goal: test:test

jar:jar:

jar:install:
    [echo] Installing...
Uploading to geronimo/jars/geronimo-activation-1.1-SNAPSHOT.jar: 
.................... (13K)
Uploading to geronimo/poms/geronimo-activation-1.1-SNAPSHOT.pom: 
.................... (10K)

+----------------------------------------
| geronimo and geronimo-plugins Geronimo :: ActiveMQ Embedded RAR
| Memory: 8M/9M
+----------------------------------------
DEPRECATED: the default goal should be specified in the <build> section of project.xml instead of maven.xml
DEPRECATED: the default goal should be specified in the <build> section of project.xml instead of maven.xml

build:end:

Attempting to download activemq-core-3.2.4-SNAPSHOT.jar.
Error retrieving artifact from [http://dist.codehaus.org]: org.apache.maven.wagon.TransferFailedException: Connection refused
Artifact /activemq/jars/activemq-core-3.2.4-SNAPSHOT.jar doesn't exist in remote repository, but it exists locally.
Attempting to download activemq-ra-3.2.4-SNAPSHOT.jar.
Error retrieving artifact from [http://dist.codehaus.org]: org.apache.maven.wagon.TransferFailedException: Connection refused
Artifact /activemq/jars/activemq-ra-3.2.4-SNAPSHOT.jar doesn't exist in remote repository, but it exists locally.
build:start:

multiproject:install-callback:
    [echo] Running rar:install for Geronimo :: ActiveMQ Embedded RAR
rar:init:

rar:rar:
    [echo] Building rar ge-activemq-rar-1.1-SNAPSHOT with ra.xml "/home/continuum/continuum-1.0.2/apps/continuum/work/68/modules/activemq-embedded-rar/src/rar/META-INF/ra.xml"
    [echo] trying to include /home/continuum/continuum-1.0.2/apps/continuum/work/68/modules/activemq-embedded-rar/target/ge-activemq-rar-1.1-SNAPSHOT.jar
    [echo] Bundling: jar - activemq:activemq-core
    [echo] Bundling: jar - activemq:activemq-ra

rar:install:
    [echo] Installing...
Uploading to geronimo/rars/ge-activemq-rar-1.1-SNAPSHOT.rar: 
.................... (949K)
Uploading to geronimo/poms/ge-activemq-rar-1.1-SNAPSHOT.pom: 
.................... (11K)

+----------------------------------------
| geronimo and geronimo-plugins Geronimo :: Kernel
| Memory: 9M/9M
+----------------------------------------
DEPRECATED: the default goal should be specified in the <build> section of project.xml instead of maven.xml
DEPRECATED: the default goal should be specified in the <build> section of project.xml instead of maven.xml

build:end:

build:start:

multiproject:install-callback:
    [echo] Running jar:install for Geronimo :: Kernel
Tag library requested that is not present: 'geronimo:deploy' in plugin: 'null'
Tag library requested that is not present: 'xmlbeans2:maven' in plugin: 'null'
java:prepare-filesystem:

java:compile:
<depend closure="false" srcdir="1.4" dump="false" destdir="/home/continuum/continuum-1.0.2/apps/continuum/work/68/modules/kernel/target/classes"></depend>    [echo] Compiling to /home/continuum/continuum-1.0.2/apps/continuum/work/68/modules/kernel/target/classes

java:jar-resources:

test:prepare-filesystem:

test:test-resources:

test:compile:

test:test:
    [echo] NOTICE: Skipping tests; they seem to have passed already
    [echo] No tests to run.
Running post goal: test:test

jar:jar:

jar:install:
    [echo] Installing...
Uploading to geronimo/jars/geronimo-kernel-1.1-SNAPSHOT.jar: 
.................... (357K)
Uploading to geronimo/poms/geronimo-kernel-1.1-SNAPSHOT.pom: 
.................... (11K)

+----------------------------------------
| geronimo and geronimo-plugins Geronimo :: Common
| Memory: 10M/15M
+----------------------------------------
DEPRECATED: the default goal should be specified in the <build> section of project.xml instead of maven.xml

build:end:

Attempting to download geronimo-kernel-1.1-SNAPSHOT.jar.
Error retrieving artifact from [http://dist.codehaus.org]: org.apache.maven.wagon.TransferFailedException: Connection refused
build:start:

multiproject:install-callback:
    [echo] Running jar:install for Geronimo :: Common
Tag library requested that is not present: 'geronimo:deploy' in plugin: 'null'
java:prepare-filesystem:

java:compile:
<depend closure="false" srcdir="1.4" dump="false" destdir="/home/continuum/continuum-1.0.2/apps/continuum/work/68/modules/common/target/classes"></depend>    [echo] Compiling to /home/continuum/continuum-1.0.2/apps/continuum/work/68/modules/common/target/classes

java:jar-resources:

test:prepare-filesystem:

test:test-resources:

test:compile:

test:test:
    [echo] NOTICE: Skipping tests; they seem to have passed already
    [echo] No tests to run.
Running post goal: test:test

jar:jar:

jar:install:
    [echo] Installing...
Uploading to geronimo/jars/geronimo-common-1.1-SNAPSHOT.jar: 
.................... (36K)
Uploading to geronimo/poms/geronimo-common-1.1-SNAPSHOT.pom: 
.................... (10K)

+----------------------------------------
| geronimo and geronimo-plugins Geronimo :: Util
| Memory: 11M/15M
+----------------------------------------
DEPRECATED: the default goal should be specified in the <build> section of project.xml instead of maven.xml

build:end:

build:start:

multiproject:install-callback:
    [echo] Running jar:install for Geronimo :: Util
Tag library requested that is not present: 'geronimo:deploy' in plugin: 'null'
java:prepare-filesystem:

java:compile:
<depend closure="false" srcdir="1.4" dump="false" destdir="/home/continuum/continuum-1.0.2/apps/continuum/work/68/modules/util/target/classes"></depend>    [echo] Compiling to /home/continuum/continuum-1.0.2/apps/continuum/work/68/modules/util/target/classes

java:jar-resources:

test:prepare-filesystem:

test:test-resources:

test:compile:

test:test:
    [echo] NOTICE: Skipping tests; they seem to have passed already
    [echo] No tests to run.
Running post goal: test:test

jar:jar:

jar:install:
    [echo] Installing...
Uploading to geronimo/jars/geronimo-util-1.1-SNAPSHOT.jar: 
.................... (243K)
Uploading to geronimo/poms/geronimo-util-1.1-SNAPSHOT.pom: 
.................... (10K)

+----------------------------------------
| geronimo and geronimo-plugins Geronimo :: System
| Memory: 13M/15M
+----------------------------------------
DEPRECATED: the default goal should be specified in the <build> section of project.xml instead of maven.xml
DEPRECATED: the default goal should be specified in the <build> section of project.xml instead of maven.xml

build:end:

Attempting to download geronimo-common-1.1-SNAPSHOT.jar.
Error retrieving artifact from [http://dist.codehaus.org]: org.apache.maven.wagon.TransferFailedException: Connection refused
Attempting to download geronimo-util-1.1-SNAPSHOT.jar.
Error retrieving artifact from [http://dist.codehaus.org]: org.apache.maven.wagon.TransferFailedException: Connection refused
build:start:

multiproject:install-callback:
    [echo] Running jar:install for Geronimo :: System
Tag library requested that is not present: 'geronimo:deploy' in plugin: 'null'
java:prepare-filesystem:

java:compile:
<depend closure="false" srcdir="1.4" dump="false" destdir="/home/continuum/continuum-1.0.2/apps/continuum/work/68/modules/system/target/classes"></depend>    [echo] Compiling to /home/continuum/continuum-1.0.2/apps/continuum/work/68/modules/system/target/classes
Running post goal: java:compile

java:jar-resources:

test:prepare-filesystem:

test:test-resources:
Running post goal: test:test-resources
    [delete] Deleting directory /home/continuum/continuum-1.0.2/apps/continuum/work/68/modules/system/target/tmp
    [mkdir] Created dir: /home/continuum/continuum-1.0.2/apps/continuum/work/68/modules/system/target/tmp

test:compile:

test:test:
    [echo] NOTICE: Skipping tests; they seem to have passed already
    [echo] No tests to run.
Running post goal: test:test

jar:jar:
    [jar] Building jar: /home/continuum/continuum-1.0.2/apps/continuum/work/68/modules/system/target/geronimo-system-1.1-SNAPSHOT.jar

jar:install:
    [echo] Installing...
Uploading to geronimo/jars/geronimo-system-1.1-SNAPSHOT.jar: 
.................... (259K)
Uploading to geronimo/poms/geronimo-system-1.1-SNAPSHOT.pom: 
.................... (11K)

+----------------------------------------
| geronimo and geronimo-plugins Geronimo :: Deployment
| Memory: 14M/15M
+----------------------------------------
DEPRECATED: the default goal should be specified in the <build> section of project.xml instead of maven.xml
DEPRECATED: the default goal should be specified in the <build> section of project.xml instead of maven.xml

build:end:

Attempting to download geronimo-system-1.1-SNAPSHOT.jar.
Error retrieving artifact from [http://dist.codehaus.org]: org.apache.maven.wagon.TransferFailedException: Connection refused
build:start:

multiproject:install-callback:
    [echo] Running jar:install for Geronimo :: Deployment
Tag library requested that is not present: 'geronimo:deploy' in plugin: 'null'
java:prepare-filesystem:

java:compile:
<depend closure="false" srcdir="1.4" dump="false" destdir="/home/continuum/continuum-1.0.2/apps/continuum/work/68/modules/deployment/target/classes"></depend>    [echo] Compiling to /home/continuum/continuum-1.0.2/apps/continuum/work/68/modules/deployment/target/classes

java:jar-resources:

test:prepare-filesystem:

test:test-resources:

test:compile:

test:test:
    [echo] NOTICE: Skipping tests; they seem to have passed already
    [echo] No tests to run.
Running post goal: test:test

jar:jar:

jar:install:
    [echo] Installing...
Uploading to geronimo/jars/geronimo-deployment-1.1-SNAPSHOT.jar: 
.................... (62K)
Uploading to geronimo/poms/geronimo-deployment-1.1-SNAPSHOT.pom: 
.................... (11K)

+----------------------------------------
| geronimo and geronimo-plugins Geronimo :: Deploy :: Common Config
| Memory: 10M/15M
+----------------------------------------
DEPRECATED: the default goal should be specified in the <build> section of project.xml instead of maven.xml
DEPRECATED: the default goal should be specified in the <build> section of project.xml instead of maven.xml

build:end:

build:start:

multiproject:install-callback:
    [echo] Running jar:install for Geronimo :: Deploy :: Common Config
Tag library requested that is not present: 'geronimo:deploy' in plugin: 'null'
java:prepare-filesystem:

java:compile:
<depend closure="false" srcdir="1.4" dump="false" destdir="/home/continuum/continuum-1.0.2/apps/continuum/work/68/modules/deploy-config/target/classes"></depend>    [echo] Compiling to /home/continuum/continuum-1.0.2/apps/continuum/work/68/modules/deploy-config/target/classes

java:jar-resources:

test:prepare-filesystem:

test:test-resources:

test:compile:

test:test:
    [echo] NOTICE: Skipping tests; they seem to have passed already
    [echo] No tests to run.
Running post goal: test:test

jar:jar:

jar:install:
    [echo] Installing...
Uploading to geronimo/jars/geronimo-deploy-config-1.1-SNAPSHOT.jar: 
.................... (10K)
Uploading to geronimo/poms/geronimo-deploy-config-1.1-SNAPSHOT.pom: 
.................... (11K)

+----------------------------------------
| geronimo and geronimo-plugins Geronimo :: Management API
| Memory: 9M/15M
+----------------------------------------
DEPRECATED: the default goal should be specified in the <build> section of project.xml instead of maven.xml
DEPRECATED: the default goal should be specified in the <build> section of project.xml instead of maven.xml

build:end:

build:start:

multiproject:install-callback:
    [echo] Running jar:install for Geronimo :: Management API
Tag library requested that is not present: 'geronimo:deploy' in plugin: 'null'
java:prepare-filesystem:

java:compile:
<depend closure="false" srcdir="1.4" dump="false" destdir="/home/continuum/continuum-1.0.2/apps/continuum/work/68/modules/management/target/classes"></depend>    [echo] Compiling to /home/continuum/continuum-1.0.2/apps/continuum/work/68/modules/management/target/classes

java:jar-resources:

test:prepare-filesystem:

test:test-resources:

test:compile:
    [echo] No test source files to compile.

test:test:
    [echo] NOTICE: Skipping tests; they seem to have passed already
    [echo] No tests to run.
Running post goal: test:test

jar:jar:

jar:install:
    [echo] Installing...
Uploading to geronimo/jars/geronimo-management-1.1-SNAPSHOT.jar: 
.................... (40K)
Uploading to geronimo/poms/geronimo-management-1.1-SNAPSHOT.pom: 
.................... (10K)

+----------------------------------------
| geronimo and geronimo-plugins Geronimo :: Core
| Memory: 11M/15M
+----------------------------------------
DEPRECATED: the default goal should be specified in the <build> section of project.xml instead of maven.xml
DEPRECATED: the default goal should be specified in the <build> section of project.xml instead of maven.xml

build:end:

Attempting to download geronimo-management-1.1-SNAPSHOT.jar.
Error retrieving artifact from [http://dist.codehaus.org]: org.apache.maven.wagon.TransferFailedException: Connection refused
build:start:

multiproject:install-callback:
    [echo] Running jar:install for Geronimo :: Core
Tag library requested that is not present: 'geronimo:deploy' in plugin: 'null'
java:prepare-filesystem:

java:compile:
<depend closure="false" srcdir="1.4" dump="false" destdir="/home/continuum/continuum-1.0.2/apps/continuum/work/68/modules/core/target/classes"></depend>    [echo] Compiling to /home/continuum/continuum-1.0.2/apps/continuum/work/68/modules/core/target/classes

java:jar-resources:

test:prepare-filesystem:

test:test-resources:

test:compile:

test:test:
    [echo] NOTICE: Skipping tests; they seem to have passed already
    [echo] No tests to run.
Running post goal: test:test

jar:jar:

jar:install:
    [echo] Installing...
Uploading to geronimo/jars/geronimo-core-1.1-SNAPSHOT.jar: 
.................... (39K)
Uploading to geronimo/poms/geronimo-core-1.1-SNAPSHOT.pom: 
.................... (11K)

+----------------------------------------
| geronimo and geronimo-plugins Geronimo :: J2EE
| Memory: 11M/15M
+----------------------------------------
DEPRECATED: the default goal should be specified in the <build> section of project.xml instead of maven.xml
DEPRECATED: the default goal should be specified in the <build> section of project.xml instead of maven.xml

build:end:

Attempting to download geronimo-core-1.1-SNAPSHOT.jar.
Error retrieving artifact from [http://dist.codehaus.org]: org.apache.maven.wagon.TransferFailedException: Connection refused
build:start:

multiproject:install-callback:
    [echo] Running jar:install for Geronimo :: J2EE
Tag library requested that is not present: 'geronimo:deploy' in plugin: 'null'
java:prepare-filesystem:

java:compile:
<depend closure="false" srcdir="1.4" dump="false" destdir="/home/continuum/continuum-1.0.2/apps/continuum/work/68/modules/j2ee/target/classes"></depend>    [echo] Compiling to /home/continuum/continuum-1.0.2/apps/continuum/work/68/modules/j2ee/target/classes

java:jar-resources:

test:prepare-filesystem:

test:test-resources:

test:compile:

test:test:
    [echo] NOTICE: Skipping tests; they seem to have passed already
    [echo] No tests to run.
Running post goal: test:test

jar:jar:

jar:install:
    [echo] Installing...
Uploading to geronimo/jars/geronimo-j2ee-1.1-SNAPSHOT.jar: 
.................... (28K)
Uploading to geronimo/poms/geronimo-j2ee-1.1-SNAPSHOT.pom: 
.................... (12K)

+----------------------------------------
| geronimo and geronimo-plugins Geronimo :: J2EE Schema
| Memory: 12M/15M
+----------------------------------------
DEPRECATED: the default goal should be specified in the <build> section of project.xml instead of maven.xml
DEPRECATED: the default goal should be specified in the <build> section of project.xml instead of maven.xml

build:end:

build:start:

multiproject:install-callback:
    [echo] Running jar:install for Geronimo :: J2EE Schema
Tag library requested that is not present: 'geronimo:deploy' in plugin: 'null'
java:prepare-filesystem:

java:compile:
<depend closure="false" srcdir="1.4" dump="false" destdir="/home/continuum/continuum-1.0.2/apps/continuum/work/68/modules/j2ee-schema/target/classes"></depend>    [echo] Compiling to /home/continuum/continuum-1.0.2/apps/continuum/work/68/modules/j2ee-schema/target/classes
    [javac] Compiling 1 source file to /home/continuum/continuum-1.0.2/apps/continuum/work/68/modules/j2ee-schema/target/classes

java:jar-resources:

test:prepare-filesystem:

test:test-resources:

test:compile:

test:test:
    [junit] Running org.apache.geronimo.schema.SchemaConversionUtilsTest
    [junit] Tests run: 21, Failures: 0, Errors: 0, Time elapsed: 2.185 sec
Running post goal: test:test

jar:jar:
    [jar] Building jar: /home/continuum/continuum-1.0.2/apps/continuum/work/68/modules/j2ee-schema/target/geronimo-j2ee-schema-1.1-SNAPSHOT.jar

jar:install:
    [echo] Installing...
Uploading to geronimo/jars/geronimo-j2ee-schema-1.1-SNAPSHOT.jar: 
.................... (1501K)
Uploading to geronimo/poms/geronimo-j2ee-schema-1.1-SNAPSHOT.pom: 
.................... (11K)

+----------------------------------------
| geronimo and geronimo-plugins Geronimo :: Service :: Builder
| Memory: 15M/20M
+----------------------------------------
DEPRECATED: the default goal should be specified in the <build> section of project.xml instead of maven.xml
DEPRECATED: the default goal should be specified in the <build> section of project.xml instead of maven.xml

build:end:

Attempting to download geronimo-deployment-1.1-SNAPSHOT.jar.
Error retrieving artifact from [http://dist.codehaus.org]: org.apache.maven.wagon.TransferFailedException: Connection refused
Attempting to download geronimo-deploy-config-1.1-SNAPSHOT.jar.
Error retrieving artifact from [http://dist.codehaus.org]: org.apache.maven.wagon.TransferFailedException: Connection refused
Attempting to download geronimo-j2ee-1.1-SNAPSHOT.jar.
Error retrieving artifact from [http://dist.codehaus.org]: org.apache.maven.wagon.TransferFailedException: Connection refused
Attempting to download geronimo-j2ee-schema-1.1-SNAPSHOT.jar.
Error retrieving artifact from [http://dist.codehaus.org]: org.apache.maven.wagon.TransferFailedException: Connection refused
build:start:

multiproject:install-callback:
    [echo] Running jar:install for Geronimo :: Service :: Builder
Tag library requested that is not present: 'geronimo:deploy' in plugin: 'null'
java:prepare-filesystem:

java:compile:
<depend closure="false" srcdir="1.4" dump="false" destdir="/home/continuum/continuum-1.0.2/apps/continuum/work/68/modules/service-builder/target/classes"></depend>    [echo] Compiling to /home/continuum/continuum-1.0.2/apps/continuum/work/68/modules/service-builder/target/classes

java:jar-resources:

test:prepare-filesystem:

test:test-resources:

test:compile:

test:test:
    [echo] NOTICE: Skipping tests; they seem to have passed already
    [echo] No tests to run.
Running post goal: test:test

jar:jar:

jar:install:
    [echo] Installing...
Uploading to geronimo/jars/geronimo-service-builder-1.1-SNAPSHOT.jar: 
.................... (180K)
Uploading to geronimo/poms/geronimo-service-builder-1.1-SNAPSHOT.pom: 
.................... (12K)

+----------------------------------------
| geronimo and geronimo-plugins Geronimo :: Maven Dependency Plugin
| Memory: 16M/20M
+----------------------------------------
DEPRECATED: the default goal should be specified in the <build> section of project.xml instead of maven.xml

build:end:

Attempting to download geronimo-service-builder-1.1-SNAPSHOT.jar.
Artifact /geronimo/jars/geronimo-service-builder-1.1-SNAPSHOT.jar doesn't exist in remote repository, but it exists locally.
build:start:

multiproject:install-callback:
    [echo] Running plugin:repository-install for Geronimo :: Maven Dependency Plugin
plugin:plugin:
java:prepare-filesystem:

java:compile:
    [echo] Compiling to /home/continuum/continuum-1.0.2/apps/continuum/work/68/plugins/geronimo-dependency-plugin/target/classes

java:jar-resources:

test:prepare-filesystem:

test:test-resources:

test:compile:
    [echo] No test source files to compile.

test:test:
    [echo] No tests to run.

jar:jar:


plugin:repository-install:
    [echo] Installing...
Uploading to geronimo/plugins/geronimo-dependency-plugin-1.1.0-3.jar: 
.................... (9K)
Uploading to geronimo/poms/geronimo-dependency-plugin-1.1.0-3.pom: 
.................... (1K)

+----------------------------------------
| geronimo and geronimo-plugins Geronimo :: Naming
| Memory: 17M/20M
+----------------------------------------
DEPRECATED: the default goal should be specified in the <build> section of project.xml instead of maven.xml
DEPRECATED: the default goal should be specified in the <build> section of project.xml instead of maven.xml

build:end:

build:start:

multiproject:install-callback:
    [echo] Running jar:install for Geronimo :: Naming
Tag library requested that is not present: 'geronimo:deploy' in plugin: 'null'
java:prepare-filesystem:

java:compile:
<depend closure="false" srcdir="1.4" dump="false" destdir="/home/continuum/continuum-1.0.2/apps/continuum/work/68/modules/naming/target/classes"></depend>    [echo] Compiling to /home/continuum/continuum-1.0.2/apps/continuum/work/68/modules/naming/target/classes
    [javac] Compiling 5 source files to /home/continuum/continuum-1.0.2/apps/continuum/work/68/modules/naming/target/classes

java:jar-resources:

test:prepare-filesystem:

test:test-resources:

test:compile:

test:test:
    [junit] Running org.apache.geronimo.naming.enc.EnterpriseNamingContextTest
    [junit] Tests run: 4, Failures: 0, Errors: 0, Time elapsed: 0.036 sec
    [junit] Running org.apache.geronimo.naming.geronimo.GeronimoContextTest
    [junit] Tests run: 3, Failures: 0, Errors: 0, Time elapsed: 0.03 sec
    [junit] Running org.apache.geronimo.naming.geronimo.GeronimoRootContextTest
    [junit] Tests run: 1, Failures: 0, Errors: 0, Time elapsed: 0.034 sec
    [junit] Running org.apache.geronimo.naming.java.BasicContextTest
    [junit] Tests run: 10, Failures: 0, Errors: 0, Time elapsed: 0.175 sec
    [junit] Running org.apache.geronimo.naming.java.ContextBuilderTest
    [junit] Tests run: 2, Failures: 0, Errors: 0, Time elapsed: 0.021 sec
    [junit] Running org.apache.geronimo.naming.java.ThreadContextTest
    [junit] Tests run: 1, Failures: 0, Errors: 0, Time elapsed: 0.02 sec
Running post goal: test:test

jar:jar:
    [jar] Building jar: /home/continuum/continuum-1.0.2/apps/continuum/work/68/modules/naming/target/geronimo-naming-1.1-SNAPSHOT.jar

jar:install:
    [echo] Installing...
Uploading to geronimo/jars/geronimo-naming-1.1-SNAPSHOT.jar: 
.................... (47K)
Uploading to geronimo/poms/geronimo-naming-1.1-SNAPSHOT.pom: 
.................... (10K)

+----------------------------------------
| geronimo and geronimo-plugins Geronimo :: Security
| Memory: 18M/26M
+----------------------------------------
DEPRECATED: the default goal should be specified in the <build> section of project.xml instead of maven.xml
DEPRECATED: the default goal should be specified in the <build> section of project.xml instead of maven.xml

build:end:

build:start:

multiproject:install-callback:
    [echo] Running jar:install for Geronimo :: Security
Tag library requested that is not present: 'geronimo:deploy' in plugin: 'null'
java:prepare-filesystem:

java:compile:
<depend closure="false" srcdir="1.4" dump="false" destdir="/home/continuum/continuum-1.0.2/apps/continuum/work/68/modules/security/target/classes"></depend>    [echo] Compiling to /home/continuum/continuum-1.0.2/apps/continuum/work/68/modules/security/target/classes

java:jar-resources:

test:prepare-filesystem:

test:test-resources:
Running post goal: test:test-resources
    [delete] Deleting directory /home/continuum/continuum-1.0.2/apps/continuum/work/68/modules/security/target/database
    [mkdir] Created dir: /home/continuum/continuum-1.0.2/apps/continuum/work/68/modules/security/target/database

test:compile:

test:test:
    [echo] NOTICE: Skipping tests; they seem to have passed already
    [echo] No tests to run.
Running post goal: test:test

jar:jar:

jar:install:
    [echo] Installing...
Uploading to geronimo/jars/geronimo-security-1.1-SNAPSHOT.jar: 
.................... (184K)
Uploading to geronimo/poms/geronimo-security-1.1-SNAPSHOT.pom: 
.................... (13K)

+----------------------------------------
| geronimo and geronimo-plugins Geronimo :: Web Services
| Memory: 18M/26M
+----------------------------------------
DEPRECATED: the default goal should be specified in the <build> section of project.xml instead of maven.xml

build:end:

build:start:

multiproject:install-callback:
    [echo] Running jar:install for Geronimo :: Web Services
Tag library requested that is not present: 'geronimo:deploy' in plugin: 'null'
java:prepare-filesystem:

java:compile:
<depend closure="false" srcdir="1.4" dump="false" destdir="/home/continuum/continuum-1.0.2/apps/continuum/work/68/modules/webservices/target/classes"></depend>    [echo] Compiling to /home/continuum/continuum-1.0.2/apps/continuum/work/68/modules/webservices/target/classes

java:jar-resources:

test:prepare-filesystem:

test:test-resources:

test:compile:
    [echo] No test source files to compile.

test:test:
    [echo] NOTICE: Skipping tests; they seem to have passed already
    [echo] No tests to run.
Running post goal: test:test

jar:jar:

jar:install:
    [echo] Installing...
Uploading to geronimo/jars/geronimo-webservices-1.1-SNAPSHOT.jar: 
.................... (34K)
Uploading to geronimo/poms/geronimo-webservices-1.1-SNAPSHOT.pom: 
.................... (13K)

+----------------------------------------
| geronimo and geronimo-plugins Geronimo :: Axis
| Memory: 20M/26M
+----------------------------------------
DEPRECATED: the default goal should be specified in the <build> section of project.xml instead of maven.xml
DEPRECATED: the default goal should be specified in the <build> section of project.xml instead of maven.xml

build:end:

Attempting to download geronimo-naming-1.1-SNAPSHOT.jar.
Error retrieving artifact from [http://dist.codehaus.org]: org.apache.maven.wagon.TransferFailedException: Connection refused
Attempting to download geronimo-security-1.1-SNAPSHOT.jar.
Error retrieving artifact from [http://dist.codehaus.org]: org.apache.maven.wagon.TransferFailedException: Connection refused
Attempting to download geronimo-webservices-1.1-SNAPSHOT.jar.
Error retrieving artifact from [http://dist.codehaus.org]: org.apache.maven.wagon.TransferFailedException: Connection refused
build:start:

multiproject:install-callback:
    [echo] Running jar:install for Geronimo :: Axis
Tag library requested that is not present: 'geronimo:deploy' in plugin: 'null'
java:prepare-filesystem:

java:compile:
<depend closure="false" srcdir="1.4" dump="false" destdir="/home/continuum/continuum-1.0.2/apps/continuum/work/68/modules/axis/target/classes"></depend>    [echo] Compiling to /home/continuum/continuum-1.0.2/apps/continuum/work/68/modules/axis/target/classes
Running post goal: java:compile
geronimo:dependency:


java:jar-resources:
Copying 1 file to /home/continuum/continuum-1.0.2/apps/continuum/work/68/modules/axis/target/classes

test:prepare-filesystem:

test:test-resources:

test:compile:

test:test:
    [echo] NOTICE: Skipping tests; they seem to have passed already
    [echo] No tests to run.
Running post goal: test:test

jar:jar:
    [jar] Building jar: /home/continuum/continuum-1.0.2/apps/continuum/work/68/modules/axis/target/geronimo-axis-1.1-SNAPSHOT.jar

jar:install:
    [echo] Installing...
Uploading to geronimo/jars/geronimo-axis-1.1-SNAPSHOT.jar: 
.................... (42K)
Uploading to geronimo/poms/geronimo-axis-1.1-SNAPSHOT.pom: 
.................... (13K)

+----------------------------------------
| geronimo and geronimo-plugins Geronimo :: Test :: DDBeans
| Memory: 11M/26M
+----------------------------------------
DEPRECATED: the default goal should be specified in the <build> section of project.xml instead of maven.xml
DEPRECATED: the default goal should be specified in the <build> section of project.xml instead of maven.xml

build:end:

build:start:

multiproject:install-callback:
    [echo] Running jar:install for Geronimo :: Test :: DDBeans
Tag library requested that is not present: 'geronimo:deploy' in plugin: 'null'
java:prepare-filesystem:

java:compile:
<depend closure="false" srcdir="1.4" dump="false" destdir="/home/continuum/continuum-1.0.2/apps/continuum/work/68/modules/test-ddbean/target/classes"></depend>    [echo] Compiling to /home/continuum/continuum-1.0.2/apps/continuum/work/68/modules/test-ddbean/target/classes

java:jar-resources:

test:prepare-filesystem:

test:test-resources:

test:compile:

test:test:
    [echo] NOTICE: Skipping tests; they seem to have passed already
    [echo] No tests to run.
Running post goal: test:test

jar:jar:

jar:install:
    [echo] Installing...
Uploading to geronimo/jars/geronimo-test-ddbean-1.1-SNAPSHOT.jar: 
.................... (17K)
Uploading to geronimo/poms/geronimo-test-ddbean-1.1-SNAPSHOT.pom: 
.................... (10K)

+----------------------------------------
| geronimo and geronimo-plugins Geronimo :: Transaction
| Memory: 13M/26M
+----------------------------------------
DEPRECATED: the default goal should be specified in the <build> section of project.xml instead of maven.xml

build:end:

build:start:

multiproject:install-callback:
    [echo] Running jar:install for Geronimo :: Transaction
Tag library requested that is not present: 'geronimo:deploy' in plugin: 'null'
java:prepare-filesystem:

java:compile:
<depend closure="false" srcdir="1.4" dump="false" destdir="/home/continuum/continuum-1.0.2/apps/continuum/work/68/modules/transaction/target/classes"></depend>    [echo] Compiling to /home/continuum/continuum-1.0.2/apps/continuum/work/68/modules/transaction/target/classes

java:jar-resources:

test:prepare-filesystem:

test:test-resources:

test:compile:

test:test:
    [echo] NOTICE: Skipping tests; they seem to have passed already
    [echo] No tests to run.
Running post goal: test:test

jar:jar:

jar:install:
    [echo] Installing...
Uploading to geronimo/jars/geronimo-transaction-1.1-SNAPSHOT.jar: 
.................... (73K)
Uploading to geronimo/poms/geronimo-transaction-1.1-SNAPSHOT.pom: 
.................... (12K)

+----------------------------------------
| geronimo and geronimo-plugins Geronimo :: Connector
| Memory: 13M/26M
+----------------------------------------
DEPRECATED: the default goal should be specified in the <build> section of project.xml instead of maven.xml
DEPRECATED: the default goal should be specified in the <build> section of project.xml instead of maven.xml

build:end:

Attempting to download geronimo-transaction-1.1-SNAPSHOT.jar.
Error retrieving artifact from [http://dist.codehaus.org]: org.apache.maven.wagon.TransferFailedException: Connection refused
build:start:

multiproject:install-callback:
    [echo] Running jar:install for Geronimo :: Connector
Tag library requested that is not present: 'geronimo:deploy' in plugin: 'null'
java:prepare-filesystem:

java:compile:
<depend closure="false" srcdir="1.4" dump="false" destdir="/home/continuum/continuum-1.0.2/apps/continuum/work/68/modules/connector/target/classes"></depend>    [echo] Compiling to /home/continuum/continuum-1.0.2/apps/continuum/work/68/modules/connector/target/classes

java:jar-resources:

test:prepare-filesystem:

test:test-resources:

test:compile:

test:test:
    [echo] NOTICE: Skipping tests; they seem to have passed already
    [echo] No tests to run.
Running post goal: test:test

jar:jar:

jar:install:
    [echo] Installing...
Uploading to geronimo/jars/geronimo-connector-1.1-SNAPSHOT.jar: 
.................... (132K)
Uploading to geronimo/poms/geronimo-connector-1.1-SNAPSHOT.pom: 
.................... (13K)

+----------------------------------------
| geronimo and geronimo-plugins Geronimo :: Security :: Builder
| Memory: 14M/26M
+----------------------------------------
DEPRECATED: the default goal should be specified in the <build> section of project.xml instead of maven.xml
DEPRECATED: the default goal should be specified in the <build> section of project.xml instead of maven.xml

build:end:

build:start:

multiproject:install-callback:
    [echo] Running jar:install for Geronimo :: Security :: Builder
Tag library requested that is not present: 'geronimo:deploy' in plugin: 'null'
java:prepare-filesystem:

java:compile:
<depend closure="false" srcdir="1.4" dump="false" destdir="/home/continuum/continuum-1.0.2/apps/continuum/work/68/modules/security-builder/target/classes"></depend>    [echo] Compiling to /home/continuum/continuum-1.0.2/apps/continuum/work/68/modules/security-builder/target/classes

java:jar-resources:

test:prepare-filesystem:

test:test-resources:
Running post goal: test:test-resources
    [delete] Deleting directory /home/continuum/continuum-1.0.2/apps/continuum/work/68/modules/security-builder/target/database
    [mkdir] Created dir: /home/continuum/continuum-1.0.2/apps/continuum/work/68/modules/security-builder/target/database

test:compile:
    [echo] No test source files to compile.

test:test:
    [echo] NOTICE: Skipping tests; they seem to have passed already
    [echo] No tests to run.
Running post goal: test:test

jar:jar:

jar:install:
    [echo] Installing...
Uploading to geronimo/jars/geronimo-security-builder-1.1-SNAPSHOT.jar: 
.................... (172K)
Uploading to geronimo/poms/geronimo-security-builder-1.1-SNAPSHOT.pom: 
.................... (12K)

+----------------------------------------
| geronimo and geronimo-plugins Geronimo :: J2EE
| Memory: 14M/26M
+----------------------------------------
DEPRECATED: the default goal should be specified in the <build> section of project.xml instead of maven.xml
DEPRECATED: the default goal should be specified in the <build> section of project.xml instead of maven.xml

build:end:

Attempting to download geronimo-security-builder-1.1-SNAPSHOT.jar.
Error retrieving artifact from [http://dist.codehaus.org]: org.apache.maven.wagon.TransferFailedException: Connection refused
build:start:

multiproject:install-callback:
    [echo] Running jar:install for Geronimo :: J2EE
Tag library requested that is not present: 'geronimo:deploy' in plugin: 'null'
java:prepare-filesystem:

java:compile:
<depend closure="false" srcdir="1.4" dump="false" destdir="/home/continuum/continuum-1.0.2/apps/continuum/work/68/modules/j2ee-builder/target/classes"></depend>    [echo] Compiling to /home/continuum/continuum-1.0.2/apps/continuum/work/68/modules/j2ee-builder/target/classes

java:jar-resources:

test:prepare-filesystem:

test:test-resources:

test:compile:
setupEar:

setupEar:

setupUnpackedEar:
setupBaseUnpackedEar:

setupBaseUnpackedEar:

setupBaseUnpackedEar:



test:test:
    [echo] NOTICE: Skipping tests; they seem to have passed already
    [echo] No tests to run.
Running post goal: test:test

jar:jar:

jar:install:
    [echo] Installing...
Uploading to geronimo/jars/geronimo-j2ee-builder-1.1-SNAPSHOT.jar: 
.................... (91K)
Uploading to geronimo/poms/geronimo-j2ee-builder-1.1-SNAPSHOT.pom: 
.................... (13K)

+----------------------------------------
| geronimo and geronimo-plugins Geronimo :: Naming :: Builder
| Memory: 15M/26M
+----------------------------------------
DEPRECATED: the default goal should be specified in the <build> section of project.xml instead of maven.xml
DEPRECATED: the default goal should be specified in the <build> section of project.xml instead of maven.xml

build:end:

Attempting to download geronimo-j2ee-builder-1.1-SNAPSHOT.jar.
Error retrieving artifact from [http://dist.codehaus.org]: org.apache.maven.wagon.TransferFailedException: Connection refused
build:start:

multiproject:install-callback:
    [echo] Running jar:install for Geronimo :: Naming :: Builder
Tag library requested that is not present: 'geronimo:deploy' in plugin: 'null'
java:prepare-filesystem:

java:compile:
Adding to classpath: /home/continuum/.geronimo-1.1-maven/repository/geronimo/jars/geronimo-service-builder-1.1-SNAPSHOT.jar
Adding to classpath: /home/continuum/.geronimo-1.1-maven/repository/geronimo/jars/geronimo-j2ee-schema-1.1-SNAPSHOT.jar
Cannot find CatalogManager.properties
Time to build schema type system: 1.193 seconds
created binary: schemaorg_apache_xmlbeans/system/sD54265BC20BB40986932114D35E4E1A4/ejbreftypeb4e6type.xsb
created binary: schemaorg_apache_xmlbeans/system/sD54265BC20BB40986932114D35E4E1A4/ejblocalreftype0f48type.xsb
created binary: schemaorg_apache_xmlbeans/system/sD54265BC20BB40986932114D35E4E1A4/resourcereftype28a3type.xsb
created binary: schemaorg_apache_xmlbeans/system/sD54265BC20BB40986932114D35E4E1A4/gbeanreftype2eactype.xsb
created binary: schemaorg_apache_xmlbeans/system/sD54265BC20BB40986932114D35E4E1A4/resourcelocatortype3c00type.xsb
created binary: schemaorg_apache_xmlbeans/system/sD54265BC20BB40986932114D35E4E1A4/resourceenvreftyped283type.xsb
created binary: schemaorg_apache_xmlbeans/system/sD54265BC20BB40986932114D35E4E1A4/messagedestinationtype1de1type.xsb
created binary: schemaorg_apache_xmlbeans/system/sD54265BC20BB40986932114D35E4E1A4/gbeanlocatortype1589type.xsb
created binary: schemaorg_apache_xmlbeans/system/sD54265BC20BB40986932114D35E4E1A4/patterntype4419type.xsb
created binary: schemaorg_apache_xmlbeans/system/sD54265BC20BB40986932114D35E4E1A4/porttypee516type.xsb
created binary: schemaorg_apache_xmlbeans/system/sD54265BC20BB40986932114D35E4E1A4/servicereftypee10etype.xsb
created binary: schemaorg_apache_xmlbeans/system/sD54265BC20BB40986932114D35E4E1A4/servicecompletiontype1bc3type.xsb
created binary: schemaorg_apache_xmlbeans/system/sD54265BC20BB40986932114D35E4E1A4/portcompletiontype5d01type.xsb
created binary: schemaorg_apache_xmlbeans/system/sD54265BC20BB40986932114D35E4E1A4/gbeanref6fd6doctype.xsb
created binary: schemaorg_apache_xmlbeans/system/sD54265BC20BB40986932114D35E4E1A4/ejbref6710doctype.xsb
created binary: schemaorg_apache_xmlbeans/system/sD54265BC20BB40986932114D35E4E1A4/serviceref5f38doctype.xsb
created binary: schemaorg_apache_xmlbeans/system/sD54265BC20BB40986932114D35E4E1A4/resourceref5f2ddoctype.xsb
created binary: schemaorg_apache_xmlbeans/system/sD54265BC20BB40986932114D35E4E1A4/resourceenvref810ddoctype.xsb
created binary: schemaorg_apache_xmlbeans/system/sD54265BC20BB40986932114D35E4E1A4/messagedestinationed8bdoctype.xsb
created binary: schemaorg_apache_xmlbeans/system/sD54265BC20BB40986932114D35E4E1A4/cmpconnectionfactory767fdoctype.xsb
created binary: schemaorg_apache_xmlbeans/system/sD54265BC20BB40986932114D35E4E1A4/resourceadapter82f1doctype.xsb
created binary: schemaorg_apache_xmlbeans/system/sD54265BC20BB40986932114D35E4E1A4/workmanager5ad7doctype.xsb
created binary: schemaorg_apache_xmlbeans/system/sD54265BC20BB40986932114D35E4E1A4/webcontainer5e4bdoctype.xsb
created binary: schemaorg_apache_xmlbeans/system/sD54265BC20BB40986932114D35E4E1A4/gbeanrefelement.xsb
created binary: schemaorg_apache_xmlbeans/system/sD54265BC20BB40986932114D35E4E1A4/ejbrefelement.xsb
created binary: schemaorg_apache_xmlbeans/system/sD54265BC20BB40986932114D35E4E1A4/servicerefelement.xsb
created binary: schemaorg_apache_xmlbeans/system/sD54265BC20BB40986932114D35E4E1A4/resourcerefelement.xsb
created binary: schemaorg_apache_xmlbeans/system/sD54265BC20BB40986932114D35E4E1A4/resourceenvrefelement.xsb
created binary: schemaorg_apache_xmlbeans/system/sD54265BC20BB40986932114D35E4E1A4/messagedestinationelement.xsb
created binary: schemaorg_apache_xmlbeans/system/sD54265BC20BB40986932114D35E4E1A4/cmpconnectionfactoryelement.xsb
created binary: schemaorg_apache_xmlbeans/system/sD54265BC20BB40986932114D35E4E1A4/resourceadapterelement.xsb
created binary: schemaorg_apache_xmlbeans/system/sD54265BC20BB40986932114D35E4E1A4/workmanagerelement.xsb
created binary: schemaorg_apache_xmlbeans/system/sD54265BC20BB40986932114D35E4E1A4/webcontainerelement.xsb
created binary: schemaorg_apache_xmlbeans/system/sD54265BC20BB40986932114D35E4E1A4/jndienvironmentrefsgroupmodelgroup.xsb
created binary: schemaorg_apache_xmlbeans/system/sD54265BC20BB40986932114D35E4E1A4/servergroupmodelgroup.xsb
created binary: schemaorg_apache_xmlbeans/system/sD54265BC20BB40986932114D35E4E1A4/corbanamegroupmodelgroup.xsb
created binary: schemaorg_apache_xmlbeans/system/sD54265BC20BB40986932114D35E4E1A4/index.xsb
created binary: schemaorg_apache_xmlbeans/element/http_3A_2F_2Fgeronimo_2Eapache_2Eorg_2Fxml_2Fns_2Fnaming_2D1_2E1/gbean_2Dref.xsb
created binary: schemaorg_apache_xmlbeans/element/http_3A_2F_2Fgeronimo_2Eapache_2Eorg_2Fxml_2Fns_2Fnaming_2D1_2E1/ejb_2Dref.xsb
created binary: schemaorg_apache_xmlbeans/element/http_3A_2F_2Fgeronimo_2Eapache_2Eorg_2Fxml_2Fns_2Fnaming_2D1_2E1/service_2Dref.xsb
created binary: schemaorg_apache_xmlbeans/element/http_3A_2F_2Fgeronimo_2Eapache_2Eorg_2Fxml_2Fns_2Fnaming_2D1_2E1/resource_2Dref.xsb
created binary: schemaorg_apache_xmlbeans/element/http_3A_2F_2Fgeronimo_2Eapache_2Eorg_2Fxml_2Fns_2Fnaming_2D1_2E1/resource_2Denv_2Dref.xsb
created binary: schemaorg_apache_xmlbeans/element/http_3A_2F_2Fgeronimo_2Eapache_2Eorg_2Fxml_2Fns_2Fnaming_2D1_2E1/message_2Ddestination.xsb
created binary: schemaorg_apache_xmlbeans/element/http_3A_2F_2Fgeronimo_2Eapache_2Eorg_2Fxml_2Fns_2Fnaming_2D1_2E1/cmp_2Dconnection_2Dfactory.xsb
created binary: schemaorg_apache_xmlbeans/element/http_3A_2F_2Fgeronimo_2Eapache_2Eorg_2Fxml_2Fns_2Fnaming_2D1_2E1/resource_2Dadapter.xsb
created binary: schemaorg_apache_xmlbeans/element/http_3A_2F_2Fgeronimo_2Eapache_2Eorg_2Fxml_2Fns_2Fnaming_2D1_2E1/workmanager.xsb
created binary: schemaorg_apache_xmlbeans/element/http_3A_2F_2Fgeronimo_2Eapache_2Eorg_2Fxml_2Fns_2Fnaming_2D1_2E1/web_2Dcontainer.xsb
created binary: schemaorg_apache_xmlbeans/modelgroup/http_3A_2F_2Fgeronimo_2Eapache_2Eorg_2Fxml_2Fns_2Fnaming_2D1_2E1/jndiEnvironmentRefsGroup.xsb
created binary: schemaorg_apache_xmlbeans/modelgroup/http_3A_2F_2Fgeronimo_2Eapache_2Eorg_2Fxml_2Fns_2Fnaming_2D1_2E1/serverGroup.xsb
created binary: schemaorg_apache_xmlbeans/modelgroup/http_3A_2F_2Fgeronimo_2Eapache_2Eorg_2Fxml_2Fns_2Fnaming_2D1_2E1/corbaNameGroup.xsb
created binary: schemaorg_apache_xmlbeans/type/http_3A_2F_2Fgeronimo_2Eapache_2Eorg_2Fxml_2Fns_2Fnaming_2D1_2E1/ejb_2DrefType.xsb
created binary: schemaorg_apache_xmlbeans/type/http_3A_2F_2Fgeronimo_2Eapache_2Eorg_2Fxml_2Fns_2Fnaming_2D1_2E1/ejb_2Dlocal_2DrefType.xsb
created binary: schemaorg_apache_xmlbeans/type/http_3A_2F_2Fgeronimo_2Eapache_2Eorg_2Fxml_2Fns_2Fnaming_2D1_2E1/resource_2DrefType.xsb
created binary: schemaorg_apache_xmlbeans/type/http_3A_2F_2Fgeronimo_2Eapache_2Eorg_2Fxml_2Fns_2Fnaming_2D1_2E1/gbean_2DrefType.xsb
created binary: schemaorg_apache_xmlbeans/type/http_3A_2F_2Fgeronimo_2Eapache_2Eorg_2Fxml_2Fns_2Fnaming_2D1_2E1/resource_2DlocatorType.xsb
created binary: schemaorg_apache_xmlbeans/type/http_3A_2F_2Fgeronimo_2Eapache_2Eorg_2Fxml_2Fns_2Fnaming_2D1_2E1/resource_2Denv_2DrefType.xsb
created binary: schemaorg_apache_xmlbeans/type/http_3A_2F_2Fgeronimo_2Eapache_2Eorg_2Fxml_2Fns_2Fnaming_2D1_2E1/message_2DdestinationType.xsb
created binary: schemaorg_apache_xmlbeans/type/http_3A_2F_2Fgeronimo_2Eapache_2Eorg_2Fxml_2Fns_2Fnaming_2D1_2E1/gbean_2DlocatorType.xsb
created binary: schemaorg_apache_xmlbeans/type/http_3A_2F_2Fgeronimo_2Eapache_2Eorg_2Fxml_2Fns_2Fnaming_2D1_2E1/patternType.xsb
created binary: schemaorg_apache_xmlbeans/type/http_3A_2F_2Fgeronimo_2Eapache_2Eorg_2Fxml_2Fns_2Fnaming_2D1_2E1/portType.xsb
created binary: schemaorg_apache_xmlbeans/type/http_3A_2F_2Fgeronimo_2Eapache_2Eorg_2Fxml_2Fns_2Fnaming_2D1_2E1/service_2DrefType.xsb
created binary: schemaorg_apache_xmlbeans/type/http_3A_2F_2Fgeronimo_2Eapache_2Eorg_2Fxml_2Fns_2Fnaming_2D1_2E1/service_2DcompletionType.xsb
created binary: schemaorg_apache_xmlbeans/type/http_3A_2F_2Fgeronimo_2Eapache_2Eorg_2Fxml_2Fns_2Fnaming_2D1_2E1/port_2DcompletionType.xsb
created binary: schemaorg_apache_xmlbeans/namespace/http_3A_2F_2Fgeronimo_2Eapache_2Eorg_2Fxml_2Fns_2Fnaming_2D1_2E1/xmlns.xsb
created binary: schemaorg_apache_xmlbeans/javaname/org/apache/geronimo/xbeans/geronimo/naming/GerGbeanRefDocument.xsb
created binary: schemaorg_apache_xmlbeans/javaname/org/apache/geronimo/xbeans/geronimo/naming/GerEjbRefDocument.xsb
created binary: schemaorg_apache_xmlbeans/javaname/org/apache/geronimo/xbeans/geronimo/naming/GerServiceRefDocument.xsb
created binary: schemaorg_apache_xmlbeans/javaname/org/apache/geronimo/xbeans/geronimo/naming/GerResourceRefDocument.xsb
created binary: schemaorg_apache_xmlbeans/javaname/org/apache/geronimo/xbeans/geronimo/naming/GerResourceEnvRefDocument.xsb
created binary: schemaorg_apache_xmlbeans/javaname/org/apache/geronimo/xbeans/geronimo/naming/GerMessageDestinationDocument.xsb
created binary: schemaorg_apache_xmlbeans/javaname/org/apache/geronimo/xbeans/geronimo/naming/GerCmpConnectionFactoryDocument.xsb
created binary: schemaorg_apache_xmlbeans/javaname/org/apache/geronimo/xbeans/geronimo/naming/GerResourceAdapterDocument.xsb
created binary: schemaorg_apache_xmlbeans/javaname/org/apache/geronimo/xbeans/geronimo/naming/GerWorkmanagerDocument.xsb
created binary: schemaorg_apache_xmlbeans/javaname/org/apache/geronimo/xbeans/geronimo/naming/GerWebContainerDocument.xsb
created binary: schemaorg_apache_xmlbeans/javaname/org/apache/geronimo/xbeans/geronimo/naming/GerEjbRefType.xsb
created binary: schemaorg_apache_xmlbeans/javaname/org/apache/geronimo/xbeans/geronimo/naming/GerEjbLocalRefType.xsb
created binary: schemaorg_apache_xmlbeans/javaname/org/apache/geronimo/xbeans/geronimo/naming/GerResourceRefType.xsb
created binary: schemaorg_apache_xmlbeans/javaname/org/apache/geronimo/xbeans/geronimo/naming/GerGbeanRefType.xsb
created binary: schemaorg_apache_xmlbeans/javaname/org/apache/geronimo/xbeans/geronimo/naming/GerResourceLocatorType.xsb
created binary: schemaorg_apache_xmlbeans/javaname/org/apache/geronimo/xbeans/geronimo/naming/GerResourceEnvRefType.xsb
created binary: schemaorg_apache_xmlbeans/javaname/org/apache/geronimo/xbeans/geronimo/naming/GerMessageDestinationType.xsb
created binary: schemaorg_apache_xmlbeans/javaname/org/apache/geronimo/xbeans/geronimo/naming/GerGbeanLocatorType.xsb
created binary: schemaorg_apache_xmlbeans/javaname/org/apache/geronimo/xbeans/geronimo/naming/GerPatternType.xsb
created binary: schemaorg_apache_xmlbeans/javaname/org/apache/geronimo/xbeans/geronimo/naming/GerPortType.xsb
created binary: schemaorg_apache_xmlbeans/javaname/org/apache/geronimo/xbeans/geronimo/naming/GerServiceRefType.xsb
created binary: schemaorg_apache_xmlbeans/javaname/org/apache/geronimo/xbeans/geronimo/naming/GerServiceCompletionType.xsb
created binary: schemaorg_apache_xmlbeans/javaname/org/apache/geronimo/xbeans/geronimo/naming/GerPortCompletionType.xsb
created binary: schemaorg_apache_xmlbeans/system/sD54265BC20BB40986932114D35E4E1A4/TypeSystemHolder.class
created source: /home/continuum/continuum-1.0.2/apps/continuum/work/68/modules/naming-builder/target/xmlbeans/org/apache/geronimo/xbeans/geronimo/naming/GerEjbRefType.java
created source: /home/continuum/continuum-1.0.2/apps/continuum/work/68/modules/naming-builder/target/xmlbeans/org/apache/geronimo/xbeans/geronimo/naming/impl/GerEjbRefTypeImpl.java
created source: /home/continuum/continuum-1.0.2/apps/continuum/work/68/modules/naming-builder/target/xmlbeans/org/apache/geronimo/xbeans/geronimo/naming/GerEjbLocalRefType.java
created source: /home/continuum/continuum-1.0.2/apps/continuum/work/68/modules/naming-builder/target/xmlbeans/org/apache/geronimo/xbeans/geronimo/naming/impl/GerEjbLocalRefTypeImpl.java
created source: /home/continuum/continuum-1.0.2/apps/continuum/work/68/modules/naming-builder/target/xmlbeans/org/apache/geronimo/xbeans/geronimo/naming/GerResourceRefType.java
created source: /home/continuum/continuum-1.0.2/apps/continuum/work/68/modules/naming-builder/target/xmlbeans/org/apache/geronimo/xbeans/geronimo/naming/impl/GerResourceRefTypeImpl.java
created source: /home/continuum/continuum-1.0.2/apps/continuum/work/68/modules/naming-builder/target/xmlbeans/org/apache/geronimo/xbeans/geronimo/naming/GerGbeanRefType.java
created source: /home/continuum/continuum-1.0.2/apps/continuum/work/68/modules/naming-builder/target/xmlbeans/org/apache/geronimo/xbeans/geronimo/naming/impl/GerGbeanRefTypeImpl.java
created source: /home/continuum/continuum-1.0.2/apps/continuum/work/68/modules/naming-builder/target/xmlbeans/org/apache/geronimo/xbeans/geronimo/naming/GerResourceLocatorType.java
created source: /home/continuum/continuum-1.0.2/apps/continuum/work/68/modules/naming-builder/target/xmlbeans/org/apache/geronimo/xbeans/geronimo/naming/impl/GerResourceLocatorTypeImpl.java
created source: /home/continuum/continuum-1.0.2/apps/continuum/work/68/modules/naming-builder/target/xmlbeans/org/apache/geronimo/xbeans/geronimo/naming/GerResourceEnvRefType.java
created source: /home/continuum/continuum-1.0.2/apps/continuum/work/68/modules/naming-builder/target/xmlbeans/org/apache/geronimo/xbeans/geronimo/naming/impl/GerResourceEnvRefTypeImpl.java
created source: /home/continuum/continuum-1.0.2/apps/continuum/work/68/modules/naming-builder/target/xmlbeans/org/apache/geronimo/xbeans/geronimo/naming/GerMessageDestinationType.java
created source: /home/continuum/continuum-1.0.2/apps/continuum/work/68/modules/naming-builder/target/xmlbeans/org/apache/geronimo/xbeans/geronimo/naming/impl/GerMessageDestinationTypeImpl.java
created source: /home/continuum/continuum-1.0.2/apps/continuum/work/68/modules/naming-builder/target/xmlbeans/org/apache/geronimo/xbeans/geronimo/naming/GerGbeanLocatorType.java
created source: /home/continuum/continuum-1.0.2/apps/continuum/work/68/modules/naming-builder/target/xmlbeans/org/apache/geronimo/xbeans/geronimo/naming/impl/GerGbeanLocatorTypeImpl.java
created source: /home/continuum/continuum-1.0.2/apps/continuum/work/68/modules/naming-builder/target/xmlbeans/org/apache/geronimo/xbeans/geronimo/naming/GerPatternType.java
created source: /home/continuum/continuum-1.0.2/apps/continuum/work/68/modules/naming-builder/target/xmlbeans/org/apache/geronimo/xbeans/geronimo/naming/impl/GerPatternTypeImpl.java
created source: /home/continuum/continuum-1.0.2/apps/continuum/work/68/modules/naming-builder/target/xmlbeans/org/apache/geronimo/xbeans/geronimo/naming/GerPortType.java
created source: /home/continuum/continuum-1.0.2/apps/continuum/work/68/modules/naming-builder/target/xmlbeans/org/apache/geronimo/xbeans/geronimo/naming/impl/GerPortTypeImpl.java
created source: /home/continuum/continuum-1.0.2/apps/continuum/work/68/modules/naming-builder/target/xmlbeans/org/apache/geronimo/xbeans/geronimo/naming/GerServiceRefType.java
created source: /home/continuum/continuum-1.0.2/apps/continuum/work/68/modules/naming-builder/target/xmlbeans/org/apache/geronimo/xbeans/geronimo/naming/impl/GerServiceRefTypeImpl.java
created source: /home/continuum/continuum-1.0.2/apps/continuum/work/68/modules/naming-builder/target/xmlbeans/org/apache/geronimo/xbeans/geronimo/naming/GerServiceCompletionType.java
created source: /home/continuum/continuum-1.0.2/apps/continuum/work/68/modules/naming-builder/target/xmlbeans/org/apache/geronimo/xbeans/geronimo/naming/impl/GerServiceCompletionTypeImpl.java
created source: /home/continuum/continuum-1.0.2/apps/continuum/work/68/modules/naming-builder/target/xmlbeans/org/apache/geronimo/xbeans/geronimo/naming/GerPortCompletionType.java
created source: /home/continuum/continuum-1.0.2/apps/continuum/work/68/modules/naming-builder/target/xmlbeans/org/apache/geronimo/xbeans/geronimo/naming/impl/GerPortCompletionTypeImpl.java
created source: /home/continuum/continuum-1.0.2/apps/continuum/work/68/modules/naming-builder/target/xmlbeans/org/apache/geronimo/xbeans/geronimo/naming/GerGbeanRefDocument.java
created source: /home/continuum/continuum-1.0.2/apps/continuum/work/68/modules/naming-builder/target/xmlbeans/org/apache/geronimo/xbeans/geronimo/naming/impl/GerGbeanRefDocumentImpl.java
created source: /home/continuum/continuum-1.0.2/apps/continuum/work/68/modules/naming-builder/target/xmlbeans/org/apache/geronimo/xbeans/geronimo/naming/GerEjbRefDocument.java
created source: /home/continuum/continuum-1.0.2/apps/continuum/work/68/modules/naming-builder/target/xmlbeans/org/apache/geronimo/xbeans/geronimo/naming/impl/GerEjbRefDocumentImpl.java
created source: /home/continuum/continuum-1.0.2/apps/continuum/work/68/modules/naming-builder/target/xmlbeans/org/apache/geronimo/xbeans/geronimo/naming/GerServiceRefDocument.java
created source: /home/continuum/continuum-1.0.2/apps/continuum/work/68/modules/naming-builder/target/xmlbeans/org/apache/geronimo/xbeans/geronimo/naming/impl/GerServiceRefDocumentImpl.java
created source: /home/continuum/continuum-1.0.2/apps/continuum/work/68/modules/naming-builder/target/xmlbeans/org/apache/geronimo/xbeans/geronimo/naming/GerResourceRefDocument.java
created source: /home/continuum/continuum-1.0.2/apps/continuum/work/68/modules/naming-builder/target/xmlbeans/org/apache/geronimo/xbeans/geronimo/naming/impl/GerResourceRefDocumentImpl.java
created source: /home/continuum/continuum-1.0.2/apps/continuum/work/68/modules/naming-builder/target/xmlbeans/org/apache/geronimo/xbeans/geronimo/naming/GerResourceEnvRefDocument.java
created source: /home/continuum/continuum-1.0.2/apps/continuum/work/68/modules/naming-builder/target/xmlbeans/org/apache/geronimo/xbeans/geronimo/naming/impl/GerResourceEnvRefDocumentImpl.java
created source: /home/continuum/continuum-1.0.2/apps/continuum/work/68/modules/naming-builder/target/xmlbeans/org/apache/geronimo/xbeans/geronimo/naming/GerMessageDestinationDocument.java
created source: /home/continuum/continuum-1.0.2/apps/continuum/work/68/modules/naming-builder/target/xmlbeans/org/apache/geronimo/xbeans/geronimo/naming/impl/GerMessageDestinationDocumentImpl.java
created source: /home/continuum/continuum-1.0.2/apps/continuum/work/68/modules/naming-builder/target/xmlbeans/org/apache/geronimo/xbeans/geronimo/naming/GerCmpConnectionFactoryDocument.java
created source: /home/continuum/continuum-1.0.2/apps/continuum/work/68/modules/naming-builder/target/xmlbeans/org/apache/geronimo/xbeans/geronimo/naming/impl/GerCmpConnectionFactoryDocumentImpl.java
created source: /home/continuum/continuum-1.0.2/apps/continuum/work/68/modules/naming-builder/target/xmlbeans/org/apache/geronimo/xbeans/geronimo/naming/GerResourceAdapterDocument.java
created source: /home/continuum/continuum-1.0.2/apps/continuum/work/68/modules/naming-builder/target/xmlbeans/org/apache/geronimo/xbeans/geronimo/naming/impl/GerResourceAdapterDocumentImpl.java
created source: /home/continuum/continuum-1.0.2/apps/continuum/work/68/modules/naming-builder/target/xmlbeans/org/apache/geronimo/xbeans/geronimo/naming/GerWorkmanagerDocument.java
created source: /home/continuum/continuum-1.0.2/apps/continuum/work/68/modules/naming-builder/target/xmlbeans/org/apache/geronimo/xbeans/geronimo/naming/impl/GerWorkmanagerDocumentImpl.java
created source: /home/continuum/continuum-1.0.2/apps/continuum/work/68/modules/naming-builder/target/xmlbeans/org/apache/geronimo/xbeans/geronimo/naming/GerWebContainerDocument.java
created source: /home/continuum/continuum-1.0.2/apps/continuum/work/68/modules/naming-builder/target/xmlbeans/org/apache/geronimo/xbeans/geronimo/naming/impl/GerWebContainerDocumentImpl.java
Time to generate code: 0.333 seconds
    [copy] Copying 88 files to /home/continuum/continuum-1.0.2/apps/continuum/work/68/modules/naming-builder/target/xmlbeans-classes/schemaorg_apache_xmlbeans
<depend closure="false" srcdir="1.4" dump="false" destdir="/home/continuum/continuum-1.0.2/apps/continuum/work/68/modules/naming-builder/target/classes"></depend>    [echo] Compiling to /home/continuum/continuum-1.0.2/apps/continuum/work/68/modules/naming-builder/target/classes
    [javac] Compiling 47 source files to /home/continuum/continuum-1.0.2/apps/continuum/work/68/modules/naming-builder/target/classes

java:jar-resources:
Copying 1 file to /home/continuum/continuum-1.0.2/apps/continuum/work/68/modules/naming-builder/target/classes/META-INF

test:prepare-filesystem:

test:test-resources:
Copying 1 file to /home/continuum/continuum-1.0.2/apps/continuum/work/68/modules/naming-builder/target/test-classes/META-INF

test:compile:

test:test:
    [junit] Running org.apache.geronimo.naming.deployment.MessageDestinationTest
    [junit] Tests run: 3, Failures: 0, Errors: 0, Time elapsed: 0.917 sec
Running post goal: test:test
06:52:56,329 INFO  [PostGoalTag] Running post goal: test:test

jar:jar:
    [jar] Building jar: /home/continuum/continuum-1.0.2/apps/continuum/work/68/modules/naming-builder/target/geronimo-naming-builder-1.1-SNAPSHOT.jar

jar:install:
    [echo] Installing...
Uploading to geronimo/jars/geronimo-naming-builder-1.1-SNAPSHOT.jar: 
.................... (199K)
Uploading to geronimo/poms/geronimo-naming-builder-1.1-SNAPSHOT.pom: 
.................... (13K)

+----------------------------------------

build:end:

06:52:57,982 INFO  [ReactorTag] +----------------------------------------
| geronimo and geronimo-plugins Geronimo :: Connector :: Builder
06:52:57,982 INFO  [ReactorTag] | geronimo and geronimo-plugins Geronimo :: Connector :: Builder
| Memory: 17M/26M
06:52:57,983 INFO  [ReactorTag] | Memory: 17M/26M
+----------------------------------------
06:52:57,983 INFO  [ReactorTag] +----------------------------------------
DEPRECATED: the default goal should be specified in the <build> section of project.xml instead of maven.xml
06:52:58,009 WARN  [PluginScriptParser] DEPRECATED: the default goal should be specified in the <build> section of project.xml instead of maven.xml
DEPRECATED: the default goal should be specified in the <build> section of project.xml instead of maven.xml
06:52:58,011 WARN  [PluginScriptParser] DEPRECATED: the default goal should be specified in the <build> section of project.xml instead of maven.xml
Attempting to download geronimo-test-ddbean-1.1-SNAPSHOT.jar.
06:52:58,335 INFO  [DependencyVerifier] Attempting to download geronimo-test-ddbean-1.1-SNAPSHOT.jar.
Error retrieving artifact from [http://dist.codehaus.org]: org.apache.maven.wagon.TransferFailedException: Connection refused
06:52:58,450 WARN  [DependencyVerifier] Error retrieving artifact from [http://dist.codehaus.org]: org.apache.maven.wagon.TransferFailedException: Connection refused
Attempting to download geronimo-connector-1.1-SNAPSHOT.jar.
06:53:27,067 INFO  [DependencyVerifier] Attempting to download geronimo-connector-1.1-SNAPSHOT.jar.
Error retrieving artifact from [http://dist.codehaus.org]: org.apache.maven.wagon.TransferFailedException: Connection refused
06:53:27,195 WARN  [DependencyVerifier] Error retrieving artifact from [http://dist.codehaus.org]: org.apache.maven.wagon.TransferFailedException: Connection refused
Attempting to download geronimo-naming-builder-1.1-SNAPSHOT.jar.
06:53:37,031 INFO  [DependencyVerifier] Attempting to download geronimo-naming-builder-1.1-SNAPSHOT.jar.
Error retrieving artifact from [http://dist.codehaus.org]: org.apache.maven.wagon.TransferFailedException: Connection refused
06:53:37,140 WARN  [DependencyVerifier] Error retrieving artifact from [http://dist.codehaus.org]: org.apache.maven.wagon.TransferFailedException: Connection refused
build:start:

multiproject:install-callback:
    [echo] Running jar:install for Geronimo :: Connector :: Builder
Tag library requested that is not present: 'geronimo:deploy' in plugin: 'null'
06:53:46,257 WARN  [GoalToJellyScriptHousingMapper] Tag library requested that is not present: 'geronimo:deploy' in plugin: 'null'
java:prepare-filesystem:

java:compile:
<depend closure="false" srcdir="1.4" dump="false" destdir="/home/continuum/continuum-1.0.2/apps/continuum/work/68/modules/connector-builder/target/classes"></depend>    [echo] Compiling to /home/continuum/continuum-1.0.2/apps/continuum/work/68/modules/connector-builder/target/classes

java:jar-resources:

test:prepare-filesystem:

test:test-resources:

test:compile:

test:test:
    [echo] NOTICE: Skipping tests; they seem to have passed already
    [echo] No tests to run.
Running post goal: test:test
06:53:48,418 INFO  [PostGoalTag] Running post goal: test:test

jar:jar:

jar:install:
    [echo] Installing...
Uploading to geronimo/jars/geronimo-connector-builder-1.1-SNAPSHOT.jar: 
.................... (202K)
Uploading to geronimo/poms/geronimo-connector-builder-1.1-SNAPSHOT.pom: 
.................... (15K)

+----------------------------------------

build:end:

06:53:48,755 INFO  [ReactorTag] +----------------------------------------
| geronimo and geronimo-plugins Geronimo :: Axis :: Builder
06:53:48,755 INFO  [ReactorTag] | geronimo and geronimo-plugins Geronimo :: Axis :: Builder
| Memory: 18M/26M
06:53:48,756 INFO  [ReactorTag] | Memory: 18M/26M
+----------------------------------------
06:53:48,756 INFO  [ReactorTag] +----------------------------------------
DEPRECATED: the default goal should be specified in the <build> section of project.xml instead of maven.xml
06:53:48,792 WARN  [PluginScriptParser] DEPRECATED: the default goal should be specified in the <build> section of project.xml instead of maven.xml
DEPRECATED: the default goal should be specified in the <build> section of project.xml instead of maven.xml
06:53:48,793 WARN  [PluginScriptParser] DEPRECATED: the default goal should be specified in the <build> section of project.xml instead of maven.xml
Attempting to download geronimo-axis-1.1-SNAPSHOT.jar.
06:53:49,121 INFO  [DependencyVerifier] Attempting to download geronimo-axis-1.1-SNAPSHOT.jar.
Error retrieving artifact from [http://dist.codehaus.org]: org.apache.maven.wagon.TransferFailedException: Connection refused
06:53:49,248 WARN  [DependencyVerifier] Error retrieving artifact from [http://dist.codehaus.org]: org.apache.maven.wagon.TransferFailedException: Connection refused
Attempting to download geronimo-connector-builder-1.1-SNAPSHOT.jar.
06:55:24,471 INFO  [DependencyVerifier] Attempting to download geronimo-connector-builder-1.1-SNAPSHOT.jar.
Error retrieving artifact from [http://dist.codehaus.org]: org.apache.maven.wagon.TransferFailedException: Connection refused
06:55:24,584 WARN  [DependencyVerifier] Error retrieving artifact from [http://dist.codehaus.org]: org.apache.maven.wagon.TransferFailedException: Connection refused
build:start:

multiproject:install-callback:
    [echo] Running jar:install for Geronimo :: Axis :: Builder
Tag library requested that is not present: 'geronimo:deploy' in plugin: 'null'
06:56:13,332 WARN  [GoalToJellyScriptHousingMapper] Tag library requested that is not present: 'geronimo:deploy' in plugin: 'null'
java:prepare-filesystem:

java:compile:
<depend closure="false" srcdir="1.4" dump="false" destdir="/home/continuum/continuum-1.0.2/apps/continuum/work/68/modules/axis-builder/target/classes"></depend>    [echo] Compiling to /home/continuum/continuum-1.0.2/apps/continuum/work/68/modules/axis-builder/target/classes

java:jar-resources:

test:prepare-filesystem:

test:test-resources:

test:compile:

test:test:
    [echo] NOTICE: Skipping tests; they seem to have passed already
    [echo] No tests to run.
Running post goal: test:test
06:56:14,339 INFO  [PostGoalTag] Running post goal: test:test

jar:jar:

jar:install:
    [echo] Installing...
Uploading to geronimo/jars/geronimo-axis-builder-1.1-SNAPSHOT.jar: 
.................... (218K)
Uploading to geronimo/poms/geronimo-axis-builder-1.1-SNAPSHOT.pom: 
.................... (15K)

+----------------------------------------

build:end:

06:56:14,715 INFO  [ReactorTag] +----------------------------------------
| geronimo and geronimo-plugins Geronimo :: Client
06:56:14,715 INFO  [ReactorTag] | geronimo and geronimo-plugins Geronimo :: Client
| Memory: 19M/26M
06:56:14,715 INFO  [ReactorTag] | Memory: 19M/26M
+----------------------------------------
06:56:14,715 INFO  [ReactorTag] +----------------------------------------
DEPRECATED: the default goal should be specified in the <build> section of project.xml instead of maven.xml
06:56:14,725 WARN  [PluginScriptParser] DEPRECATED: the default goal should be specified in the <build> section of project.xml instead of maven.xml
build:start:

multiproject:install-callback:
    [echo] Running jar:install for Geronimo :: Client
Tag library requested that is not present: 'geronimo:deploy' in plugin: 'null'
06:56:15,083 WARN  [GoalToJellyScriptHousingMapper] Tag library requested that is not present: 'geronimo:deploy' in plugin: 'null'
java:prepare-filesystem:

java:compile:
<depend closure="false" srcdir="1.4" dump="false" destdir="/home/continuum/continuum-1.0.2/apps/continuum/work/68/modules/client/target/classes"></depend>    [echo] Compiling to /home/continuum/continuum-1.0.2/apps/continuum/work/68/modules/client/target/classes

java:jar-resources:

test:prepare-filesystem:

test:test-resources:

test:compile:
    [echo] No test source files to compile.

test:test:
    [echo] NOTICE: Skipping tests; they seem to have passed already
    [echo] No tests to run.
Running post goal: test:test
06:56:15,817 INFO  [PostGoalTag] Running post goal: test:test

jar:jar:

jar:install:
    [echo] Installing...
Uploading to geronimo/jars/geronimo-client-1.1-SNAPSHOT.jar: 
.................... (14K)
Uploading to geronimo/poms/geronimo-client-1.1-SNAPSHOT.pom: 
.................... (12K)

+----------------------------------------

build:end:

06:56:16,058 INFO  [ReactorTag] +----------------------------------------
| geronimo and geronimo-plugins Geronimo :: Client Builder
06:56:16,058 INFO  [ReactorTag] | geronimo and geronimo-plugins Geronimo :: Client Builder
| Memory: 21M/26M
06:56:16,059 INFO  [ReactorTag] | Memory: 21M/26M
+----------------------------------------
06:56:16,059 INFO  [ReactorTag] +----------------------------------------
DEPRECATED: the default goal should be specified in the <build> section of project.xml instead of maven.xml
06:56:16,077 WARN  [PluginScriptParser] DEPRECATED: the default goal should be specified in the <build> section of project.xml instead of maven.xml
DEPRECATED: the default goal should be specified in the <build> section of project.xml instead of maven.xml
06:56:16,078 WARN  [PluginScriptParser] DEPRECATED: the default goal should be specified in the <build> section of project.xml instead of maven.xml
Attempting to download geronimo-client-1.1-SNAPSHOT.jar.
06:56:16,398 INFO  [DependencyVerifier] Attempting to download geronimo-client-1.1-SNAPSHOT.jar.
Error retrieving artifact from [http://dist.codehaus.org]: org.apache.maven.wagon.TransferFailedException: Connection refused
06:56:16,537 WARN  [DependencyVerifier] Error retrieving artifact from [http://dist.codehaus.org]: org.apache.maven.wagon.TransferFailedException: Connection refused
build:start:

multiproject:install-callback:
    [echo] Running jar:install for Geronimo :: Client Builder
Tag library requested that is not present: 'geronimo:deploy' in plugin: 'null'
06:56:33,670 WARN  [GoalToJellyScriptHousingMapper] Tag library requested that is not present: 'geronimo:deploy' in plugin: 'null'
java:prepare-filesystem:

java:compile:
Adding to classpath: /home/continuum/.geronimo-1.1-maven/repository/geronimo/jars/geronimo-connector-builder-1.1-SNAPSHOT.jar
Adding to classpath: /home/continuum/.geronimo-1.1-maven/repository/geronimo/jars/geronimo-j2ee-schema-1.1-SNAPSHOT.jar
Adding to classpath: /home/continuum/.geronimo-1.1-maven/repository/geronimo/jars/geronimo-naming-builder-1.1-SNAPSHOT.jar
Adding to classpath: /home/continuum/.geronimo-1.1-maven/repository/geronimo/jars/geronimo-security-builder-1.1-SNAPSHOT.jar
Adding to classpath: /home/continuum/.geronimo-1.1-maven/repository/geronimo/jars/geronimo-service-builder-1.1-SNAPSHOT.jar
Time to build schema type system: 0.108 seconds
created binary: schemaorg_apache_xmlbeans/system/s92B327426DDAC63957CD0DF44F8A68AB/applicationclienttypebd36type.xsb
created binary: schemaorg_apache_xmlbeans/system/s92B327426DDAC63957CD0DF44F8A68AB/resourcetype001ctype.xsb
created binary: schemaorg_apache_xmlbeans/system/s92B327426DDAC63957CD0DF44F8A68AB/applicationcliente9ecdoctype.xsb
created binary: schemaorg_apache_xmlbeans/system/s92B327426DDAC63957CD0DF44F8A68AB/applicationclientelement.xsb
created binary: schemaorg_apache_xmlbeans/system/s92B327426DDAC63957CD0DF44F8A68AB/index.xsb
created binary: schemaorg_apache_xmlbeans/element/URI_SHA_1_57C36E0A664A364A4282A9C52D191C548AB03C4B/application_2Dclient.xsb
created binary: schemaorg_apache_xmlbeans/type/URI_SHA_1_57C36E0A664A364A4282A9C52D191C548AB03C4B/application_2DclientType.xsb
created binary: schemaorg_apache_xmlbeans/type/URI_SHA_1_57C36E0A664A364A4282A9C52D191C548AB03C4B/resourceType.xsb
created binary: schemaorg_apache_xmlbeans/namespace/URI_SHA_1_57C36E0A664A364A4282A9C52D191C548AB03C4B/xmlns.xsb
created binary: schemaorg_apache_xmlbeans/javaname/org/apache/geronimo/xbeans/geronimo/client/GerApplicationClientDocument.xsb
created binary: schemaorg_apache_xmlbeans/javaname/org/apache/geronimo/xbeans/geronimo/client/GerApplicationClientType.xsb
created binary: schemaorg_apache_xmlbeans/javaname/org/apache/geronimo/xbeans/geronimo/client/GerResourceType.xsb
created binary: schemaorg_apache_xmlbeans/system/s92B327426DDAC63957CD0DF44F8A68AB/TypeSystemHolder.class
created source: /home/continuum/continuum-1.0.2/apps/continuum/work/68/modules/client-builder/target/xmlbeans/org/apache/geronimo/xbeans/geronimo/client/GerApplicationClientType.java
created source: /home/continuum/continuum-1.0.2/apps/continuum/work/68/modules/client-builder/target/xmlbeans/org/apache/geronimo/xbeans/geronimo/client/impl/GerApplicationClientTypeImpl.java
created source: /home/continuum/continuum-1.0.2/apps/continuum/work/68/modules/client-builder/target/xmlbeans/org/apache/geronimo/xbeans/geronimo/client/GerResourceType.java
created source: /home/continuum/continuum-1.0.2/apps/continuum/work/68/modules/client-builder/target/xmlbeans/org/apache/geronimo/xbeans/geronimo/client/impl/GerResourceTypeImpl.java
created source: /home/continuum/continuum-1.0.2/apps/continuum/work/68/modules/client-builder/target/xmlbeans/org/apache/geronimo/xbeans/geronimo/client/GerApplicationClientDocument.java
created source: /home/continuum/continuum-1.0.2/apps/continuum/work/68/modules/client-builder/target/xmlbeans/org/apache/geronimo/xbeans/geronimo/client/impl/GerApplicationClientDocumentImpl.java
Time to generate code: 0.139 seconds
    [copy] Copying 13 files to /home/continuum/continuum-1.0.2/apps/continuum/work/68/modules/client-builder/target/xmlbeans-classes/schemaorg_apache_xmlbeans
<depend closure="false" srcdir="1.4" dump="false" destdir="/home/continuum/continuum-1.0.2/apps/continuum/work/68/modules/client-builder/target/classes"></depend>    [echo] Compiling to /home/continuum/continuum-1.0.2/apps/continuum/work/68/modules/client-builder/target/classes
    [javac] Compiling 7 source files to /home/continuum/continuum-1.0.2/apps/continuum/work/68/modules/client-builder/target/classes
Running post goal: java:compile
06:56:35,310 INFO  [PostGoalTag] Running post goal: java:compile
geronimo:dependency:


java:jar-resources:
Copying 1 file to /home/continuum/continuum-1.0.2/apps/continuum/work/68/modules/client-builder/target/classes
Copying 1 file to /home/continuum/continuum-1.0.2/apps/continuum/work/68/modules/client-builder/target/classes/META-INF

test:prepare-filesystem:

test:test-resources:
Copying 1 file to /home/continuum/continuum-1.0.2/apps/continuum/work/68/modules/client-builder/target/test-classes/META-INF

test:compile:

test:test:
    [junit] Running org.apache.geronimo.client.builder.PlanParsingTest
    [junit] Tests run: 3, Failures: 0, Errors: 0, Time elapsed: 0.925 sec
Running post goal: test:test
06:56:36,862 INFO  [PostGoalTag] Running post goal: test:test

jar:jar:
    [jar] Building jar: /home/continuum/continuum-1.0.2/apps/continuum/work/68/modules/client-builder/target/geronimo-client-builder-1.1-SNAPSHOT.jar

jar:install:
    [echo] Installing...
Uploading to geronimo/jars/geronimo-client-builder-1.1-SNAPSHOT.jar: 
.................... (53K)
Uploading to geronimo/poms/geronimo-client-builder-1.1-SNAPSHOT.pom: 
.................... (15K)

+----------------------------------------

build:end:

06:56:37,259 INFO  [ReactorTag] +----------------------------------------
| geronimo and geronimo-plugins Geronimo :: Console Web
06:56:37,259 INFO  [ReactorTag] | geronimo and geronimo-plugins Geronimo :: Console Web
| Memory: 23M/35M
06:56:37,259 INFO  [ReactorTag] | Memory: 23M/35M
+----------------------------------------
06:56:37,259 INFO  [ReactorTag] +----------------------------------------
DEPRECATED: the default goal should be specified in the <build> section of project.xml instead of maven.xml
06:56:37,291 WARN  [PluginScriptParser] DEPRECATED: the default goal should be specified in the <build> section of project.xml instead of maven.xml
DEPRECATED: the default goal should be specified in the <build> section of project.xml instead of maven.xml
06:56:37,292 WARN  [PluginScriptParser] DEPRECATED: the default goal should be specified in the <build> section of project.xml instead of maven.xml
build:start:

multiproject:install-callback:
    [echo] Running jar:install for Geronimo :: Console Web
Tag library requested that is not present: 'geronimo:deploy' in plugin: 'null'
06:56:37,653 WARN  [GoalToJellyScriptHousingMapper] Tag library requested that is not present: 'geronimo:deploy' in plugin: 'null'
java:prepare-filesystem:

java:compile:
<depend closure="false" srcdir="1.4" dump="false" destdir="/home/continuum/continuum-1.0.2/apps/continuum/work/68/modules/console-web/target/classes"></depend>    [echo] Compiling to /home/continuum/continuum-1.0.2/apps/continuum/work/68/modules/console-web/target/classes

java:jar-resources:

test:prepare-filesystem:

test:test-resources:

test:compile:
    [echo] No test source files to compile.

test:test:
    [echo] NOTICE: Skipping tests; they seem to have passed already
    [echo] No tests to run.
Running post goal: test:test
06:56:38,292 INFO  [PostGoalTag] Running post goal: test:test

jar:jar:

jar:install:
    [echo] Installing...
Uploading to geronimo/jars/geronimo-console-web-1.1-SNAPSHOT.jar: 
.................... (17K)
Uploading to geronimo/poms/geronimo-console-web-1.1-SNAPSHOT.pom: 
.................... (11K)

+----------------------------------------

build:end:

06:56:38,564 INFO  [ReactorTag] +----------------------------------------
| geronimo and geronimo-plugins Geronimo :: Configuration Converter
06:56:38,564 INFO  [ReactorTag] | geronimo and geronimo-plugins Geronimo :: Configuration Converter
| Memory: 25M/35M
06:56:38,564 INFO  [ReactorTag] | Memory: 25M/35M
+----------------------------------------
06:56:38,564 INFO  [ReactorTag] +----------------------------------------
DEPRECATED: the default goal should be specified in the <build> section of project.xml instead of maven.xml
06:56:38,593 WARN  [PluginScriptParser] DEPRECATED: the default goal should be specified in the <build> section of project.xml instead of maven.xml
DEPRECATED: the default goal should be specified in the <build> section of project.xml instead of maven.xml
06:56:38,594 WARN  [PluginScriptParser] DEPRECATED: the default goal should be specified in the <build> section of project.xml instead of maven.xml
build:start:

multiproject:install-callback:
    [echo] Running jar:install for Geronimo :: Configuration Converter
Tag library requested that is not present: 'geronimo:deploy' in plugin: 'null'
06:56:38,956 WARN  [GoalToJellyScriptHousingMapper] Tag library requested that is not present: 'geronimo:deploy' in plugin: 'null'
java:prepare-filesystem:

java:compile:
<depend closure="false" srcdir="1.4" dump="false" destdir="/home/continuum/continuum-1.0.2/apps/continuum/work/68/modules/converter/target/classes"></depend>    [echo] Compiling to /home/continuum/continuum-1.0.2/apps/continuum/work/68/modules/converter/target/classes

java:jar-resources:

test:prepare-filesystem:

test:test-resources:

test:compile:
    [echo] No test source files to compile.

test:test:
    [echo] NOTICE: Skipping tests; they seem to have passed already
    [echo] No tests to run.
Running post goal: test:test
06:56:39,610 INFO  [PostGoalTag] Running post goal: test:test

jar:jar:

jar:install:
    [echo] Installing...
Uploading to geronimo/jars/geronimo-converter-1.1-SNAPSHOT.jar: 
.................... (25K)
Uploading to geronimo/poms/geronimo-converter-1.1-SNAPSHOT.pom: 
.................... (11K)

+----------------------------------------

build:end:

06:56:39,866 INFO  [ReactorTag] +----------------------------------------
| geronimo and geronimo-plugins Geronimo :: Web :: Builder
06:56:39,867 INFO  [ReactorTag] | geronimo and geronimo-plugins Geronimo :: Web :: Builder
| Memory: 24M/35M
06:56:39,867 INFO  [ReactorTag] | Memory: 24M/35M
+----------------------------------------
06:56:39,867 INFO  [ReactorTag] +----------------------------------------
DEPRECATED: the default goal should be specified in the <build> section of project.xml instead of maven.xml
06:56:39,896 WARN  [PluginScriptParser] DEPRECATED: the default goal should be specified in the <build> section of project.xml instead of maven.xml
DEPRECATED: the default goal should be specified in the <build> section of project.xml instead of maven.xml
06:56:39,897 WARN  [PluginScriptParser] DEPRECATED: the default goal should be specified in the <build> section of project.xml instead of maven.xml
build:start:

multiproject:install-callback:
    [echo] Running jar:install for Geronimo :: Web :: Builder
Tag library requested that is not present: 'geronimo:deploy' in plugin: 'null'
06:56:40,308 WARN  [GoalToJellyScriptHousingMapper] Tag library requested that is not present: 'geronimo:deploy' in plugin: 'null'
java:prepare-filesystem:

java:compile:
<depend closure="false" srcdir="1.4" dump="false" destdir="/home/continuum/continuum-1.0.2/apps/continuum/work/68/modules/web-builder/target/classes"></depend>    [echo] Compiling to /home/continuum/continuum-1.0.2/apps/continuum/work/68/modules/web-builder/target/classes

java:jar-resources:

test:prepare-filesystem:

test:test-resources:

test:compile:

test:test:
    [echo] NOTICE: Skipping tests; they seem to have passed already
    [echo] No tests to run.
Running post goal: test:test
06:56:41,358 INFO  [PostGoalTag] Running post goal: test:test

jar:jar:

jar:install:
    [echo] Installing...
Uploading to geronimo/jars/geronimo-web-builder-1.1-SNAPSHOT.jar: 
.................... (47K)
Uploading to geronimo/poms/geronimo-web-builder-1.1-SNAPSHOT.pom: 
.................... (13K)

+----------------------------------------

build:end:

06:56:41,650 INFO  [ReactorTag] +----------------------------------------
| geronimo and geronimo-plugins Geronimo :: Deploy :: JSR-88
06:56:41,650 INFO  [ReactorTag] | geronimo and geronimo-plugins Geronimo :: Deploy :: JSR-88
| Memory: 26M/35M
06:56:41,651 INFO  [ReactorTag] | Memory: 26M/35M
+----------------------------------------
06:56:41,651 INFO  [ReactorTag] +----------------------------------------
DEPRECATED: the default goal should be specified in the <build> section of project.xml instead of maven.xml
06:56:41,685 WARN  [PluginScriptParser] DEPRECATED: the default goal should be specified in the <build> section of project.xml instead of maven.xml
DEPRECATED: the default goal should be specified in the <build> section of project.xml instead of maven.xml
06:56:41,686 WARN  [PluginScriptParser] DEPRECATED: the default goal should be specified in the <build> section of project.xml instead of maven.xml
Attempting to download geronimo-web-builder-1.1-SNAPSHOT.jar.
06:56:42,008 INFO  [DependencyVerifier] Attempting to download geronimo-web-builder-1.1-SNAPSHOT.jar.
Error retrieving artifact from [http://dist.codehaus.org]: org.apache.maven.wagon.TransferFailedException: Connection refused
06:56:42,123 WARN  [DependencyVerifier] Error retrieving artifact from [http://dist.codehaus.org]: org.apache.maven.wagon.TransferFailedException: Connection refused
build:start:

multiproject:install-callback:
    [echo] Running jar:install for Geronimo :: Deploy :: JSR-88
Tag library requested that is not present: 'geronimo:deploy' in plugin: 'null'
06:57:13,781 WARN  [GoalToJellyScriptHousingMapper] Tag library requested that is not present: 'geronimo:deploy' in plugin: 'null'
java:prepare-filesystem:

java:compile:
<depend closure="false" srcdir="1.4" dump="false" destdir="/home/continuum/continuum-1.0.2/apps/continuum/work/68/modules/deploy-jsr88/target/classes"></depend>    [echo] Compiling to /home/continuum/continuum-1.0.2/apps/continuum/work/68/modules/deploy-jsr88/target/classes

java:jar-resources:

test:prepare-filesystem:

test:test-resources:

test:compile:

test:test:
    [echo] NOTICE: Skipping tests; they seem to have passed already
    [echo] No tests to run.
Running post goal: test:test
06:57:15,057 INFO  [PostGoalTag] Running post goal: test:test

jar:jar:
    [echo] Generating Manifest file for JSR88-Deployer

jar:install:
    [echo] Installing...
Uploading to geronimo/jars/geronimo-deploy-jsr88-1.1-SNAPSHOT.jar: 
.................... (65K)
Uploading to geronimo/poms/geronimo-deploy-jsr88-1.1-SNAPSHOT.pom: 
.................... (13K)

+----------------------------------------

build:end:

06:57:15,733 INFO  [ReactorTag] +----------------------------------------
| geronimo and geronimo-plugins Geronimo :: Deploy :: CLI Tool
06:57:15,733 INFO  [ReactorTag] | geronimo and geronimo-plugins Geronimo :: Deploy :: CLI Tool
| Memory: 28M/35M
06:57:15,734 INFO  [ReactorTag] | Memory: 28M/35M
+----------------------------------------
06:57:15,734 INFO  [ReactorTag] +----------------------------------------
DEPRECATED: the default goal should be specified in the <build> section of project.xml instead of maven.xml
06:57:15,763 WARN  [PluginScriptParser] DEPRECATED: the default goal should be specified in the <build> section of project.xml instead of maven.xml
DEPRECATED: the default goal should be specified in the <build> section of project.xml instead of maven.xml
06:57:15,764 WARN  [PluginScriptParser] DEPRECATED: the default goal should be specified in the <build> section of project.xml instead of maven.xml
Attempting to download geronimo-deploy-jsr88-1.1-SNAPSHOT.jar.
06:57:16,086 INFO  [DependencyVerifier] Attempting to download geronimo-deploy-jsr88-1.1-SNAPSHOT.jar.
Error retrieving artifact from [http://dist.codehaus.org]: org.apache.maven.wagon.TransferFailedException: Connection refused
06:57:16,196 WARN  [DependencyVerifier] Error retrieving artifact from [http://dist.codehaus.org]: org.apache.maven.wagon.TransferFailedException: Connection refused
build:start:

multiproject:install-callback:
    [echo] Running jar:install for Geronimo :: Deploy :: CLI Tool
Tag library requested that is not present: 'geronimo:deploy' in plugin: 'null'
06:58:02,495 WARN  [GoalToJellyScriptHousingMapper] Tag library requested that is not present: 'geronimo:deploy' in plugin: 'null'
java:prepare-filesystem:

java:compile:
<depend closure="false" srcdir="1.4" dump="false" destdir="/home/continuum/continuum-1.0.2/apps/continuum/work/68/modules/deploy-tool/target/classes"></depend>    [echo] Compiling to /home/continuum/continuum-1.0.2/apps/continuum/work/68/modules/deploy-tool/target/classes

java:jar-resources:

test:prepare-filesystem:

test:test-resources:

test:compile:

test:test:
    [echo] NOTICE: Skipping tests; they seem to have passed already
    [echo] No tests to run.
Running post goal: test:test
06:58:03,220 INFO  [PostGoalTag] Running post goal: test:test

jar:jar:

jar:install:
    [echo] Installing...
Uploading to geronimo/jars/geronimo-deploy-tool-1.1-SNAPSHOT.jar: 
.................... (59K)
Uploading to geronimo/poms/geronimo-deploy-tool-1.1-SNAPSHOT.pom: 
.................... (12K)

+----------------------------------------

build:end:

06:58:03,547 INFO  [ReactorTag] +----------------------------------------
| geronimo and geronimo-plugins Geronimo :: Derby
06:58:03,548 INFO  [ReactorTag] | geronimo and geronimo-plugins Geronimo :: Derby
| Memory: 28M/35M
06:58:03,548 INFO  [ReactorTag] | Memory: 28M/35M
+----------------------------------------
06:58:03,548 INFO  [ReactorTag] +----------------------------------------
DEPRECATED: the default goal should be specified in the <build> section of project.xml instead of maven.xml
06:58:03,558 WARN  [PluginScriptParser] DEPRECATED: the default goal should be specified in the <build> section of project.xml instead of maven.xml
build:start:

multiproject:install-callback:
    [echo] Running jar:install for Geronimo :: Derby
Tag library requested that is not present: 'geronimo:deploy' in plugin: 'null'
06:58:03,963 WARN  [GoalToJellyScriptHousingMapper] Tag library requested that is not present: 'geronimo:deploy' in plugin: 'null'
java:prepare-filesystem:

java:compile:
<depend closure="false" srcdir="1.4" dump="false" destdir="/home/continuum/continuum-1.0.2/apps/continuum/work/68/modules/derby/target/classes"></depend>    [echo] Compiling to /home/continuum/continuum-1.0.2/apps/continuum/work/68/modules/derby/target/classes

java:jar-resources:

test:prepare-filesystem:

test:test-resources:

test:compile:

test:test:
    [echo] NOTICE: Skipping tests; they seem to have passed already
    [echo] No tests to run.
Running post goal: test:test
06:58:04,597 INFO  [PostGoalTag] Running post goal: test:test

jar:jar:

jar:install:
    [echo] Installing...
Uploading to geronimo/jars/geronimo-derby-1.1-SNAPSHOT.jar: 
.................... (12K)
Uploading to geronimo/poms/geronimo-derby-1.1-SNAPSHOT.pom: 
.................... (11K)

+----------------------------------------

build:end:

06:58:04,840 INFO  [ReactorTag] +----------------------------------------
| geronimo and geronimo-plugins Geronimo :: Directory
06:58:04,840 INFO  [ReactorTag] | geronimo and geronimo-plugins Geronimo :: Directory
| Memory: 30M/35M
06:58:04,840 INFO  [ReactorTag] | Memory: 30M/35M
+----------------------------------------
06:58:04,840 INFO  [ReactorTag] +----------------------------------------
DEPRECATED: the default goal should be specified in the <build> section of project.xml instead of maven.xml
06:58:04,872 WARN  [PluginScriptParser] DEPRECATED: the default goal should be specified in the <build> section of project.xml instead of maven.xml
DEPRECATED: the default goal should be specified in the <build> section of project.xml instead of maven.xml
06:58:04,874 WARN  [PluginScriptParser] DEPRECATED: the default goal should be specified in the <build> section of project.xml instead of maven.xml
build:start:

multiproject:install-callback:
    [echo] Running jar:install for Geronimo :: Directory
Tag library requested that is not present: 'geronimo:deploy' in plugin: 'null'
06:58:05,284 WARN  [GoalToJellyScriptHousingMapper] Tag library requested that is not present: 'geronimo:deploy' in plugin: 'null'
java:prepare-filesystem:

java:compile:
<depend closure="false" srcdir="1.4" dump="false" destdir="/home/continuum/continuum-1.0.2/apps/continuum/work/68/modules/directory/target/classes"></depend>    [echo] Compiling to /home/continuum/continuum-1.0.2/apps/continuum/work/68/modules/directory/target/classes
Running post goal: java:compile
06:58:05,874 INFO  [PostGoalTag] Running post goal: java:compile
geronimo:dependency:


java:jar-resources:
Copying 1 file to /home/continuum/continuum-1.0.2/apps/continuum/work/68/modules/directory/target/classes

test:prepare-filesystem:

test:test-resources:

test:compile:

test:test:
    [echo] NOTICE: Skipping tests; they seem to have passed already
    [echo] No tests to run.
Running post goal: test:test
06:58:06,474 INFO  [PostGoalTag] Running post goal: test:test

jar:jar:
    [jar] Building jar: /home/continuum/continuum-1.0.2/apps/continuum/work/68/modules/directory/target/geronimo-directory-1.1-SNAPSHOT.jar

jar:install:
    [echo] Installing...
Uploading to geronimo/jars/geronimo-directory-1.1-SNAPSHOT.jar: 
.................... (113K)
Uploading to geronimo/poms/geronimo-directory-1.1-SNAPSHOT.pom: 
.................... (18K)

+----------------------------------------

build:end:

06:58:06,951 INFO  [ReactorTag] +----------------------------------------
| geronimo and geronimo-plugins Geronimo :: Deploy :: Hot Deployer
06:58:06,951 INFO  [ReactorTag] | geronimo and geronimo-plugins Geronimo :: Deploy :: Hot Deployer
| Memory: 30M/35M
06:58:06,951 INFO  [ReactorTag] | Memory: 30M/35M
+----------------------------------------
06:58:06,951 INFO  [ReactorTag] +----------------------------------------
DEPRECATED: the default goal should be specified in the <build> section of project.xml instead of maven.xml
06:58:06,984 WARN  [PluginScriptParser] DEPRECATED: the default goal should be specified in the <build> section of project.xml instead of maven.xml
DEPRECATED: the default goal should be specified in the <build> section of project.xml instead of maven.xml
06:58:06,985 WARN  [PluginScriptParser] DEPRECATED: the default goal should be specified in the <build> section of project.xml instead of maven.xml
Attempting to download geronimo-deploy-tool-1.1-SNAPSHOT.jar.
06:58:07,260 INFO  [DependencyVerifier] Attempting to download geronimo-deploy-tool-1.1-SNAPSHOT.jar.
Error retrieving artifact from [http://dist.codehaus.org]: org.apache.maven.wagon.TransferFailedException: Connection refused
06:58:07,383 WARN  [DependencyVerifier] Error retrieving artifact from [http://dist.codehaus.org]: org.apache.maven.wagon.TransferFailedException: Connection refused
build:start:

multiproject:install-callback:
    [echo] Running jar:install for Geronimo :: Deploy :: Hot Deployer
Tag library requested that is not present: 'geronimo:deploy' in plugin: 'null'
06:58:08,434 WARN  [GoalToJellyScriptHousingMapper] Tag library requested that is not present: 'geronimo:deploy' in plugin: 'null'
java:prepare-filesystem:

java:compile:
<depend closure="false" srcdir="1.4" dump="false" destdir="/home/continuum/continuum-1.0.2/apps/continuum/work/68/modules/hot-deploy/target/classes"></depend>    [echo] Compiling to /home/continuum/continuum-1.0.2/apps/continuum/work/68/modules/hot-deploy/target/classes

java:jar-resources:

test:prepare-filesystem:

test:test-resources:

test:compile:
    [echo] No test source files to compile.

test:test:
    [echo] NOTICE: Skipping tests; they seem to have passed already
    [echo] No tests to run.
Running post goal: test:test
06:58:09,089 INFO  [PostGoalTag] Running post goal: test:test

jar:jar:

jar:install:
    [echo] Installing...
Uploading to geronimo/jars/geronimo-hot-deploy-1.1-SNAPSHOT.jar: 
.................... (19K)
Uploading to geronimo/poms/geronimo-hot-deploy-1.1-SNAPSHOT.pom: 
.................... (12K)

+----------------------------------------

build:end:

06:58:09,333 INFO  [ReactorTag] +----------------------------------------
| geronimo and geronimo-plugins Geronimo :: Installer Processing
06:58:09,333 INFO  [ReactorTag] | geronimo and geronimo-plugins Geronimo :: Installer Processing
| Memory: 31M/35M
06:58:09,333 INFO  [ReactorTag] | Memory: 31M/35M
+----------------------------------------
06:58:09,333 INFO  [ReactorTag] +----------------------------------------
DEPRECATED: the default goal should be specified in the <build> section of project.xml instead of maven.xml
06:58:09,365 WARN  [PluginScriptParser] DEPRECATED: the default goal should be specified in the <build> section of project.xml instead of maven.xml
DEPRECATED: the default goal should be specified in the <build> section of project.xml instead of maven.xml
06:58:09,366 WARN  [PluginScriptParser] DEPRECATED: the default goal should be specified in the <build> section of project.xml instead of maven.xml
build:start:

multiproject:install-callback:
    [echo] Running jar:install for Geronimo :: Installer Processing
Tag library requested that is not present: 'geronimo:deploy' in plugin: 'null'
06:58:09,732 WARN  [GoalToJellyScriptHousingMapper] Tag library requested that is not present: 'geronimo:deploy' in plugin: 'null'
java:prepare-filesystem:

java:compile:
<depend closure="false" srcdir="1.4" dump="false" destdir="/home/continuum/continuum-1.0.2/apps/continuum/work/68/modules/installer-processing/target/classes"></depend>    [echo] Compiling to /home/continuum/continuum-1.0.2/apps/continuum/work/68/modules/installer-processing/target/classes
Running post goal: java:compile
06:58:09,965 INFO  [PostGoalTag] Running post goal: java:compile
geronimo:dependency:

    [echo] Maven local repo is: /home/continuum/.geronimo-1.1-maven/repository
    [echo] Maven build dir is: /home/continuum/continuum-1.0.2/apps/continuum/work/68/modules/installer-processing/target

java:jar-resources:

test:prepare-filesystem:

test:test-resources:

test:compile:
    [echo] No test source files to compile.

test:test:
    [echo] NOTICE: Skipping tests; they seem to have passed already
    [echo] No tests to run.
Running post goal: test:test
06:58:10,493 INFO  [PostGoalTag] Running post goal: test:test

jar:jar:

jar:install:
    [echo] Installing...
Uploading to geronimo/jars/geronimo-installer-processing-1.1-SNAPSHOT.jar: 
.................... (15K)
Uploading to geronimo/poms/geronimo-installer-processing-1.1-SNAPSHOT.pom: 
.................... (10K)

+----------------------------------------

build:end:

06:58:10,737 INFO  [ReactorTag] +----------------------------------------
| geronimo and geronimo-plugins Geronimo :: Installer Support
06:58:10,737 INFO  [ReactorTag] | geronimo and geronimo-plugins Geronimo :: Installer Support
| Memory: 31M/35M
06:58:10,737 INFO  [ReactorTag] | Memory: 31M/35M
+----------------------------------------
06:58:10,737 INFO  [ReactorTag] +----------------------------------------
DEPRECATED: the default goal should be specified in the <build> section of project.xml instead of maven.xml
06:58:10,755 WARN  [PluginScriptParser] DEPRECATED: the default goal should be specified in the <build> section of project.xml instead of maven.xml
DEPRECATED: the default goal should be specified in the <build> section of project.xml instead of maven.xml
06:58:10,757 WARN  [PluginScriptParser] DEPRECATED: the default goal should be specified in the <build> section of project.xml instead of maven.xml
build:start:

multiproject:install-callback:
    [echo] Running jar:install for Geronimo :: Installer Support
Tag library requested that is not present: 'geronimo:deploy' in plugin: 'null'
06:58:11,120 WARN  [GoalToJellyScriptHousingMapper] Tag library requested that is not present: 'geronimo:deploy' in plugin: 'null'
java:prepare-filesystem:

java:compile:
<depend closure="false" srcdir="1.4" dump="false" destdir="/home/continuum/continuum-1.0.2/apps/continuum/work/68/modules/installer-support/target/classes"></depend>    [echo] Compiling to /home/continuum/continuum-1.0.2/apps/continuum/work/68/modules/installer-support/target/classes
Running post goal: java:compile
06:58:11,352 INFO  [PostGoalTag] Running post goal: java:compile
geronimo:dependency:

    [echo] Maven local repo is: /home/continuum/.geronimo-1.1-maven/repository
    [echo] Maven build dir is: /home/continuum/continuum-1.0.2/apps/continuum/work/68/modules/installer-support/target
    [unjar] Expanding: /home/continuum/continuum-1.0.2/apps/continuum/work/68/modules/installer-support/target/standalone-compiler-custom-3.8.0.jar into /home/continuum/continuum-1.0.2/apps/continuum/work/68/modules/installer-support/target/tmp
    [echo] Built Geronimo custom IzPack installer jar
    [echo] Copying standalone-compiler-custom-3.8.0 to local repo

java:jar-resources:

test:prepare-filesystem:

test:test-resources:

test:compile:
    [echo] No test source files to compile.

test:test:
    [echo] NOTICE: Skipping tests; they seem to have passed already
    [echo] No tests to run.
Running post goal: test:test
06:58:13,111 INFO  [PostGoalTag] Running post goal: test:test

jar:jar:

jar:install:
    [echo] Installing...
Uploading to geronimo/jars/geronimo-installer-support-1.1-SNAPSHOT.jar: 
.................... (50K)
Uploading to geronimo/poms/geronimo-installer-support-1.1-SNAPSHOT.pom: 
.................... (10K)

+----------------------------------------

build:end:

06:58:13,345 INFO  [ReactorTag] +----------------------------------------
| geronimo and geronimo-plugins Geronimo :: JavaMail Transport
06:58:13,345 INFO  [ReactorTag] | geronimo and geronimo-plugins Geronimo :: JavaMail Transport
| Memory: 32M/35M
06:58:13,345 INFO  [ReactorTag] | Memory: 32M/35M
+----------------------------------------
06:58:13,345 INFO  [ReactorTag] +----------------------------------------
DEPRECATED: the default goal should be specified in the <build> section of project.xml instead of maven.xml
06:58:13,355 WARN  [PluginScriptParser] DEPRECATED: the default goal should be specified in the <build> section of project.xml instead of maven.xml
build:start:

multiproject:install-callback:
    [echo] Running jar:install for Geronimo :: JavaMail Transport
Tag library requested that is not present: 'geronimo:deploy' in plugin: 'null'
06:58:13,714 WARN  [GoalToJellyScriptHousingMapper] Tag library requested that is not present: 'geronimo:deploy' in plugin: 'null'
java:prepare-filesystem:

java:compile:
<depend closure="false" srcdir="1.4" dump="false" destdir="/home/continuum/continuum-1.0.2/apps/continuum/work/68/modules/javamail-transport/target/classes"></depend>    [echo] Compiling to /home/continuum/continuum-1.0.2/apps/continuum/work/68/modules/javamail-transport/target/classes

java:jar-resources:

test:prepare-filesystem:

test:test-resources:

test:compile:
    [echo] No test source files to compile.

test:test:
    [echo] NOTICE: Skipping tests; they seem to have passed already
    [echo] No tests to run.
Running post goal: test:test
06:58:14,475 INFO  [PostGoalTag] Running post goal: test:test

jar:jar:

jar:install:
    [echo] Installing...
Uploading to geronimo/jars/geronimo-javamail-transport-1.1-SNAPSHOT.jar: 
.................... (39K)
Uploading to geronimo/poms/geronimo-javamail-transport-1.1-SNAPSHOT.pom: 
.................... (10K)

+----------------------------------------

build:end:

06:58:14,709 INFO  [ReactorTag] +----------------------------------------
| geronimo and geronimo-plugins Geronimo :: Jetty
06:58:14,709 INFO  [ReactorTag] | geronimo and geronimo-plugins Geronimo :: Jetty
| Memory: 32M/35M
06:58:14,709 INFO  [ReactorTag] | Memory: 32M/35M
+----------------------------------------
06:58:14,710 INFO  [ReactorTag] +----------------------------------------
DEPRECATED: the default goal should be specified in the <build> section of project.xml instead of maven.xml
06:58:14,737 WARN  [PluginScriptParser] DEPRECATED: the default goal should be specified in the <build> section of project.xml instead of maven.xml
DEPRECATED: the default goal should be specified in the <build> section of project.xml instead of maven.xml
06:58:14,737 WARN  [PluginScriptParser] DEPRECATED: the default goal should be specified in the <build> section of project.xml instead of maven.xml
build:start:

multiproject:install-callback:
    [echo] Running jar:install for Geronimo :: Jetty
Tag library requested that is not present: 'geronimo:deploy' in plugin: 'null'
06:58:15,146 WARN  [GoalToJellyScriptHousingMapper] Tag library requested that is not present: 'geronimo:deploy' in plugin: 'null'
java:prepare-filesystem:

java:compile:
<depend closure="false" srcdir="1.4" dump="false" destdir="/home/continuum/continuum-1.0.2/apps/continuum/work/68/modules/jetty/target/classes"></depend>    [echo] Compiling to /home/continuum/continuum-1.0.2/apps/continuum/work/68/modules/jetty/target/classes
Running post goal: java:compile
06:58:15,427 INFO  [PostGoalTag] Running post goal: java:compile
geronimo:dependency:


java:jar-resources:
Copying 1 file to /home/continuum/continuum-1.0.2/apps/continuum/work/68/modules/jetty/target/classes

test:prepare-filesystem:

test:test-resources:

test:compile:

test:test:
    [echo] NOTICE: Skipping tests; they seem to have passed already
    [echo] No tests to run.
Running post goal: test:test
06:58:15,938 INFO  [PostGoalTag] Running post goal: test:test

jar:jar:
    [jar] Building jar: /home/continuum/continuum-1.0.2/apps/continuum/work/68/modules/jetty/target/geronimo-jetty-1.1-SNAPSHOT.jar

jar:install:
    [echo] Installing...
Uploading to geronimo/jars/geronimo-jetty-1.1-SNAPSHOT.jar: 
.................... (82K)
Uploading to geronimo/poms/geronimo-jetty-1.1-SNAPSHOT.pom: 
.................... (16K)

+----------------------------------------

build:end:

06:58:16,323 INFO  [ReactorTag] +----------------------------------------
| geronimo and geronimo-plugins Geronimo :: Jetty :: Builder
06:58:16,324 INFO  [ReactorTag] | geronimo and geronimo-plugins Geronimo :: Jetty :: Builder
| Memory: 33M/35M
06:58:16,324 INFO  [ReactorTag] | Memory: 33M/35M
+----------------------------------------
06:58:16,324 INFO  [ReactorTag] +----------------------------------------
DEPRECATED: the default goal should be specified in the <build> section of project.xml instead of maven.xml
06:58:16,352 WARN  [PluginScriptParser] DEPRECATED: the default goal should be specified in the <build> section of project.xml instead of maven.xml
DEPRECATED: the default goal should be specified in the <build> section of project.xml instead of maven.xml
06:58:16,354 WARN  [PluginScriptParser] DEPRECATED: the default goal should be specified in the <build> section of project.xml instead of maven.xml
Attempting to download geronimo-jetty-1.1-SNAPSHOT.jar.
06:58:16,913 INFO  [DependencyVerifier] Attempting to download geronimo-jetty-1.1-SNAPSHOT.jar.
Error retrieving artifact from [http://dist.codehaus.org]: org.apache.maven.wagon.TransferFailedException: Connection refused
06:58:17,026 WARN  [DependencyVerifier] Error retrieving artifact from [http://dist.codehaus.org]: org.apache.maven.wagon.TransferFailedException: Connection refused
build:start:

multiproject:install-callback:
    [echo] Running jar:install for Geronimo :: Jetty :: Builder
Tag library requested that is not present: 'geronimo:deploy' in plugin: 'null'
06:58:21,982 WARN  [GoalToJellyScriptHousingMapper] Tag library requested that is not present: 'geronimo:deploy' in plugin: 'null'
java:prepare-filesystem:

java:compile:
<depend closure="false" srcdir="1.4" dump="false" destdir="/home/continuum/continuum-1.0.2/apps/continuum/work/68/modules/jetty-builder/target/classes"></depend>    [echo] Compiling to /home/continuum/continuum-1.0.2/apps/continuum/work/68/modules/jetty-builder/target/classes
    [javac] Compiling 1 source file to /home/continuum/continuum-1.0.2/apps/continuum/work/68/modules/jetty-builder/target/classes

java:jar-resources:

test:prepare-filesystem:

test:test-resources:

test:compile:

test:test:
    [junit] Running org.apache.geronimo.jetty.deployment.JettyModuleBuilderTest
    [junit] Tests run: 2, Failures: 0, Errors: 0, Time elapsed: 5.065 sec
    [junit] Running org.apache.geronimo.jetty.deployment.PlanParsingTest
    [junit] Tests run: 15, Failures: 0, Errors: 0, Time elapsed: 1.089 sec
    [junit] Running org.apache.geronimo.jetty.deployment.StartupOrderComparatorTest
    [junit] Tests run: 5, Failures: 0, Errors: 0, Time elapsed: 0.802 sec
Running post goal: test:test
06:58:32,809 INFO  [PostGoalTag] Running post goal: test:test

jar:jar:
    [jar] Building jar: /home/continuum/continuum-1.0.2/apps/continuum/work/68/modules/jetty-builder/target/geronimo-jetty-builder-1.1-SNAPSHOT.jar

jar:install:
    [echo] Installing...
Uploading to geronimo/jars/geronimo-jetty-builder-1.1-SNAPSHOT.jar: 
.................... (66K)
Uploading to geronimo/poms/geronimo-jetty-builder-1.1-SNAPSHOT.pom: 
.................... (18K)

+----------------------------------------

build:end:

06:58:33,183 INFO  [ReactorTag] +----------------------------------------
| geronimo and geronimo-plugins Geronimo :: JMX Remoting
06:58:33,183 INFO  [ReactorTag] | geronimo and geronimo-plugins Geronimo :: JMX Remoting
| Memory: 25M/35M
06:58:33,183 INFO  [ReactorTag] | Memory: 25M/35M
+----------------------------------------
06:58:33,183 INFO  [ReactorTag] +----------------------------------------
DEPRECATED: the default goal should be specified in the <build> section of project.xml instead of maven.xml
06:58:33,193 WARN  [PluginScriptParser] DEPRECATED: the default goal should be specified in the <build> section of project.xml instead of maven.xml
build:start:

multiproject:install-callback:
    [echo] Running jar:install for Geronimo :: JMX Remoting
Tag library requested that is not present: 'geronimo:deploy' in plugin: 'null'
06:58:33,598 WARN  [GoalToJellyScriptHousingMapper] Tag library requested that is not present: 'geronimo:deploy' in plugin: 'null'
java:prepare-filesystem:

java:compile:
<depend closure="false" srcdir="1.4" dump="false" destdir="/home/continuum/continuum-1.0.2/apps/continuum/work/68/modules/jmx-remoting/target/classes"></depend>    [echo] Compiling to /home/continuum/continuum-1.0.2/apps/continuum/work/68/modules/jmx-remoting/target/classes

java:jar-resources:

test:prepare-filesystem:

test:test-resources:

test:compile:

test:test:
    [echo] NOTICE: Skipping tests; they seem to have passed already
    [echo] No tests to run.
Running post goal: test:test
06:58:34,303 INFO  [PostGoalTag] Running post goal: test:test

jar:jar:

jar:install:
    [echo] Installing...
Uploading to geronimo/jars/geronimo-jmxremoting-1.1-SNAPSHOT.jar: 
.................... (10K)
Uploading to geronimo/poms/geronimo-jmxremoting-1.1-SNAPSHOT.pom: 
.................... (11K)

+----------------------------------------

build:end:

06:58:34,575 INFO  [ReactorTag] +----------------------------------------
| geronimo and geronimo-plugins Geronimo :: Mail
06:58:34,575 INFO  [ReactorTag] | geronimo and geronimo-plugins Geronimo :: Mail
| Memory: 27M/35M
06:58:34,576 INFO  [ReactorTag] | Memory: 27M/35M
+----------------------------------------
06:58:34,576 INFO  [ReactorTag] +----------------------------------------
DEPRECATED: the default goal should be specified in the <build> section of project.xml instead of maven.xml
06:58:34,603 WARN  [PluginScriptParser] DEPRECATED: the default goal should be specified in the <build> section of project.xml instead of maven.xml
DEPRECATED: the default goal should be specified in the <build> section of project.xml instead of maven.xml
06:58:34,604 WARN  [PluginScriptParser] DEPRECATED: the default goal should be specified in the <build> section of project.xml instead of maven.xml
build:start:

multiproject:install-callback:
    [echo] Running jar:install for Geronimo :: Mail
Tag library requested that is not present: 'geronimo:deploy' in plugin: 'null'
06:58:35,011 WARN  [GoalToJellyScriptHousingMapper] Tag library requested that is not present: 'geronimo:deploy' in plugin: 'null'
java:prepare-filesystem:

java:compile:
<depend closure="false" srcdir="1.4" dump="false" destdir="/home/continuum/continuum-1.0.2/apps/continuum/work/68/modules/mail/target/classes"></depend>    [echo] Compiling to /home/continuum/continuum-1.0.2/apps/continuum/work/68/modules/mail/target/classes
Running post goal: java:compile
06:58:35,247 INFO  [PostGoalTag] Running post goal: java:compile
geronimo:dependency:


java:jar-resources:
Copying 1 file to /home/continuum/continuum-1.0.2/apps/continuum/work/68/modules/mail/target/classes

test:prepare-filesystem:

test:test-resources:

test:compile:

test:test:
    [echo] NOTICE: Skipping tests; they seem to have passed already
    [echo] No tests to run.
Running post goal: test:test
06:58:35,677 INFO  [PostGoalTag] Running post goal: test:test

jar:jar:
    [jar] Building jar: /home/continuum/continuum-1.0.2/apps/continuum/work/68/modules/mail/target/geronimo-mail-1.1-SNAPSHOT.jar

jar:install:
    [echo] Installing...
Uploading to geronimo/jars/geronimo-mail-1.1-SNAPSHOT.jar: 
.................... (21K)
Uploading to geronimo/poms/geronimo-mail-1.1-SNAPSHOT.pom: 
.................... (11K)

+----------------------------------------

build:end:

06:58:35,969 INFO  [ReactorTag] +----------------------------------------
| geronimo and geronimo-plugins Geronimo :: Scripts
06:58:35,969 INFO  [ReactorTag] | geronimo and geronimo-plugins Geronimo :: Scripts
| Memory: 27M/35M
06:58:35,969 INFO  [ReactorTag] | Memory: 27M/35M
+----------------------------------------
06:58:35,970 INFO  [ReactorTag] +----------------------------------------
DEPRECATED: the default goal should be specified in the <build> section of project.xml instead of maven.xml
06:58:35,979 WARN  [PluginScriptParser] DEPRECATED: the default goal should be specified in the <build> section of project.xml instead of maven.xml
build:start:

multiproject:install-callback:
    [echo] Running jar:install for Geronimo :: Scripts
Tag library requested that is not present: 'geronimo:deploy' in plugin: 'null'
06:58:36,339 WARN  [GoalToJellyScriptHousingMapper] Tag library requested that is not present: 'geronimo:deploy' in plugin: 'null'
java:prepare-filesystem:

java:compile:
    [echo] Compiling to /home/continuum/continuum-1.0.2/apps/continuum/work/68/modules/scripts/target/classes
    [echo] No java source files to compile.

java:jar-resources:

test:prepare-filesystem:

test:test-resources:

test:compile:
    [echo] No test source files to compile.

test:test:
    [echo] NOTICE: Skipping tests; they seem to have passed already
    [echo] No tests to run.
Running post goal: test:test
06:58:37,048 INFO  [PostGoalTag] Running post goal: test:test

jar:jar:

jar:install:
    [echo] Installing...
Uploading to geronimo/jars/geronimo-scripts-1.1-SNAPSHOT.jar: 
.................... (3214K)
Uploading to geronimo/poms/geronimo-scripts-1.1-SNAPSHOT.pom: 
.................... (10K)

+----------------------------------------

build:end:

06:58:37,696 INFO  [ReactorTag] +----------------------------------------
| geronimo and geronimo-plugins Geronimo :: Timer
06:58:37,696 INFO  [ReactorTag] | geronimo and geronimo-plugins Geronimo :: Timer
| Memory: 28M/35M
06:58:37,696 INFO  [ReactorTag] | Memory: 28M/35M
+----------------------------------------
06:58:37,696 INFO  [ReactorTag] +----------------------------------------
DEPRECATED: the default goal should be specified in the <build> section of project.xml instead of maven.xml
06:58:37,708 WARN  [PluginScriptParser] DEPRECATED: the default goal should be specified in the <build> section of project.xml instead of maven.xml
build:start:

multiproject:install-callback:
    [echo] Running jar:install for Geronimo :: Timer
Tag library requested that is not present: 'geronimo:deploy' in plugin: 'null'
06:58:38,131 WARN  [GoalToJellyScriptHousingMapper] Tag library requested that is not present: 'geronimo:deploy' in plugin: 'null'
java:prepare-filesystem:

java:compile:
<depend closure="false" srcdir="1.4" dump="false" destdir="/home/continuum/continuum-1.0.2/apps/continuum/work/68/modules/timer/target/classes"></depend>    [echo] Compiling to /home/continuum/continuum-1.0.2/apps/continuum/work/68/modules/timer/target/classes

java:jar-resources:

test:prepare-filesystem:

test:test-resources:

test:compile:

test:test:
    [echo] NOTICE: Skipping tests; they seem to have passed already
    [echo] No tests to run.
Running post goal: test:test
06:58:38,831 INFO  [PostGoalTag] Running post goal: test:test

jar:jar:

jar:install:
    [echo] Installing...
Uploading to geronimo/jars/geronimo-timer-1.1-SNAPSHOT.jar: 
.................... (38K)
Uploading to geronimo/poms/geronimo-timer-1.1-SNAPSHOT.pom: 
.................... (12K)

+----------------------------------------

build:end:

06:58:39,080 INFO  [ReactorTag] +----------------------------------------
| geronimo and geronimo-plugins Geronimo :: Tomcat
06:58:39,080 INFO  [ReactorTag] | geronimo and geronimo-plugins Geronimo :: Tomcat
| Memory: 28M/35M
06:58:39,080 INFO  [ReactorTag] | Memory: 28M/35M
+----------------------------------------
06:58:39,080 INFO  [ReactorTag] +----------------------------------------
DEPRECATED: the default goal should be specified in the <build> section of project.xml instead of maven.xml
06:58:39,116 WARN  [PluginScriptParser] DEPRECATED: the default goal should be specified in the <build> section of project.xml instead of maven.xml
DEPRECATED: the default goal should be specified in the <build> section of project.xml instead of maven.xml
06:58:39,119 WARN  [PluginScriptParser] DEPRECATED: the default goal should be specified in the <build> section of project.xml instead of maven.xml
Attempting to download commons-modeler-1.2-GERONIMO-SNAPSHOT.jar.
06:58:39,438 INFO  [DependencyVerifier] Attempting to download commons-modeler-1.2-GERONIMO-SNAPSHOT.jar.
Error retrieving artifact from [http://dist.codehaus.org]: org.apache.maven.wagon.TransferFailedException: Connection refused
06:58:39,575 WARN  [DependencyVerifier] Error retrieving artifact from [http://dist.codehaus.org]: org.apache.maven.wagon.TransferFailedException: Connection refused
build:start:

multiproject:install-callback:
    [echo] Running jar:install for Geronimo :: Tomcat
Tag library requested that is not present: 'geronimo:deploy' in plugin: 'null'
06:58:51,290 WARN  [GoalToJellyScriptHousingMapper] Tag library requested that is not present: 'geronimo:deploy' in plugin: 'null'
java:prepare-filesystem:

java:compile:
<depend closure="false" srcdir="1.4" dump="false" destdir="/home/continuum/continuum-1.0.2/apps/continuum/work/68/modules/tomcat/target/classes"></depend>    [echo] Compiling to /home/continuum/continuum-1.0.2/apps/continuum/work/68/modules/tomcat/target/classes
Running post goal: java:compile
06:58:51,564 INFO  [PostGoalTag] Running post goal: java:compile
geronimo:dependency:


java:jar-resources:
Copying 1 file to /home/continuum/continuum-1.0.2/apps/continuum/work/68/modules/tomcat/target/classes

test:prepare-filesystem:

test:test-resources:

test:compile:

test:test:
    [echo] NOTICE: Skipping tests; they seem to have passed already
    [echo] No tests to run.
Running post goal: test:test
06:58:52,596 INFO  [PostGoalTag] Running post goal: test:test

jar:jar:
    [jar] Building jar: /home/continuum/continuum-1.0.2/apps/continuum/work/68/modules/tomcat/target/geronimo-tomcat-1.1-SNAPSHOT.jar

jar:install:
    [echo] Installing...
Uploading to geronimo/jars/geronimo-tomcat-1.1-SNAPSHOT.jar: 
.................... (132K)
Uploading to geronimo/poms/geronimo-tomcat-1.1-SNAPSHOT.pom: 
.................... (20K)

+----------------------------------------

build:end:

06:58:53,087 INFO  [ReactorTag] +----------------------------------------
| geronimo and geronimo-plugins Geronimo :: Tomcat :: Builder
06:58:53,087 INFO  [ReactorTag] | geronimo and geronimo-plugins Geronimo :: Tomcat :: Builder
| Memory: 30M/35M
06:58:53,087 INFO  [ReactorTag] | Memory: 30M/35M
+----------------------------------------
06:58:53,087 INFO  [ReactorTag] +----------------------------------------
DEPRECATED: the default goal should be specified in the <build> section of project.xml instead of maven.xml
06:58:53,126 WARN  [PluginScriptParser] DEPRECATED: the default goal should be specified in the <build> section of project.xml instead of maven.xml
DEPRECATED: the default goal should be specified in the <build> section of project.xml instead of maven.xml
06:58:53,127 WARN  [PluginScriptParser] DEPRECATED: the default goal should be specified in the <build> section of project.xml instead of maven.xml
Attempting to download geronimo-tomcat-1.1-SNAPSHOT.jar.
06:58:53,445 INFO  [DependencyVerifier] Attempting to download geronimo-tomcat-1.1-SNAPSHOT.jar.
Error retrieving artifact from [http://dist.codehaus.org]: org.apache.maven.wagon.TransferFailedException: Connection refused
06:58:53,555 WARN  [DependencyVerifier] Error retrieving artifact from [http://dist.codehaus.org]: org.apache.maven.wagon.TransferFailedException: Connection refused
Attempting to download geronimo-axis-builder-1.1-SNAPSHOT.jar.
07:06:14,448 INFO  [DependencyVerifier] Attempting to download geronimo-axis-builder-1.1-SNAPSHOT.jar.
Error retrieving artifact from [http://dist.codehaus.org]: org.apache.maven.wagon.TransferFailedException: Connection refused
07:06:14,560 WARN  [DependencyVerifier] Error retrieving artifact from [http://dist.codehaus.org]: org.apache.maven.wagon.TransferFailedException: Connection refused
build:start:

multiproject:install-callback:
    [echo] Running jar:install for Geronimo :: Tomcat :: Builder
Tag library requested that is not present: 'geronimo:deploy' in plugin: 'null'
07:06:16,944 WARN  [GoalToJellyScriptHousingMapper] Tag library requested that is not present: 'geronimo:deploy' in plugin: 'null'
java:prepare-filesystem:

java:compile:
<depend closure="false" srcdir="1.4" dump="false" destdir="/home/continuum/continuum-1.0.2/apps/continuum/work/68/modules/tomcat-builder/target/classes"></depend>    [echo] Compiling to /home/continuum/continuum-1.0.2/apps/continuum/work/68/modules/tomcat-builder/target/classes
    [javac] Compiling 1 source file to /home/continuum/continuum-1.0.2/apps/continuum/work/68/modules/tomcat-builder/target/classes

java:jar-resources:

test:prepare-filesystem:

test:test-resources:

test:compile:

test:test:
    [junit] Running org.apache.geronimo.tomcat.deployment.PlanParsingTest
    [junit] Tests run: 2, Failures: 0, Errors: 0, Time elapsed: 1.279 sec
    [junit] Running org.apache.geronimo.tomcat.deployment.TomcatModuleBuilderTest
    [junit] Tests run: 3, Failures: 0, Errors: 0, Time elapsed: 8.495 sec
Running post goal: test:test
07:06:30,409 INFO  [PostGoalTag] Running post goal: test:test

jar:jar:
    [jar] Building jar: /home/continuum/continuum-1.0.2/apps/continuum/work/68/modules/tomcat-builder/target/geronimo-tomcat-builder-1.1-SNAPSHOT.jar

jar:install:
    [echo] Installing...
Uploading to geronimo/jars/geronimo-tomcat-builder-1.1-SNAPSHOT.jar: 
.................... (66K)
Uploading to geronimo/poms/geronimo-tomcat-builder-1.1-SNAPSHOT.pom: 
.................... (20K)

+----------------------------------------

build:end:

07:06:30,950 INFO  [ReactorTag] +----------------------------------------
| geronimo and geronimo-plugins Geronimo :: Upgrade
07:06:30,950 INFO  [ReactorTag] | geronimo and geronimo-plugins Geronimo :: Upgrade
| Memory: 26M/42M
07:06:30,950 INFO  [ReactorTag] | Memory: 26M/42M
+----------------------------------------
07:06:30,950 INFO  [ReactorTag] +----------------------------------------
DEPRECATED: the default goal should be specified in the <build> section of project.xml instead of maven.xml
07:06:30,989 WARN  [PluginScriptParser] DEPRECATED: the default goal should be specified in the <build> section of project.xml instead of maven.xml
DEPRECATED: the default goal should be specified in the <build> section of project.xml instead of maven.xml
07:06:30,991 WARN  [PluginScriptParser] DEPRECATED: the default goal should be specified in the <build> section of project.xml instead of maven.xml
build:start:

multiproject:install-callback:
    [echo] Running jar:install for Geronimo :: Upgrade
Tag library requested that is not present: 'geronimo:deploy' in plugin: 'null'
07:06:31,395 WARN  [GoalToJellyScriptHousingMapper] Tag library requested that is not present: 'geronimo:deploy' in plugin: 'null'
java:prepare-filesystem:

java:compile:
<depend closure="false" srcdir="1.4" dump="false" destdir="/home/continuum/continuum-1.0.2/apps/continuum/work/68/modules/upgrade/target/classes"></depend>    [echo] Compiling to /home/continuum/continuum-1.0.2/apps/continuum/work/68/modules/upgrade/target/classes

java:jar-resources:

test:prepare-filesystem:

test:test-resources:

test:compile:

test:test:
    [echo] NOTICE: Skipping tests; they seem to have passed already
    [echo] No tests to run.
Running post goal: test:test
07:06:32,027 INFO  [PostGoalTag] Running post goal: test:test

jar:jar:
    [jar] Building jar: /home/continuum/continuum-1.0.2/apps/continuum/work/68/modules/upgrade/target/geronimo-upgrade-1.1-SNAPSHOT.jar

jar:install:
    [echo] Installing...
Uploading to geronimo/jars/geronimo-upgrade-1.1-SNAPSHOT.jar: 
.................... (4955K)
Uploading to geronimo/poms/geronimo-upgrade-1.1-SNAPSHOT.pom: 
.................... (10K)

+----------------------------------------

build:end:

07:06:43,292 INFO  [ReactorTag] +----------------------------------------
| geronimo and geronimo-plugins Geronimo :: Maven Assembly Plugin
07:06:43,292 INFO  [ReactorTag] | geronimo and geronimo-plugins Geronimo :: Maven Assembly Plugin
| Memory: 34M/42M
07:06:43,292 INFO  [ReactorTag] | Memory: 34M/42M
+----------------------------------------
07:06:43,292 INFO  [ReactorTag] +----------------------------------------
DEPRECATED: the default goal should be specified in the <build> section of project.xml instead of maven.xml
07:06:43,333 WARN  [PluginScriptParser] DEPRECATED: the default goal should be specified in the <build> section of project.xml instead of maven.xml
build:start:

multiproject:install-callback:
    [echo] Running plugin:repository-install for Geronimo :: Maven Assembly Plugin
plugin:plugin:
java:prepare-filesystem:

java:compile:
    [echo] Compiling to /home/continuum/continuum-1.0.2/apps/continuum/work/68/plugins/geronimo-assembly-plugin/target/classes

java:jar-resources:

test:prepare-filesystem:

test:test-resources:

test:compile:
    [echo] No test source files to compile.

test:test:
    [echo] No tests to run.

jar:jar:


plugin:repository-install:
    [echo] Installing...
Uploading to geronimo/plugins/geronimo-assembly-plugin-1.1.0-12.jar: 
.................... (17K)
Uploading to geronimo/poms/geronimo-assembly-plugin-1.1.0-12.pom: 
.................... (1K)

+----------------------------------------

build:end:

07:06:44,301 INFO  [ReactorTag] +----------------------------------------
| geronimo and geronimo-plugins Geronimo :: Maven Deployment Plugin
07:06:44,301 INFO  [ReactorTag] | geronimo and geronimo-plugins Geronimo :: Maven Deployment Plugin
| Memory: 34M/42M
07:06:44,301 INFO  [ReactorTag] | Memory: 34M/42M
+----------------------------------------
07:06:44,301 INFO  [ReactorTag] +----------------------------------------
DEPRECATED: the default goal should be specified in the <build> section of project.xml instead of maven.xml
07:06:44,320 WARN  [PluginScriptParser] DEPRECATED: the default goal should be specified in the <build> section of project.xml instead of maven.xml
build:start:

multiproject:install-callback:
    [echo] Running plugin:repository-install for Geronimo :: Maven Deployment Plugin
plugin:plugin:
java:prepare-filesystem:

java:compile:
    [echo] Compiling to /home/continuum/continuum-1.0.2/apps/continuum/work/68/plugins/geronimo-deployment-plugin/target/classes

java:jar-resources:

test:prepare-filesystem:

test:test-resources:

test:compile:
    [echo] No test source files to compile.

test:test:
    [echo] No tests to run.

jar:jar:


plugin:repository-install:
    [echo] Installing...
Uploading to geronimo/plugins/geronimo-deployment-plugin-1.1.0-3.jar: 
.................... (33K)
Uploading to geronimo/poms/geronimo-deployment-plugin-1.1.0-3.pom: 
.................... (3K)

+----------------------------------------

build:end:

07:06:45,270 INFO  [ReactorTag] +----------------------------------------
| geronimo and geronimo-plugins Geronimo :: IZPack Installer Build Plugin
07:06:45,270 INFO  [ReactorTag] | geronimo and geronimo-plugins Geronimo :: IZPack Installer Build Plugin
| Memory: 35M/42M
07:06:45,270 INFO  [ReactorTag] | Memory: 35M/42M
+----------------------------------------
07:06:45,270 INFO  [ReactorTag] +----------------------------------------
DEPRECATED: the default goal should be specified in the <build> section of project.xml instead of maven.xml
07:06:45,287 WARN  [PluginScriptParser] DEPRECATED: the default goal should be specified in the <build> section of project.xml instead of maven.xml
build:start:

multiproject:install-callback:
    [echo] Running plugin:repository-install for Geronimo :: IZPack Installer Build Plugin
plugin:plugin:
java:prepare-filesystem:

java:compile:
    [echo] Compiling to /home/continuum/continuum-1.0.2/apps/continuum/work/68/plugins/geronimo-izpack-plugin/target/classes
    [echo] No java source files to compile.

java:jar-resources:

test:prepare-filesystem:

test:test-resources:

test:compile:
    [echo] No test source files to compile.

test:test:
    [echo] No tests to run.

jar:jar:


plugin:repository-install:
    [echo] Installing...
Uploading to geronimo/plugins/geronimo-izpack-plugin-1.1-SNAPSHOT.jar: 
.................... (7K)
Uploading to geronimo/poms/geronimo-izpack-plugin-1.1-SNAPSHOT.pom: 
.................... (1K)

+----------------------------------------

build:end:

07:06:46,111 INFO  [ReactorTag] +----------------------------------------
| geronimo and geronimo-plugins Geronimo :: Maven Packaging Plugin
07:06:46,111 INFO  [ReactorTag] | geronimo and geronimo-plugins Geronimo :: Maven Packaging Plugin
| Memory: 34M/42M
07:06:46,111 INFO  [ReactorTag] | Memory: 34M/42M
+----------------------------------------
07:06:46,112 INFO  [ReactorTag] +----------------------------------------
DEPRECATED: the default goal should be specified in the <build> section of project.xml instead of maven.xml
07:06:46,142 WARN  [PluginScriptParser] DEPRECATED: the default goal should be specified in the <build> section of project.xml instead of maven.xml
build:start:

multiproject:install-callback:
    [echo] Running plugin:repository-install for Geronimo :: Maven Packaging Plugin
plugin:plugin:
java:prepare-filesystem:

java:compile:
    [echo] Compiling to /home/continuum/continuum-1.0.2/apps/continuum/work/68/plugins/geronimo-packaging-plugin/target/classes

java:jar-resources:

test:prepare-filesystem:

test:test-resources:

test:compile:

test:test:
    [junit] Running org.apache.geronimo.plugin.packaging.PlanProcessorTest
    [junit] Tests run: 1, Failures: 0, Errors: 0, Time elapsed: 0.885 sec

jar:jar:


plugin:repository-install:
    [echo] Installing...
Uploading to geronimo/plugins/geronimo-packaging-plugin-1.1.0-9.jar: 
.................... (33K)
Uploading to geronimo/poms/geronimo-packaging-plugin-1.1.0-9.pom: 
.................... (4K)


build:end:


Starting the reactor...
new2:
07:06:48,579 INFO  [ReactorTag] Starting the reactor...
Our processing order:
07:06:48,903 INFO  [ReactorTag] Our processing order:
OpenEJB :: Core
07:06:48,903 INFO  [ReactorTag] OpenEJB :: Core
OpenEJB :: PK Generation :: Builder
07:06:48,903 INFO  [ReactorTag] OpenEJB :: PK Generation :: Builder
OpenEJB :: Builder
07:06:48,903 INFO  [ReactorTag] OpenEJB :: Builder
+----------------------------------------
07:06:48,904 INFO  [ReactorTag] +----------------------------------------
| openejb OpenEJB :: Core
07:06:48,904 INFO  [ReactorTag] | openejb OpenEJB :: Core
| Memory: 36M/42M
07:06:48,904 INFO  [ReactorTag] | Memory: 36M/42M
+----------------------------------------
07:06:48,904 INFO  [ReactorTag] +----------------------------------------
DEPRECATED: the default goal should be specified in the <build> section of project.xml instead of maven.xml
07:06:48,915 WARN  [PluginScriptParser] DEPRECATED: the default goal should be specified in the <build> section of project.xml instead of maven.xml
DEPRECATED: the default goal should be specified in the <build> section of project.xml instead of maven.xml
07:06:48,937 WARN  [PluginScriptParser] DEPRECATED: the default goal should be specified in the <build> section of project.xml instead of maven.xml
Attempting to download geronimo-timer-1.1-SNAPSHOT.jar.
07:06:49,268 INFO  [DependencyVerifier] Attempting to download geronimo-timer-1.1-SNAPSHOT.jar.
Error retrieving artifact from [http://www.openejb.org/maven]: org.apache.maven.wagon.TransferFailedException: Connection refused
07:06:49,616 WARN  [DependencyVerifier] Error retrieving artifact from [http://www.openejb.org/maven]: org.apache.maven.wagon.TransferFailedException: Connection refused
Error retrieving artifact from [http://dist.codehaus.org]: org.apache.maven.wagon.TransferFailedException: Connection refused
07:06:59,224 WARN  [DependencyVerifier] Error retrieving artifact from [http://dist.codehaus.org]: org.apache.maven.wagon.TransferFailedException: Connection refused
Attempting to download geronimo-spec-corba-1.0-SNAPSHOT.jar.
07:06:59,225 INFO  [DependencyVerifier] Attempting to download geronimo-spec-corba-1.0-SNAPSHOT.jar.
Error retrieving artifact from [http://www.openejb.org/maven]: org.apache.maven.wagon.TransferFailedException: Connection refused
07:06:59,377 WARN  [DependencyVerifier] Error retrieving artifact from [http://www.openejb.org/maven]: org.apache.maven.wagon.TransferFailedException: Connection refused
Error retrieving artifact from [http://dist.codehaus.org]: org.apache.maven.wagon.TransferFailedException: Connection refused
07:07:29,538 WARN  [DependencyVerifier] Error retrieving artifact from [http://dist.codehaus.org]: org.apache.maven.wagon.TransferFailedException: Connection refused
build:start:

multiproject:install-callback:
    [echo] Running jar:install for OpenEJB :: Core
java:prepare-filesystem:

java:compile:
<depend closure="false" srcdir="1.4" dump="false" destdir="/home/continuum/continuum-1.0.2/apps/continuum/work/68/openejb/modules/core/target/classes"></depend>    [echo] Compiling to /home/continuum/continuum-1.0.2/apps/continuum/work/68/openejb/modules/core/target/classes
Running post goal: java:compile
07:07:30,871 INFO  [PostGoalTag] Running post goal: java:compile
geronimo:dependency:


java:jar-resources:
Copying 1 file to /home/continuum/continuum-1.0.2/apps/continuum/work/68/openejb/modules/core/target/classes

test:prepare-filesystem:

test:test-resources:

test:compile:

test:test:
    [echo] NOTICE: Skipping tests; they seem to have passed already
    [echo] No tests to run.
Running post goal: test:test
07:07:33,046 INFO  [PostGoalTag] Running post goal: test:test

jar:jar:
    [jar] Building jar: /home/continuum/continuum-1.0.2/apps/continuum/work/68/openejb/modules/core/target/openejb-core-2.1-SNAPSHOT.jar

jar:install:
    [echo] Installing...
Uploading to openejb/jars/openejb-core-2.1-SNAPSHOT.jar: 
.................... (1186K)
Uploading to openejb/poms/openejb-core-2.1-SNAPSHOT.pom: 
.................... (14K)

+----------------------------------------

build:end:

07:07:35,979 INFO  [ReactorTag] +----------------------------------------
| openejb OpenEJB :: PK Generation :: Builder
07:07:35,979 INFO  [ReactorTag] | openejb OpenEJB :: PK Generation :: Builder
| Memory: 39M/42M
07:07:35,979 INFO  [ReactorTag] | Memory: 39M/42M
+----------------------------------------
07:07:35,979 INFO  [ReactorTag] +----------------------------------------
DEPRECATED: the default goal should be specified in the <build> section of project.xml instead of maven.xml
07:07:36,003 WARN  [PluginScriptParser] DEPRECATED: the default goal should be specified in the <build> section of project.xml instead of maven.xml
DEPRECATED: the default goal should be specified in the <build> section of project.xml instead of maven.xml
07:07:36,004 WARN  [PluginScriptParser] DEPRECATED: the default goal should be specified in the <build> section of project.xml instead of maven.xml
Attempting to download openejb-core-2.1-SNAPSHOT.jar.
07:07:36,291 INFO  [DependencyVerifier] Attempting to download openejb-core-2.1-SNAPSHOT.jar.
Error retrieving artifact from [http://www.openejb.org/maven]: org.apache.maven.wagon.TransferFailedException: Connection refused
07:07:36,402 WARN  [DependencyVerifier] Error retrieving artifact from [http://www.openejb.org/maven]: org.apache.maven.wagon.TransferFailedException: Connection refused
Error retrieving artifact from [http://dist.codehaus.org]: org.apache.maven.wagon.TransferFailedException: Connection refused
07:08:23,179 WARN  [DependencyVerifier] Error retrieving artifact from [http://dist.codehaus.org]: org.apache.maven.wagon.TransferFailedException: Connection refused
Artifact /openejb/jars/openejb-core-2.1-SNAPSHOT.jar doesn't exist in remote repository, but it exists locally.
07:08:23,179 INFO  [DependencyVerifier] Artifact /openejb/jars/openejb-core-2.1-SNAPSHOT.jar doesn't exist in remote repository, but it exists locally.
build:start:

multiproject:install-callback:
    [echo] Running jar:install for OpenEJB :: PK Generation :: Builder
java:prepare-filesystem:

java:compile:
<depend closure="false" srcdir="1.4" dump="false" destdir="/home/continuum/continuum-1.0.2/apps/continuum/work/68/openejb/modules/pkgen-builder/target/classes"></depend>    [echo] Compiling to /home/continuum/continuum-1.0.2/apps/continuum/work/68/openejb/modules/pkgen-builder/target/classes

java:jar-resources:

test:prepare-filesystem:

test:test-resources:

test:compile:
    [echo] No test source files to compile.

test:test:
    [echo] NOTICE: Skipping tests; they seem to have passed already
    [echo] No tests to run.
Running post goal: test:test
07:08:24,382 INFO  [PostGoalTag] Running post goal: test:test

jar:jar:

jar:install:
    [echo] Installing...
Uploading to openejb/jars/openejb-pkgen-builder-2.1-SNAPSHOT.jar: 
.................... (52K)
Uploading to openejb/poms/openejb-pkgen-builder-2.1-SNAPSHOT.pom: 
.................... (6K)

+----------------------------------------

build:end:

07:08:24,666 INFO  [ReactorTag] +----------------------------------------
| openejb OpenEJB :: Builder
07:08:24,666 INFO  [ReactorTag] | openejb OpenEJB :: Builder
| Memory: 40M/42M
07:08:24,666 INFO  [ReactorTag] | Memory: 40M/42M
+----------------------------------------
07:08:24,666 INFO  [ReactorTag] +----------------------------------------
DEPRECATED: the default goal should be specified in the <build> section of project.xml instead of maven.xml
07:08:24,691 WARN  [PluginScriptParser] DEPRECATED: the default goal should be specified in the <build> section of project.xml instead of maven.xml
DEPRECATED: the default goal should be specified in the <build> section of project.xml instead of maven.xml
07:08:24,692 WARN  [PluginScriptParser] DEPRECATED: the default goal should be specified in the <build> section of project.xml instead of maven.xml
Attempting to download openejb-pkgen-builder-2.1-SNAPSHOT.jar.
07:08:25,024 INFO  [DependencyVerifier] Attempting to download openejb-pkgen-builder-2.1-SNAPSHOT.jar.
Error retrieving artifact from [http://www.openejb.org/maven]: org.apache.maven.wagon.TransferFailedException: Connection refused
07:08:25,135 WARN  [DependencyVerifier] Error retrieving artifact from [http://www.openejb.org/maven]: org.apache.maven.wagon.TransferFailedException: Connection refused
Error retrieving artifact from [http://dist.codehaus.org]: org.apache.maven.wagon.TransferFailedException: Connection refused
07:08:26,324 WARN  [DependencyVerifier] Error retrieving artifact from [http://dist.codehaus.org]: org.apache.maven.wagon.TransferFailedException: Connection refused
Artifact /openejb/jars/openejb-pkgen-builder-2.1-SNAPSHOT.jar doesn't exist in remote repository, but it exists locally.
07:08:26,324 INFO  [DependencyVerifier] Artifact /openejb/jars/openejb-pkgen-builder-2.1-SNAPSHOT.jar doesn't exist in remote repository, but it exists locally.
build:start:

multiproject:install-callback:
    [echo] Running jar:install for OpenEJB :: Builder
java:prepare-filesystem:

java:compile:
<depend closure="false" srcdir="1.4" dump="false" destdir="/home/continuum/continuum-1.0.2/apps/continuum/work/68/openejb/modules/openejb-builder/target/classes"></depend>    [echo] Compiling to /home/continuum/continuum-1.0.2/apps/continuum/work/68/openejb/modules/openejb-builder/target/classes
Running post goal: java:compile
07:08:27,519 INFO  [PostGoalTag] Running post goal: java:compile
geronimo:dependency:


java:jar-resources:
Copying 1 file to /home/continuum/continuum-1.0.2/apps/continuum/work/68/openejb/modules/openejb-builder/target/classes

test:prepare-filesystem:

test:test-resources:

test:compile:

test:test:
    [echo] NOTICE: Skipping tests; they seem to have passed already
    [echo] No tests to run.
Running post goal: test:test
07:08:28,951 INFO  [PostGoalTag] Running post goal: test:test

jar:jar:
    [jar] Building jar: /home/continuum/continuum-1.0.2/apps/continuum/work/68/openejb/modules/openejb-builder/target/openejb-builder-2.1-SNAPSHOT.jar

jar:install:
    [echo] Installing...
Uploading to openejb/jars/openejb-builder-2.1-SNAPSHOT.jar: 
.................... (670K)
Uploading to openejb/poms/openejb-builder-2.1-SNAPSHOT.pom: 
.................... (16K)


build:end:


Starting the reactor...
new3:
07:08:31,109 INFO  [ReactorTag] Starting the reactor...
Our processing order:
07:08:32,094 INFO  [ReactorTag] Our processing order:
Geronimo :: Console :: Common Code
07:08:32,094 INFO  [ReactorTag] Geronimo :: Console :: Common Code
Geronimo :: Console :: Portal Framework
07:08:32,094 INFO  [ReactorTag] Geronimo :: Console :: Portal Framework
Geronimo :: Console :: Standard Portlets
07:08:32,094 INFO  [ReactorTag] Geronimo :: Console :: Standard Portlets
Geronimo :: Console :: Application EAR
07:08:32,095 INFO  [ReactorTag] Geronimo :: Console :: Application EAR
DayTrader :: Derby Database
07:08:32,095 INFO  [ReactorTag] DayTrader :: Derby Database
Geronimo :: Demo Webapp
07:08:32,095 INFO  [ReactorTag] Geronimo :: Demo Webapp
Geronimo :: LDAP Demo Application
07:08:32,095 INFO  [ReactorTag] Geronimo :: LDAP Demo Application
Geronimo :: The Magic G Ball Sample Application
07:08:32,095 INFO  [ReactorTag] Geronimo :: The Magic G Ball Sample Application
Geronimo :: Remote Deploy GBean
07:08:32,095 INFO  [ReactorTag] Geronimo :: Remote Deploy GBean
Geronimo :: Remote Deploy Application
07:08:32,095 INFO  [ReactorTag] Geronimo :: Remote Deploy Application
Geronimo :: UDDI-Server database
07:08:32,095 INFO  [ReactorTag] Geronimo :: UDDI-Server database
Geronimo :: UDDI-Server
07:08:32,095 INFO  [ReactorTag] Geronimo :: UDDI-Server
Geronimo :: Welcome Application
07:08:32,095 INFO  [ReactorTag] Geronimo :: Welcome Application
+----------------------------------------
07:08:32,095 INFO  [ReactorTag] +----------------------------------------
| applications Geronimo :: Console :: Common Code
07:08:32,095 INFO  [ReactorTag] | applications Geronimo :: Console :: Common Code
| Memory: 22M/42M
07:08:32,096 INFO  [ReactorTag] | Memory: 22M/42M
+----------------------------------------
07:08:32,096 INFO  [ReactorTag] +----------------------------------------
DEPRECATED: the default goal should be specified in the <build> section of project.xml instead of maven.xml
07:08:32,125 WARN  [PluginScriptParser] DEPRECATED: the default goal should be specified in the <build> section of project.xml instead of maven.xml
DEPRECATED: the default goal should be specified in the <build> section of project.xml instead of maven.xml
07:08:32,126 WARN  [PluginScriptParser] DEPRECATED: the default goal should be specified in the <build> section of project.xml instead of maven.xml
build:start:

multiproject:install-callback:
    [echo] Running jar:install for Geronimo :: Console :: Common Code
Tag library requested that is not present: 'geronimo:deploy' in plugin: 'null'
07:08:32,516 WARN  [GoalToJellyScriptHousingMapper] Tag library requested that is not present: 'geronimo:deploy' in plugin: 'null'
java:prepare-filesystem:

java:compile:
<depend closure="false" srcdir="1.4" dump="false" destdir="/home/continuum/continuum-1.0.2/apps/continuum/work/68/applications/console-core/target/classes"></depend>    [echo] Compiling to /home/continuum/continuum-1.0.2/apps/continuum/work/68/applications/console-core/target/classes
Running post goal: java:compile
07:08:32,834 INFO  [PostGoalTag] Running post goal: java:compile

java:jar-resources:

test:prepare-filesystem:

test:test-resources:

test:compile:
    [echo] No test source files to compile.

test:test:
    [echo] NOTICE: Skipping tests; they seem to have passed already
    [echo] No tests to run.
Running post goal: test:test
07:08:33,515 INFO  [PostGoalTag] Running post goal: test:test

jar:jar:
    [jar] Building jar: /home/continuum/continuum-1.0.2/apps/continuum/work/68/applications/console-core/target/geronimo-console-core-1.1-SNAPSHOT.jar

jar:install:
    [echo] Installing...
Uploading to geronimo/jars/geronimo-console-core-1.1-SNAPSHOT.jar: 
.................... (37K)
Uploading to geronimo/poms/geronimo-console-core-1.1-SNAPSHOT.pom: 
.................... (13K)

+----------------------------------------

build:end:

07:08:33,816 INFO  [ReactorTag] +----------------------------------------
| applications Geronimo :: Console :: Portal Framework
07:08:33,816 INFO  [ReactorTag] | applications Geronimo :: Console :: Portal Framework
| Memory: 23M/42M
07:08:33,816 INFO  [ReactorTag] | Memory: 23M/42M
+----------------------------------------
07:08:33,817 INFO  [ReactorTag] +----------------------------------------
DEPRECATED: the default goal should be specified in the <build> section of project.xml instead of maven.xml
07:08:33,840 WARN  [PluginScriptParser] DEPRECATED: the default goal should be specified in the <build> section of project.xml instead of maven.xml
DEPRECATED: the default goal should be specified in the <build> section of project.xml instead of maven.xml
07:08:33,841 WARN  [PluginScriptParser] DEPRECATED: the default goal should be specified in the <build> section of project.xml instead of maven.xml
Attempting to download geronimo-j2ee_1.4_spec-1.1-SNAPSHOT.jar.
07:08:34,125 INFO  [DependencyVerifier] Attempting to download geronimo-j2ee_1.4_spec-1.1-SNAPSHOT.jar.
Error retrieving artifact from [http://dist.codehaus.org]: org.apache.maven.wagon.TransferFailedException: Connection refused
07:08:34,235 WARN  [DependencyVerifier] Error retrieving artifact from [http://dist.codehaus.org]: org.apache.maven.wagon.TransferFailedException: Connection refused
build:start:

multiproject:install-callback:
    [echo] Running war:install for Geronimo :: Console :: Portal Framework
Tag library requested that is not present: 'caller' in plugin: 'maven-war-plugin-1.6.1'
07:08:36,457 WARN  [GoalToJellyScriptHousingMapper] Tag library requested that is not present: 'caller' in plugin: 'maven-war-plugin-1.6.1'
war:init:

war:war-resources:
    [copy] Copying 1 file to /home/continuum/continuum-1.0.2/apps/continuum/work/68/applications/console-framework/target/geronimo-console-framework
    [copy] Copying 1 file to /home/continuum/continuum-1.0.2/apps/continuum/work/68/applications/console-framework/target/geronimo-console-framework/WEB-INF

java:prepare-filesystem:

java:compile:
<depend closure="false" srcdir="1.4" dump="false" destdir="/home/continuum/continuum-1.0.2/apps/continuum/work/68/applications/console-framework/target/classes"></depend>    [echo] Compiling to /home/continuum/continuum-1.0.2/apps/continuum/work/68/applications/console-framework/target/classes

java:jar-resources:

test:prepare-filesystem:

test:test-resources:

test:compile:
    [echo] No test source files to compile.

test:test:
    [echo] NOTICE: Skipping tests; they seem to have passed already
    [echo] No tests to run.
Running post goal: test:test
07:08:38,527 INFO  [PostGoalTag] Running post goal: test:test

war:webapp:
    [echo] Assembling webapp geronimo-console-framework
    [copy] Copying 1 file to /home/continuum/continuum-1.0.2/apps/continuum/work/68/applications/console-framework/target/geronimo-console-framework/WEB-INF/classes
Running post goal: war:webapp
07:08:39,059 INFO  [PostGoalTag] Running post goal: war:webapp
preCompile:
    [mkdir] Created dir: /home/continuum/continuum-1.0.2/apps/continuum/work/68/applications/console-framework/target/geronimo-console-framework/WEB-INF/work
    [echo] Pre-compiling JSPs from /home/continuum/continuum-1.0.2/apps/continuum/work/68/applications/console-framework/src/webapp to /home/continuum/continuum-1.0.2/apps/continuum/work/68/applications/console-framework/target/geronimo-console-framework/WEB-INF/work.
    [echo] Compiling generated Java files in /home/continuum/continuum-1.0.2/apps/continuum/work/68/applications/console-framework/target/geronimo-console-framework/WEB-INF/work.
    [javac] Compiling 15 source files to /home/continuum/continuum-1.0.2/apps/continuum/work/68/applications/console-framework/target/geronimo-console-framework/WEB-INF/work
    [echo] Merging generated-web.xml with our web.xml

Running post goal: war:webapp
07:08:41,055 INFO  [PostGoalTag] Running post goal: war:webapp
    [echo] Use classes.jar ? true
    [move] Moving 17 files to /home/continuum/continuum-1.0.2/apps/continuum/work/68/applications/console-framework/target/temp
    [jar] Building jar: /home/continuum/continuum-1.0.2/apps/continuum/work/68/applications/console-framework/target/geronimo-console-framework/WEB-INF/lib/classes.jar
    [delete] Deleted 5 directories from /home/continuum/continuum-1.0.2/apps/continuum/work/68/applications/console-framework/target/geronimo-console-framework/WEB-INF/classes
    [delete] Deleting 15 files from /home/continuum/continuum-1.0.2/apps/continuum/work/68/applications/console-framework/target/geronimo-console-framework/WEB-INF/work
    [delete] Deleted 6 directories from /home/continuum/continuum-1.0.2/apps/continuum/work/68/applications/console-framework/target/geronimo-console-framework/WEB-INF/work
    [delete] Deleting 17 files from /home/continuum/continuum-1.0.2/apps/continuum/work/68/applications/console-framework/target/temp
    [delete] Deleted 9 directories from /home/continuum/continuum-1.0.2/apps/continuum/work/68/applications/console-framework/target/temp

war:war:
    [echo] Building WAR geronimo-console-framework
    [jar] Building jar: /home/continuum/continuum-1.0.2/apps/continuum/work/68/applications/console-framework/target/geronimo-console-framework-1.1-SNAPSHOT.war

war:install:
    [echo] Installing...
Uploading to geronimo/wars/geronimo-console-framework-1.1-SNAPSHOT.war: 
.................... (2051K)
Uploading to geronimo/poms/geronimo-console-framework-1.1-SNAPSHOT.pom: 
.................... (12K)

+----------------------------------------

build:end:

07:08:42,477 INFO  [ReactorTag] +----------------------------------------
| applications Geronimo :: Console :: Standard Portlets
07:08:42,477 INFO  [ReactorTag] | applications Geronimo :: Console :: Standard Portlets
| Memory: 27M/42M
07:08:42,478 INFO  [ReactorTag] | Memory: 27M/42M
+----------------------------------------
07:08:42,478 INFO  [ReactorTag] +----------------------------------------
DEPRECATED: the default goal should be specified in the <build> section of project.xml instead of maven.xml
07:08:42,511 WARN  [PluginScriptParser] DEPRECATED: the default goal should be specified in the <build> section of project.xml instead of maven.xml
DEPRECATED: the default goal should be specified in the <build> section of project.xml instead of maven.xml
07:08:42,513 WARN  [PluginScriptParser] DEPRECATED: the default goal should be specified in the <build> section of project.xml instead of maven.xml
Attempting to download geronimo-derby-1.1-SNAPSHOT.jar.
07:08:42,850 INFO  [DependencyVerifier] Attempting to download geronimo-derby-1.1-SNAPSHOT.jar.
Error retrieving artifact from [http://dist.codehaus.org]: org.apache.maven.wagon.TransferFailedException: Connection refused
07:08:42,960 WARN  [DependencyVerifier] Error retrieving artifact from [http://dist.codehaus.org]: org.apache.maven.wagon.TransferFailedException: Connection refused
Attempting to download geronimo-converter-1.1-SNAPSHOT.jar.
07:08:44,418 INFO  [DependencyVerifier] Attempting to download geronimo-converter-1.1-SNAPSHOT.jar.
Error retrieving artifact from [http://dist.codehaus.org]: org.apache.maven.wagon.TransferFailedException: Connection refused
07:08:44,529 WARN  [DependencyVerifier] Error retrieving artifact from [http://dist.codehaus.org]: org.apache.maven.wagon.TransferFailedException: Connection refused
Attempting to download geronimo-console-core-1.1-SNAPSHOT.jar.
07:08:49,239 INFO  [DependencyVerifier] Attempting to download geronimo-console-core-1.1-SNAPSHOT.jar.
Error retrieving artifact from [http://dist.codehaus.org]: org.apache.maven.wagon.TransferFailedException: Connection refused
07:08:49,761 WARN  [DependencyVerifier] Error retrieving artifact from [http://dist.codehaus.org]: org.apache.maven.wagon.TransferFailedException: Connection refused
build:start:

multiproject:install-callback:
    [echo] Running war:install for Geronimo :: Console :: Standard Portlets
Tag library requested that is not present: 'caller' in plugin: 'maven-war-plugin-1.6.1'
07:08:51,228 WARN  [GoalToJellyScriptHousingMapper] Tag library requested that is not present: 'caller' in plugin: 'maven-war-plugin-1.6.1'
war:init:

war:war-resources:
    [copy] Copying 1 file to /home/continuum/continuum-1.0.2/apps/continuum/work/68/applications/console-standard/target/geronimo-console-standard
    [copy] Copying 1 file to /home/continuum/continuum-1.0.2/apps/continuum/work/68/applications/console-standard/target/geronimo-console-standard/WEB-INF

java:prepare-filesystem:

java:compile:
<depend closure="false" srcdir="1.4" dump="false" destdir="/home/continuum/continuum-1.0.2/apps/continuum/work/68/applications/console-standard/target/classes"></depend>    [echo] Compiling to /home/continuum/continuum-1.0.2/apps/continuum/work/68/applications/console-standard/target/classes

java:jar-resources:

test:prepare-filesystem:

test:test-resources:

test:compile:

test:test:
    [echo] NOTICE: Skipping tests; they seem to have passed already
    [echo] No tests to run.
Running post goal: test:test
07:08:55,113 INFO  [PostGoalTag] Running post goal: test:test

war:webapp:
    [echo] Assembling webapp geronimo-console-standard
    [copy] Copying 176 files to /home/continuum/continuum-1.0.2/apps/continuum/work/68/applications/console-standard/target/geronimo-console-standard/WEB-INF/classes
Running post goal: war:webapp
07:08:56,010 INFO  [PostGoalTag] Running post goal: war:webapp
preCompile:
    [mkdir] Created dir: /home/continuum/continuum-1.0.2/apps/continuum/work/68/applications/console-standard/target/geronimo-console-standard/WEB-INF/work
    [echo] Pre-compiling JSPs from /home/continuum/continuum-1.0.2/apps/continuum/work/68/applications/console-standard/src/webapp to /home/continuum/continuum-1.0.2/apps/continuum/work/68/applications/console-standard/target/geronimo-console-standard/WEB-INF/work.
    [echo] Compiling generated Java files in /home/continuum/continuum-1.0.2/apps/continuum/work/68/applications/console-standard/target/geronimo-console-standard/WEB-INF/work.
    [javac] Compiling 157 source files to /home/continuum/continuum-1.0.2/apps/continuum/work/68/applications/console-standard/target/geronimo-console-standard/WEB-INF/work
    [echo] Merging generated-web.xml with our web.xml

substitute:

Running post goal: war:webapp
07:09:06,568 INFO  [PostGoalTag] Running post goal: war:webapp
    [echo] Use classes.jar ? true
    [move] Moving 335 files to /home/continuum/continuum-1.0.2/apps/continuum/work/68/applications/console-standard/target/temp
    [jar] Building jar: /home/continuum/continuum-1.0.2/apps/continuum/work/68/applications/console-standard/target/geronimo-console-standard/WEB-INF/lib/classes.jar
    [delete] Deleted 34 directories from /home/continuum/continuum-1.0.2/apps/continuum/work/68/applications/console-standard/target/geronimo-console-standard/WEB-INF/classes
    [delete] Deleting 157 files from /home/continuum/continuum-1.0.2/apps/continuum/work/68/applications/console-standard/target/geronimo-console-standard/WEB-INF/work
    [delete] Deleted 39 directories from /home/continuum/continuum-1.0.2/apps/continuum/work/68/applications/console-standard/target/geronimo-console-standard/WEB-INF/work
    [delete] Deleting 335 files from /home/continuum/continuum-1.0.2/apps/continuum/work/68/applications/console-standard/target/temp
    [delete] Deleted 71 directories from /home/continuum/continuum-1.0.2/apps/continuum/work/68/applications/console-standard/target/temp

war:war:
    [echo] Building WAR geronimo-console-standard
    [jar] Building jar: /home/continuum/continuum-1.0.2/apps/continuum/work/68/applications/console-standard/target/geronimo-console-standard-1.1-SNAPSHOT.war

war:install:
    [echo] Installing...
Uploading to geronimo/wars/geronimo-console-standard-1.1-SNAPSHOT.war: 
.................... (3655K)
Uploading to geronimo/poms/geronimo-console-standard-1.1-SNAPSHOT.pom: 
.................... (17K)

+----------------------------------------

build:end:

07:09:09,632 INFO  [ReactorTag] +----------------------------------------
| applications Geronimo :: Console :: Application EAR
07:09:09,632 INFO  [ReactorTag] | applications Geronimo :: Console :: Application EAR
| Memory: 51M/61M
07:09:09,632 INFO  [ReactorTag] | Memory: 51M/61M
+----------------------------------------
07:09:09,632 INFO  [ReactorTag] +----------------------------------------
DEPRECATED: the default goal should be specified in the <build> section of project.xml instead of maven.xml
07:09:09,677 WARN  [PluginScriptParser] DEPRECATED: the default goal should be specified in the <build> section of project.xml instead of maven.xml
DEPRECATED: the default goal should be specified in the <build> section of project.xml instead of maven.xml
07:09:09,679 WARN  [PluginScriptParser] DEPRECATED: the default goal should be specified in the <build> section of project.xml instead of maven.xml
Attempting to download geronimo-console-framework-1.1-SNAPSHOT.war.
07:09:09,960 INFO  [DependencyVerifier] Attempting to download geronimo-console-framework-1.1-SNAPSHOT.war.
Error retrieving artifact from [http://dist.codehaus.org]: org.apache.maven.wagon.TransferFailedException: Connection refused
07:09:10,106 WARN  [DependencyVerifier] Error retrieving artifact from [http://dist.codehaus.org]: org.apache.maven.wagon.TransferFailedException: Connection refused
Attempting to download geronimo-console-standard-1.1-SNAPSHOT.war.
07:09:17,842 INFO  [DependencyVerifier] Attempting to download geronimo-console-standard-1.1-SNAPSHOT.war.
Error retrieving artifact from [http://dist.codehaus.org]: org.apache.maven.wagon.TransferFailedException: Connection refused
07:09:17,958 WARN  [DependencyVerifier] Error retrieving artifact from [http://dist.codehaus.org]: org.apache.maven.wagon.TransferFailedException: Connection refused
build:start:

multiproject:install-callback:
    [echo] Running ear:install for Geronimo :: Console :: Application EAR
ear:init:

ear:ear:
ear:generate-ear-descriptor:
    [echo] Generating /home/continuum/continuum-1.0.2/apps/continuum/work/68/applications/console-ear/target/application.xml

    [echo] Building EAR geronimo-console-1.1-SNAPSHOT.ear with appxml "/home/continuum/continuum-1.0.2/apps/continuum/work/68/applications/console-ear/target/application.xml"
    [echo] Dependency geronimo-console-framework-1.1-SNAPSHOT.war will be bundled as framework.war
    [copy] Copying 1 file to /home/continuum/continuum-1.0.2/apps/continuum/work/68/applications/console-ear/target/tmpEarDeps
    [echo] Dependency geronimo-console-standard-1.1-SNAPSHOT.war will be bundled as standard.war
    [copy] Copying 1 file to /home/continuum/continuum-1.0.2/apps/continuum/work/68/applications/console-ear/target/tmpEarDeps
    [ear] Building ear: /home/continuum/continuum-1.0.2/apps/continuum/work/68/applications/console-ear/target/geronimo-console-1.1-SNAPSHOT.ear
    [delete] Deleting directory /home/continuum/continuum-1.0.2/apps/continuum/work/68/applications/console-ear/target/tmpEarDeps

ear:install:
    [echo] Installing...
Uploading to geronimo/ears/geronimo-console-1.1-SNAPSHOT.ear: 
.................... (5679K)
Uploading to geronimo/poms/geronimo-console-1.1-SNAPSHOT.pom: 
.................... (12K)

+----------------------------------------

build:end:

07:09:34,545 INFO  [ReactorTag] +----------------------------------------
| applications DayTrader :: Derby Database
07:09:34,546 INFO  [ReactorTag] | applications DayTrader :: Derby Database
| Memory: 54M/61M
07:09:34,546 INFO  [ReactorTag] | Memory: 54M/61M
+----------------------------------------
07:09:34,546 INFO  [ReactorTag] +----------------------------------------
DEPRECATED: the default goal should be specified in the <build> section of project.xml instead of maven.xml
07:09:34,571 WARN  [PluginScriptParser] DEPRECATED: the default goal should be specified in the <build> section of project.xml instead of maven.xml
DEPRECATED: the default goal should be specified in the <build> section of project.xml instead of maven.xml
07:09:34,575 WARN  [PluginScriptParser] DEPRECATED: the default goal should be specified in the <build> section of project.xml instead of maven.xml
build:start:

multiproject:install-callback:
    [echo] Running jar:install for DayTrader :: Derby Database
java:prepare-filesystem:
init-database:
    [delete] Deleting directory /home/continuum/continuum-1.0.2/apps/continuum/work/68/applications/daytrader/derby/target/resources/META-INF/geronimo-daytrader-derby-db/var/derby
    [mkdir] Created dir: /home/continuum/continuum-1.0.2/apps/continuum/work/68/applications/daytrader/derby/target/resources/META-INF/geronimo-daytrader-derby-db/var/derby
    [sql] Executing file: /home/continuum/continuum-1.0.2/apps/continuum/work/68/applications/daytrader/derby/src/sql/daytrader.sql
    [sql] 18 of 18 SQL statements executed successfully


java:compile:
    [echo] Compiling to /home/continuum/continuum-1.0.2/apps/continuum/work/68/applications/daytrader/derby/target/classes
    [echo] No java source files to compile.

java:jar-resources:
Copying 71 files to /home/continuum/continuum-1.0.2/apps/continuum/work/68/applications/daytrader/derby/target/classes

test:prepare-filesystem:

test:test-resources:

test:compile:
    [echo] No test source files to compile.

test:test:
    [echo] NOTICE: Skipping tests; they seem to have passed already
    [echo] No tests to run.
Running post goal: test:test
07:09:40,331 INFO  [PostGoalTag] Running post goal: test:test

jar:jar:
    [jar] Building jar: /home/continuum/continuum-1.0.2/apps/continuum/work/68/applications/daytrader/derby/target/geronimo-daytrader-derby-db-1.1-SNAPSHOT.jar

jar:install:
    [echo] Installing...
Uploading to geronimo/jars/geronimo-daytrader-derby-db-1.1-SNAPSHOT.jar: 
.................... (67K)
Uploading to geronimo/poms/geronimo-daytrader-derby-db-1.1-SNAPSHOT.pom: 
.................... (10K)

+----------------------------------------

build:end:

07:09:40,726 INFO  [ReactorTag] +----------------------------------------
| applications Geronimo :: Demo Webapp
07:09:40,726 INFO  [ReactorTag] | applications Geronimo :: Demo Webapp
| Memory: 24M/61M
07:09:40,726 INFO  [ReactorTag] | Memory: 24M/61M
+----------------------------------------
07:09:40,726 INFO  [ReactorTag] +----------------------------------------
DEPRECATED: the default goal should be specified in the <build> section of project.xml instead of maven.xml
07:09:40,762 WARN  [PluginScriptParser] DEPRECATED: the default goal should be specified in the <build> section of project.xml instead of maven.xml
DEPRECATED: the default goal should be specified in the <build> section of project.xml instead of maven.xml
07:09:40,764 WARN  [PluginScriptParser] DEPRECATED: the default goal should be specified in the <build> section of project.xml instead of maven.xml
build:start:

multiproject:install-callback:
    [echo] Running war:install for Geronimo :: Demo Webapp
Tag library requested that is not present: 'caller' in plugin: 'maven-war-plugin-1.6.1'
07:09:41,134 WARN  [GoalToJellyScriptHousingMapper] Tag library requested that is not present: 'caller' in plugin: 'maven-war-plugin-1.6.1'
war:init:

war:war-resources:
    [copy] Copying 1 file to /home/continuum/continuum-1.0.2/apps/continuum/work/68/applications/demo/target/geronimo-demo/WEB-INF

java:prepare-filesystem:

java:compile:
    [echo] Compiling to /home/continuum/continuum-1.0.2/apps/continuum/work/68/applications/demo/target/classes
    [echo] No java source files to compile.

java:jar-resources:

test:prepare-filesystem:

test:test-resources:

test:compile:
    [echo] No test source files to compile.

test:test:
    [echo] NOTICE: Skipping tests; they seem to have passed already
    [echo] No tests to run.
Running post goal: test:test
07:09:41,978 INFO  [PostGoalTag] Running post goal: test:test

war:webapp:
    [echo] Assembling webapp geronimo-demo
Running post goal: war:webapp
07:09:42,277 INFO  [PostGoalTag] Running post goal: war:webapp
    [echo] Use classes.jar ? true

war:war:
    [echo] Building WAR geronimo-demo
    [jar] Building jar: /home/continuum/continuum-1.0.2/apps/continuum/work/68/applications/demo/target/geronimo-demo-1.1-SNAPSHOT.war

war:install:
    [echo] Installing...
Uploading to geronimo/wars/geronimo-demo-1.1-SNAPSHOT.war: 
.................... (4K)
Uploading to geronimo/poms/geronimo-demo-1.1-SNAPSHOT.pom: 
.................... (10K)

+----------------------------------------

build:end:

07:09:42,814 INFO  [ReactorTag] +----------------------------------------
| applications Geronimo :: LDAP Demo Application
07:09:42,814 INFO  [ReactorTag] | applications Geronimo :: LDAP Demo Application
| Memory: 23M/61M
07:09:42,814 INFO  [ReactorTag] | Memory: 23M/61M
+----------------------------------------
07:09:42,814 INFO  [ReactorTag] +----------------------------------------
DEPRECATED: the default goal should be specified in the <build> section of project.xml instead of maven.xml
07:09:42,843 WARN  [PluginScriptParser] DEPRECATED: the default goal should be specified in the <build> section of project.xml instead of maven.xml
DEPRECATED: the default goal should be specified in the <build> section of project.xml instead of maven.xml
07:09:42,844 WARN  [PluginScriptParser] DEPRECATED: the default goal should be specified in the <build> section of project.xml instead of maven.xml
build:start:

multiproject:install-callback:
    [echo] Running war:install for Geronimo :: LDAP Demo Application
Tag library requested that is not present: 'caller' in plugin: 'maven-war-plugin-1.6.1'
07:09:43,215 WARN  [GoalToJellyScriptHousingMapper] Tag library requested that is not present: 'caller' in plugin: 'maven-war-plugin-1.6.1'
war:init:

war:war-resources:
    [copy] Copying 1 file to /home/continuum/continuum-1.0.2/apps/continuum/work/68/applications/ldap-realm-demo/target/geronimo-ldap-demo/WEB-INF

java:prepare-filesystem:

java:compile:
    [echo] Compiling to /home/continuum/continuum-1.0.2/apps/continuum/work/68/applications/ldap-realm-demo/target/classes
    [echo] No java source files to compile.

java:jar-resources:

test:prepare-filesystem:

test:test-resources:

test:compile:
    [echo] No test source files to compile.

test:test:
    [echo] NOTICE: Skipping tests; they seem to have passed already
    [echo] No tests to run.
Running post goal: test:test
07:09:44,060 INFO  [PostGoalTag] Running post goal: test:test

war:webapp:
    [echo] Assembling webapp geronimo-ldap-demo
Running post goal: war:webapp
07:09:44,360 INFO  [PostGoalTag] Running post goal: war:webapp
    [echo] Use classes.jar ? true

war:war:
    [echo] Building WAR geronimo-ldap-demo
    [jar] Building jar: /home/continuum/continuum-1.0.2/apps/continuum/work/68/applications/ldap-realm-demo/target/geronimo-ldap-demo-1.1-SNAPSHOT.war

war:install:
    [echo] Installing...
Uploading to geronimo/wars/geronimo-ldap-demo-1.1-SNAPSHOT.war: 
.................... (4K)
Uploading to geronimo/poms/geronimo-ldap-demo-1.1-SNAPSHOT.pom: 
.................... (10K)

+----------------------------------------

build:end:

07:09:44,920 INFO  [ReactorTag] +----------------------------------------
| applications Geronimo :: The Magic G Ball Sample Application
07:09:44,920 INFO  [ReactorTag] | applications Geronimo :: The Magic G Ball Sample Application
| Memory: 23M/61M
07:09:44,920 INFO  [ReactorTag] | Memory: 23M/61M
+----------------------------------------
07:09:44,920 INFO  [ReactorTag] +----------------------------------------
DEPRECATED: the default goal should be specified in the <build> section of project.xml instead of maven.xml
07:09:44,953 WARN  [PluginScriptParser] DEPRECATED: the default goal should be specified in the <build> section of project.xml instead of maven.xml
DEPRECATED: the default goal should be specified in the <build> section of project.xml instead of maven.xml
07:09:44,960 WARN  [PluginScriptParser] DEPRECATED: the default goal should be specified in the <build> section of project.xml instead of maven.xml
build:start:

multiproject:install-callback:
    [echo] Running war:install for Geronimo :: The Magic G Ball Sample Application
Tag library requested that is not present: 'caller' in plugin: 'maven-war-plugin-1.6.1'
07:09:45,348 WARN  [GoalToJellyScriptHousingMapper] Tag library requested that is not present: 'caller' in plugin: 'maven-war-plugin-1.6.1'
war:init:

war:war-resources:
    [copy] Copying 1 file to /home/continuum/continuum-1.0.2/apps/continuum/work/68/applications/magicGball/target/magicGball/WEB-INF

java:prepare-filesystem:

java:compile:
<depend closure="false" srcdir="1.4" dump="false" destdir="/home/continuum/continuum-1.0.2/apps/continuum/work/68/applications/magicGball/target/classes"></depend>    [echo] Compiling to /home/continuum/continuum-1.0.2/apps/continuum/work/68/applications/magicGball/target/classes

java:jar-resources:

test:prepare-filesystem:

test:test-resources:

test:compile:
    [echo] No test source files to compile.

test:test:
    [echo] NOTICE: Skipping tests; they seem to have passed already
    [echo] No tests to run.
Running post goal: test:test
07:09:46,291 INFO  [PostGoalTag] Running post goal: test:test

war:webapp:
    [echo] Assembling webapp magicGball
    [copy] Copying 1 file to /home/continuum/continuum-1.0.2/apps/continuum/work/68/applications/magicGball/target/magicGball/WEB-INF/classes
Running post goal: war:webapp
07:09:46,594 INFO  [PostGoalTag] Running post goal: war:webapp
    [echo] Use classes.jar ? true
    [mkdir] Created dir: /home/continuum/continuum-1.0.2/apps/continuum/work/68/applications/magicGball/target/magicGball/WEB-INF/work
    [move] Moving 1 file to /home/continuum/continuum-1.0.2/apps/continuum/work/68/applications/magicGball/target/temp
    [jar] Building jar: /home/continuum/continuum-1.0.2/apps/continuum/work/68/applications/magicGball/target/magicGball/WEB-INF/lib/classes.jar
    [delete] Deleted 2 directories from /home/continuum/continuum-1.0.2/apps/continuum/work/68/applications/magicGball/target/magicGball/WEB-INF/classes
    [delete] Deleted 1 directory from /home/continuum/continuum-1.0.2/apps/continuum/work/68/applications/magicGball/target/magicGball/WEB-INF/work
    [delete] Deleting 1 files from /home/continuum/continuum-1.0.2/apps/continuum/work/68/applications/magicGball/target/temp
    [delete] Deleted 3 directories from /home/continuum/continuum-1.0.2/apps/continuum/work/68/applications/magicGball/target/temp

war:war:
    [echo] Building WAR magicGball
    [jar] Building jar: /home/continuum/continuum-1.0.2/apps/continuum/work/68/applications/magicGball/target/magicGball-1.1-SNAPSHOT.war

war:install:
    [echo] Installing...
Uploading to geronimo/wars/magicGball-1.1-SNAPSHOT.war: 
.................... (2K)
Uploading to geronimo/poms/magicGball-1.1-SNAPSHOT.pom: 
.................... (10K)

+----------------------------------------

build:end:

07:09:47,194 INFO  [ReactorTag] +----------------------------------------
| applications Geronimo :: Remote Deploy GBean
07:09:47,194 INFO  [ReactorTag] | applications Geronimo :: Remote Deploy GBean
| Memory: 25M/61M
07:09:47,194 INFO  [ReactorTag] | Memory: 25M/61M
+----------------------------------------
07:09:47,194 INFO  [ReactorTag] +----------------------------------------
DEPRECATED: the default goal should be specified in the <build> section of project.xml instead of maven.xml
07:09:47,223 WARN  [PluginScriptParser] DEPRECATED: the default goal should be specified in the <build> section of project.xml instead of maven.xml
DEPRECATED: the default goal should be specified in the <build> section of project.xml instead of maven.xml
07:09:47,223 WARN  [PluginScriptParser] DEPRECATED: the default goal should be specified in the <build> section of project.xml instead of maven.xml
build:start:

multiproject:install-callback:
    [echo] Running jar:install for Geronimo :: Remote Deploy GBean
java:prepare-filesystem:

java:compile:
<depend closure="false" srcdir="1.4" dump="false" destdir="/home/continuum/continuum-1.0.2/apps/continuum/work/68/applications/remote-deploy-lib/target/classes"></depend>    [echo] Compiling to /home/continuum/continuum-1.0.2/apps/continuum/work/68/applications/remote-deploy-lib/target/classes

java:jar-resources:

test:prepare-filesystem:

test:test-resources:

test:compile:
    [echo] No test source files to compile.

test:test:
    [echo] NOTICE: Skipping tests; they seem to have passed already
    [echo] No tests to run.
Running post goal: test:test
07:09:48,384 INFO  [PostGoalTag] Running post goal: test:test

jar:jar:

jar:install:
    [echo] Installing...
Uploading to geronimo/jars/geronimo-remote-deploy-lib-1.1-SNAPSHOT.jar: 
.................... (6K)
Uploading to geronimo/poms/geronimo-remote-deploy-lib-1.1-SNAPSHOT.pom: 
.................... (10K)

+----------------------------------------

build:end:

07:09:48,637 INFO  [ReactorTag] +----------------------------------------
| applications Geronimo :: Remote Deploy Application
07:09:48,637 INFO  [ReactorTag] | applications Geronimo :: Remote Deploy Application
| Memory: 24M/61M
07:09:48,637 INFO  [ReactorTag] | Memory: 24M/61M
+----------------------------------------
07:09:48,637 INFO  [ReactorTag] +----------------------------------------
DEPRECATED: the default goal should be specified in the <build> section of project.xml instead of maven.xml
07:09:48,661 WARN  [PluginScriptParser] DEPRECATED: the default goal should be specified in the <build> section of project.xml instead of maven.xml
DEPRECATED: the default goal should be specified in the <build> section of project.xml instead of maven.xml
07:09:48,663 WARN  [PluginScriptParser] DEPRECATED: the default goal should be specified in the <build> section of project.xml instead of maven.xml
Attempting to download geronimo-remote-deploy-lib-1.1-SNAPSHOT.jar.
07:09:48,947 INFO  [DependencyVerifier] Attempting to download geronimo-remote-deploy-lib-1.1-SNAPSHOT.jar.
Error retrieving artifact from [http://dist.codehaus.org]: org.apache.maven.wagon.TransferFailedException: Connection refused
07:09:49,058 WARN  [DependencyVerifier] Error retrieving artifact from [http://dist.codehaus.org]: org.apache.maven.wagon.TransferFailedException: Connection refused
build:start:

multiproject:install-callback:
    [echo] Running war:install for Geronimo :: Remote Deploy Application
Tag library requested that is not present: 'caller' in plugin: 'maven-war-plugin-1.6.1'
07:10:09,347 WARN  [GoalToJellyScriptHousingMapper] Tag library requested that is not present: 'caller' in plugin: 'maven-war-plugin-1.6.1'
war:init:

war:war-resources:
    [copy] Copying 1 file to /home/continuum/continuum-1.0.2/apps/continuum/work/68/applications/remote-deploy/target/geronimo-remote-deploy/WEB-INF

java:prepare-filesystem:

java:compile:
<depend closure="false" srcdir="1.4" dump="false" destdir="/home/continuum/continuum-1.0.2/apps/continuum/work/68/applications/remote-deploy/target/classes"></depend>    [echo] Compiling to /home/continuum/continuum-1.0.2/apps/continuum/work/68/applications/remote-deploy/target/classes

java:jar-resources:

test:prepare-filesystem:

test:test-resources:

test:compile:
    [echo] No test source files to compile.

test:test:
    [echo] NOTICE: Skipping tests; they seem to have passed already
    [echo] No tests to run.
Running post goal: test:test
07:10:10,319 INFO  [PostGoalTag] Running post goal: test:test

war:webapp:
    [echo] Assembling webapp geronimo-remote-deploy
    [copy] Copying 2 files to /home/continuum/continuum-1.0.2/apps/continuum/work/68/applications/remote-deploy/target/geronimo-remote-deploy/WEB-INF/classes
Running post goal: war:webapp
07:10:10,642 INFO  [PostGoalTag] Running post goal: war:webapp
    [echo] Use classes.jar ? true
    [mkdir] Created dir: /home/continuum/continuum-1.0.2/apps/continuum/work/68/applications/remote-deploy/target/geronimo-remote-deploy/WEB-INF/work
    [move] Moving 2 files to /home/continuum/continuum-1.0.2/apps/continuum/work/68/applications/remote-deploy/target/temp
    [jar] Building jar: /home/continuum/continuum-1.0.2/apps/continuum/work/68/applications/remote-deploy/target/geronimo-remote-deploy/WEB-INF/lib/classes.jar
    [delete] Deleted 5 directories from /home/continuum/continuum-1.0.2/apps/continuum/work/68/applications/remote-deploy/target/geronimo-remote-deploy/WEB-INF/classes
    [delete] Deleted 1 directory from /home/continuum/continuum-1.0.2/apps/continuum/work/68/applications/remote-deploy/target/geronimo-remote-deploy/WEB-INF/work
    [delete] Deleting 2 files from /home/continuum/continuum-1.0.2/apps/continuum/work/68/applications/remote-deploy/target/temp
    [delete] Deleted 6 directories from /home/continuum/continuum-1.0.2/apps/continuum/work/68/applications/remote-deploy/target/temp

war:war:
    [echo] Building WAR geronimo-remote-deploy
    [jar] Building jar: /home/continuum/continuum-1.0.2/apps/continuum/work/68/applications/remote-deploy/target/geronimo-remote-deploy-1.1-SNAPSHOT.war

war:install:
    [echo] Installing...
Uploading to geronimo/wars/geronimo-remote-deploy-1.1-SNAPSHOT.war: 
.................... (4K)
Uploading to geronimo/poms/geronimo-remote-deploy-1.1-SNAPSHOT.pom: 
.................... (11K)

+----------------------------------------

build:end:

07:10:11,256 INFO  [ReactorTag] +----------------------------------------
| applications Geronimo :: UDDI-Server database
07:10:11,257 INFO  [ReactorTag] | applications Geronimo :: UDDI-Server database
| Memory: 26M/61M
07:10:11,257 INFO  [ReactorTag] | Memory: 26M/61M
+----------------------------------------
07:10:11,257 INFO  [ReactorTag] +----------------------------------------
DEPRECATED: the default goal should be specified in the <build> section of project.xml instead of maven.xml
07:10:11,300 WARN  [PluginScriptParser] DEPRECATED: the default goal should be specified in the <build> section of project.xml instead of maven.xml
DEPRECATED: the default goal should be specified in the <build> section of project.xml instead of maven.xml
07:10:11,302 WARN  [PluginScriptParser] DEPRECATED: the default goal should be specified in the <build> section of project.xml instead of maven.xml
build:start:

multiproject:install-callback:
    [echo] Running jar:install for Geronimo :: UDDI-Server database
java:prepare-filesystem:
init-database:
    [delete] Deleting directory /home/continuum/continuum-1.0.2/apps/continuum/work/68/applications/uddi-db/target/resources/META-INF/geronimo-uddi-db/var/derby
    [mkdir] Created dir: /home/continuum/continuum-1.0.2/apps/continuum/work/68/applications/uddi-db/target/resources/META-INF/geronimo-uddi-db/var/derby
    [sql] Executing file: /home/continuum/continuum-1.0.2/apps/continuum/work/68/applications/uddi-db/src/sql/juddi.sql
    [sql] 87 of 87 SQL statements executed successfully


java:compile:
    [echo] Compiling to /home/continuum/continuum-1.0.2/apps/continuum/work/68/applications/uddi-db/target/classes
    [echo] No java source files to compile.

java:jar-resources:
Copying 142 files to /home/continuum/continuum-1.0.2/apps/continuum/work/68/applications/uddi-db/target/classes

test:prepare-filesystem:

test:test-resources:

test:compile:
    [echo] No test source files to compile.

test:test:
    [echo] NOTICE: Skipping tests; they seem to have passed already
    [echo] No tests to run.
Running post goal: test:test
07:10:18,996 INFO  [PostGoalTag] Running post goal: test:test

jar:jar:
    [jar] Building jar: /home/continuum/continuum-1.0.2/apps/continuum/work/68/applications/uddi-db/target/geronimo-uddi-db-1.1-SNAPSHOT.jar

jar:install:
    [echo] Installing...
Uploading to geronimo/jars/geronimo-uddi-db-1.1-SNAPSHOT.jar: 
.................... (140K)
Uploading to geronimo/poms/geronimo-uddi-db-1.1-SNAPSHOT.pom: 
.................... (10K)

+----------------------------------------

build:end:

07:10:19,520 INFO  [ReactorTag] +----------------------------------------
| applications Geronimo :: UDDI-Server
07:10:19,520 INFO  [ReactorTag] | applications Geronimo :: UDDI-Server
| Memory: 28M/61M
07:10:19,521 INFO  [ReactorTag] | Memory: 28M/61M
+----------------------------------------
07:10:19,521 INFO  [ReactorTag] +----------------------------------------
DEPRECATED: the default goal should be specified in the <build> section of project.xml instead of maven.xml
07:10:19,544 WARN  [PluginScriptParser] DEPRECATED: the default goal should be specified in the <build> section of project.xml instead of maven.xml
DEPRECATED: the default goal should be specified in the <build> section of project.xml instead of maven.xml
07:10:19,545 WARN  [PluginScriptParser] DEPRECATED: the default goal should be specified in the <build> section of project.xml instead of maven.xml
build:start:

multiproject:install-callback:
    [echo] Running war:install for Geronimo :: UDDI-Server
Tag library requested that is not present: 'caller' in plugin: 'maven-war-plugin-1.6.1'
07:10:19,915 WARN  [GoalToJellyScriptHousingMapper] Tag library requested that is not present: 'caller' in plugin: 'maven-war-plugin-1.6.1'
war:init:

war:war-resources:
    [copy] Copying 1 file to /home/continuum/continuum-1.0.2/apps/continuum/work/68/applications/uddi-server/target/geronimo-uddi-server/WEB-INF

java:prepare-filesystem:

java:compile:
    [echo] Compiling to /home/continuum/continuum-1.0.2/apps/continuum/work/68/applications/uddi-server/target/classes
    [echo] No java source files to compile.

java:jar-resources:

test:prepare-filesystem:

test:test-resources:

test:compile:
    [echo] No test source files to compile.

test:test:
    [echo] NOTICE: Skipping tests; they seem to have passed already
    [echo] No tests to run.
Running post goal: test:test
07:10:20,759 INFO  [PostGoalTag] Running post goal: test:test

war:webapp:
    [echo] Assembling webapp geronimo-uddi-server
Running post goal: war:webapp
07:10:21,062 INFO  [PostGoalTag] Running post goal: war:webapp
    [echo] Use classes.jar ? true

war:war:
    [echo] Building WAR geronimo-uddi-server
    [jar] Building jar: /home/continuum/continuum-1.0.2/apps/continuum/work/68/applications/uddi-server/target/geronimo-uddi-server-1.1-SNAPSHOT.war

war:install:
    [echo] Installing...
Uploading to geronimo/wars/geronimo-uddi-server-1.1-SNAPSHOT.war: 
.................... (6K)
Uploading to geronimo/poms/geronimo-uddi-server-1.1-SNAPSHOT.pom: 
.................... (10K)

+----------------------------------------

build:end:

07:10:21,579 INFO  [ReactorTag] +----------------------------------------
| applications Geronimo :: Welcome Application
07:10:21,579 INFO  [ReactorTag] | applications Geronimo :: Welcome Application
| Memory: 26M/61M
07:10:21,579 INFO  [ReactorTag] | Memory: 26M/61M
+----------------------------------------
07:10:21,579 INFO  [ReactorTag] +----------------------------------------
DEPRECATED: the default goal should be specified in the <build> section of project.xml instead of maven.xml
07:10:21,610 WARN  [PluginScriptParser] DEPRECATED: the default goal should be specified in the <build> section of project.xml instead of maven.xml
DEPRECATED: the default goal should be specified in the <build> section of project.xml instead of maven.xml
07:10:21,611 WARN  [PluginScriptParser] DEPRECATED: the default goal should be specified in the <build> section of project.xml instead of maven.xml
build:start:

multiproject:install-callback:
    [echo] Running war:install for Geronimo :: Welcome Application
Tag library requested that is not present: 'caller' in plugin: 'maven-war-plugin-1.6.1'
07:10:21,984 WARN  [GoalToJellyScriptHousingMapper] Tag library requested that is not present: 'caller' in plugin: 'maven-war-plugin-1.6.1'
war:init:

war:war-resources:
    [copy] Copying 1 file to /home/continuum/continuum-1.0.2/apps/continuum/work/68/applications/welcome/target/geronimo-welcome/WEB-INF

java:prepare-filesystem:

java:compile:
<depend closure="false" srcdir="1.4" dump="false" destdir="/home/continuum/continuum-1.0.2/apps/continuum/work/68/applications/welcome/target/classes"></depend>    [echo] Compiling to /home/continuum/continuum-1.0.2/apps/continuum/work/68/applications/welcome/target/classes

java:jar-resources:

test:prepare-filesystem:

test:test-resources:

test:compile:
    [echo] No test source files to compile.

test:test:
    [echo] NOTICE: Skipping tests; they seem to have passed already
    [echo] No tests to run.
Running post goal: test:test
07:10:22,944 INFO  [PostGoalTag] Running post goal: test:test

war:webapp:
    [echo] Assembling webapp geronimo-welcome
    [copy] Copying 1 file to /home/continuum/continuum-1.0.2/apps/continuum/work/68/applications/welcome/target/geronimo-welcome/WEB-INF/classes
Running post goal: war:webapp
07:10:23,403 INFO  [PostGoalTag] Running post goal: war:webapp
preCompile:
    [mkdir] Created dir: /home/continuum/continuum-1.0.2/apps/continuum/work/68/applications/welcome/target/geronimo-welcome/WEB-INF/work
    [echo] Pre-compiling JSPs from /home/continuum/continuum-1.0.2/apps/continuum/work/68/applications/welcome/src/webapp to /home/continuum/continuum-1.0.2/apps/continuum/work/68/applications/welcome/target/geronimo-welcome/WEB-INF/work.
    [echo] Compiling generated Java files in /home/continuum/continuum-1.0.2/apps/continuum/work/68/applications/welcome/target/geronimo-welcome/WEB-INF/work.
    [javac] Compiling 2 source files to /home/continuum/continuum-1.0.2/apps/continuum/work/68/applications/welcome/target/geronimo-welcome/WEB-INF/work
    [echo] Merging generated-web.xml with our web.xml

Running post goal: war:webapp
07:10:24,674 INFO  [PostGoalTag] Running post goal: war:webapp
    [echo] Use classes.jar ? true
    [move] Moving 3 files to /home/continuum/continuum-1.0.2/apps/continuum/work/68/applications/welcome/target/temp
    [jar] Building jar: /home/continuum/continuum-1.0.2/apps/continuum/work/68/applications/welcome/target/geronimo-welcome/WEB-INF/lib/classes.jar
    [delete] Deleted 4 directories from /home/continuum/continuum-1.0.2/apps/continuum/work/68/applications/welcome/target/geronimo-welcome/WEB-INF/classes
    [delete] Deleting 2 files from /home/continuum/continuum-1.0.2/apps/continuum/work/68/applications/welcome/target/geronimo-welcome/WEB-INF/work
    [delete] Deleted 4 directories from /home/continuum/continuum-1.0.2/apps/continuum/work/68/applications/welcome/target/geronimo-welcome/WEB-INF/work
    [delete] Deleting 3 files from /home/continuum/continuum-1.0.2/apps/continuum/work/68/applications/welcome/target/temp
    [delete] Deleted 6 directories from /home/continuum/continuum-1.0.2/apps/continuum/work/68/applications/welcome/target/temp

war:war:
    [echo] Building WAR geronimo-welcome
    [jar] Building jar: /home/continuum/continuum-1.0.2/apps/continuum/work/68/applications/welcome/target/geronimo-welcome-1.1-SNAPSHOT.war

war:install:
    [echo] Installing...
Uploading to geronimo/wars/geronimo-welcome-1.1-SNAPSHOT.war: 
.................... (405K)
Uploading to geronimo/poms/geronimo-welcome-1.1-SNAPSHOT.pom: 
.................... (12K)


build:end:


Starting the reactor...
new4:
07:10:25,455 INFO  [ReactorTag] Starting the reactor...
Our processing order:
07:10:34,006 INFO  [ReactorTag] Our processing order:
Geronimo Configuration for performing service deployments
07:10:34,006 INFO  [ReactorTag] Geronimo Configuration for performing service deployments
System Configuration for the J2EE Server
07:10:34,006 INFO  [ReactorTag] System Configuration for the J2EE Server
RMI/Naming configuration
07:10:34,006 INFO  [ReactorTag] RMI/Naming configuration
Server Configuration for the J2EE Server
07:10:34,006 INFO  [ReactorTag] Server Configuration for the J2EE Server
System Configuration for the J2EE Client
07:10:34,006 INFO  [ReactorTag] System Configuration for the J2EE Client
Configuration for the J2EE Client
07:10:34,006 INFO  [ReactorTag] Configuration for the J2EE Client
Configuration for performing J2EE deployments
07:10:34,007 INFO  [ReactorTag] Configuration for performing J2EE deployments
Configuration for application client deployments
07:10:34,007 INFO  [ReactorTag] Configuration for application client deployments
openejb Configuration for performing J2EE deployments
07:10:34,007 INFO  [ReactorTag] openejb Configuration for performing J2EE deployments
Axis Configuration for the J2EE Server
07:10:34,007 INFO  [ReactorTag] Axis Configuration for the J2EE Server
Axis Configuration for performing J2EE deployments
07:10:34,007 INFO  [ReactorTag] Axis Configuration for performing J2EE deployments
System Database Configuration for the J2EE Server
07:10:34,007 INFO  [ReactorTag] System Database Configuration for the J2EE Server
ActiveMQ broker configuration
07:10:34,007 INFO  [ReactorTag] ActiveMQ broker configuration
Activemq configuration
07:10:34,007 INFO  [ReactorTag] Activemq configuration
Corba Configuration for the J2EE Client
07:10:34,007 INFO  [ReactorTag] Corba Configuration for the J2EE Client
Security Configuration for the J2EE Client
07:10:34,007 INFO  [ReactorTag] Security Configuration for the J2EE Client
Security Configuration for the J2EE Server
07:10:34,007 INFO  [ReactorTag] Security Configuration for the J2EE Server
Jetty Configuration for the J2EE Server
07:10:34,007 INFO  [ReactorTag] Jetty Configuration for the J2EE Server
Jetty Deployer Configuration for the J2EE Server
07:10:34,007 INFO  [ReactorTag] Jetty Deployer Configuration for the J2EE Server
Web console deployed on jetty
07:10:34,008 INFO  [ReactorTag] Web console deployed on jetty
Tomcat Configuration for the J2EE Server
07:10:34,008 INFO  [ReactorTag] Tomcat Configuration for the J2EE Server
Tomcat Deployer Configuration for the J2EE Server
07:10:34,008 INFO  [ReactorTag] Tomcat Deployer Configuration for the J2EE Server
Web console deployed on tomcat
07:10:34,008 INFO  [ReactorTag] Web console deployed on tomcat
openejb Configuration for the J2EE Server
07:10:34,008 INFO  [ReactorTag] openejb Configuration for the J2EE Server
Daytrader using derby deployed on jetty
07:10:34,008 INFO  [ReactorTag] Daytrader using derby deployed on jetty
Daytrader using derby deployed on tomcat
07:10:34,008 INFO  [ReactorTag] Daytrader using derby deployed on tomcat
Directory Configuration
07:10:34,008 INFO  [ReactorTag] Directory Configuration
Hot deployer
07:10:34,008 INFO  [ReactorTag] Hot deployer
Corba Configuration for the J2EE Server
07:10:34,008 INFO  [ReactorTag] Corba Configuration for the J2EE Server
JavaMail
07:10:34,008 INFO  [ReactorTag] JavaMail
JSP Examples for Jetty
07:10:34,008 INFO  [ReactorTag] JSP Examples for Jetty
JSP Examples Tomcat
07:10:34,008 INFO  [ReactorTag] JSP Examples Tomcat
LDAP security realm
07:10:34,008 INFO  [ReactorTag] LDAP security realm
LDAP Demo for Jetty
07:10:34,009 INFO  [ReactorTag] LDAP Demo for Jetty
LDAP Demo for Tomcat
07:10:34,009 INFO  [ReactorTag] LDAP Demo for Tomcat
Online Deployer
07:10:34,009 INFO  [ReactorTag] Online Deployer
Geronimo :: Remote Deploy Jetty Application
07:10:34,009 INFO  [ReactorTag] Geronimo :: Remote Deploy Jetty Application
Geronimo :: Remote Deploy Tomcat Application
07:10:34,009 INFO  [ReactorTag] Geronimo :: Remote Deploy Tomcat Application
Servlet Examples for Jetty
07:10:34,009 INFO  [ReactorTag] Servlet Examples for Jetty
Servlet Examples Tomcat
07:10:34,009 INFO  [ReactorTag] Servlet Examples Tomcat
Shared Library GBean
07:10:34,009 INFO  [ReactorTag] Shared Library GBean
Shutdown
07:10:34,009 INFO  [ReactorTag] Shutdown
UDDI server Configuration for the J2EE Jetty Server
07:10:34,009 INFO  [ReactorTag] UDDI server Configuration for the J2EE Jetty Server
UDDI server Configuration for the J2EE Tomcat Server
07:10:34,009 INFO  [ReactorTag] UDDI server Configuration for the J2EE Tomcat Server
Configuration for no j2ee app clients
07:10:34,009 INFO  [ReactorTag] Configuration for no j2ee app clients
Configuration for no EJBs
07:10:34,009 INFO  [ReactorTag] Configuration for no EJBs
Unavailable Web Services deployer
07:10:34,010 INFO  [ReactorTag] Unavailable Web Services deployer
System Configuration for the command line upgrade
07:10:34,010 INFO  [ReactorTag] System Configuration for the command line upgrade
Geronimo Configuration for upgrading plans
07:10:34,010 INFO  [ReactorTag] Geronimo Configuration for upgrading plans
Welcome app for Jetty
07:10:34,010 INFO  [ReactorTag] Welcome app for Jetty
Welcome app Tomcat
07:10:34,010 INFO  [ReactorTag] Welcome app Tomcat
+----------------------------------------
07:10:34,010 INFO  [ReactorTag] +----------------------------------------
| configurations Geronimo Configuration for performing service deployments
07:10:34,010 INFO  [ReactorTag] | configurations Geronimo Configuration for performing service deployments
| Memory: 39M/61M
07:10:34,010 INFO  [ReactorTag] | Memory: 39M/61M
+----------------------------------------
07:10:34,010 INFO  [ReactorTag] +----------------------------------------
DEPRECATED: the default goal should be specified in the <build> section of project.xml instead of maven.xml
07:10:34,033 WARN  [PluginScriptParser] DEPRECATED: the default goal should be specified in the <build> section of project.xml instead of maven.xml
DEPRECATED: the default goal should be specified in the <build> section of project.xml instead of maven.xml
07:10:34,035 WARN  [PluginScriptParser] DEPRECATED: the default goal should be specified in the <build> section of project.xml instead of maven.xml
build:start:

multiproject:install-callback:
    [echo] Running car:install for Geronimo Configuration for performing service deployments
car:prepare-plan:

car:package:

    Packaging configuration /home/continuum/continuum-1.0.2/apps/continuum/work/68/configs/geronimo-gbean-deployer/target/plan/plan.xml


car:install:
    [echo] Installing...
Uploading to geronimo/cars/geronimo-gbean-deployer-1.1-SNAPSHOT.car: 
.................... (3K)
Uploading to geronimo/poms/geronimo-gbean-deployer-1.1-SNAPSHOT.pom: 
.................... (13K)
    [echo] about to copy configs
    [echo] done copying configs

+----------------------------------------

build:end:

07:10:35,384 INFO  [ReactorTag] +----------------------------------------
| configurations System Configuration for the J2EE Server
07:10:35,385 INFO  [ReactorTag] | configurations System Configuration for the J2EE Server
| Memory: 41M/61M
07:10:35,385 INFO  [ReactorTag] | Memory: 41M/61M
+----------------------------------------
07:10:35,385 INFO  [ReactorTag] +----------------------------------------
DEPRECATED: the default goal should be specified in the <build> section of project.xml instead of maven.xml
07:10:35,415 WARN  [PluginScriptParser] DEPRECATED: the default goal should be specified in the <build> section of project.xml instead of maven.xml
DEPRECATED: the default goal should be specified in the <build> section of project.xml instead of maven.xml
07:10:35,417 WARN  [PluginScriptParser] DEPRECATED: the default goal should be specified in the <build> section of project.xml instead of maven.xml
Attempting to download geronimo-gbean-deployer-1.1-SNAPSHOT.car.
07:10:35,707 INFO  [DependencyVerifier] Attempting to download geronimo-gbean-deployer-1.1-SNAPSHOT.car.
Error retrieving artifact from [http://dist.codehaus.org]: org.apache.maven.wagon.TransferFailedException: Connection refused
07:10:35,882 WARN  [DependencyVerifier] Error retrieving artifact from [http://dist.codehaus.org]: org.apache.maven.wagon.TransferFailedException: Connection refused
build:start:

multiproject:install-callback:
    [echo] Running car:install for System Configuration for the J2EE Server
car:prepare-plan:

car:package:
    [delete] Deleting directory /home/continuum/continuum-1.0.2/apps/continuum/work/68/configs/j2ee-system/target/repository
    [mkdir] Created dir: /home/continuum/continuum-1.0.2/apps/continuum/work/68/configs/j2ee-system/target/repository

    Packaging configuration /home/continuum/continuum-1.0.2/apps/continuum/work/68/configs/j2ee-system/target/plan/plan.xml

log4j:WARN No appenders could be found for logger (org.apache.geronimo.kernel.basic.BasicKernel).
log4j:WARN Please initialize the log4j system properly.
Generated package /home/continuum/continuum-1.0.2/apps/continuum/work/68/configs/j2ee-system/target/j2ee-system-1.1-SNAPSHOT.car

car:install:
    [echo] Installing...
Uploading to geronimo/cars/j2ee-system-1.1-SNAPSHOT.car: 
.................... (7K)
Uploading to geronimo/poms/j2ee-system-1.1-SNAPSHOT.pom: 
.................... (14K)
    [echo] about to copy configs
    [echo] done copying configs

+----------------------------------------

build:end:

07:10:54,568 INFO  [ReactorTag] +----------------------------------------
| configurations RMI/Naming configuration
07:10:54,568 INFO  [ReactorTag] | configurations RMI/Naming configuration
| Memory: 34M/61M
07:10:54,568 INFO  [ReactorTag] | Memory: 34M/61M
+----------------------------------------
07:10:54,568 INFO  [ReactorTag] +----------------------------------------
DEPRECATED: the default goal should be specified in the <build> section of project.xml instead of maven.xml
07:10:54,593 WARN  [PluginScriptParser] DEPRECATED: the default goal should be specified in the <build> section of project.xml instead of maven.xml
DEPRECATED: the default goal should be specified in the <build> section of project.xml instead of maven.xml
07:10:54,595 WARN  [PluginScriptParser] DEPRECATED: the default goal should be specified in the <build> section of project.xml instead of maven.xml
Attempting to download j2ee-system-1.1-SNAPSHOT.car.
07:10:54,913 INFO  [DependencyVerifier] Attempting to download j2ee-system-1.1-SNAPSHOT.car.
Error retrieving artifact from [http://dist.codehaus.org]: org.apache.maven.wagon.TransferFailedException: Connection refused
07:10:55,080 WARN  [DependencyVerifier] Error retrieving artifact from [http://dist.codehaus.org]: org.apache.maven.wagon.TransferFailedException: Connection refused
Attempting to download geronimo-jmxremoting-1.1-SNAPSHOT.jar.
07:11:40,672 INFO  [DependencyVerifier] Attempting to download geronimo-jmxremoting-1.1-SNAPSHOT.jar.
Error retrieving artifact from [http://dist.codehaus.org]: org.apache.maven.wagon.TransferFailedException: Connection refused
07:11:40,783 WARN  [DependencyVerifier] Error retrieving artifact from [http://dist.codehaus.org]: org.apache.maven.wagon.TransferFailedException: Connection refused
Attempting to download activemq-gbean-management-g1_1-3.2.4-SNAPSHOT.jar.
07:11:52,185 INFO  [DependencyVerifier] Attempting to download activemq-gbean-management-g1_1-3.2.4-SNAPSHOT.jar.
Error retrieving artifact from [http://dist.codehaus.org]: org.apache.maven.wagon.TransferFailedException: Connection refused
07:11:52,296 WARN  [DependencyVerifier] Error retrieving artifact from [http://dist.codehaus.org]: org.apache.maven.wagon.TransferFailedException: Connection refused
Artifact /activemq/jars/activemq-gbean-management-g1_1-3.2.4-SNAPSHOT.jar doesn't exist in remote repository, but it exists locally.
07:11:55,364 INFO  [DependencyVerifier] Artifact /activemq/jars/activemq-gbean-management-g1_1-3.2.4-SNAPSHOT.jar doesn't exist in remote repository, but it exists locally.
build:start:

multiproject:install-callback:
    [echo] Running car:install for RMI/Naming configuration
car:prepare-plan:

car:package:
    [delete] Deleting directory /home/continuum/continuum-1.0.2/apps/continuum/work/68/configs/rmi-naming/target/repository
    [mkdir] Created dir: /home/continuum/continuum-1.0.2/apps/continuum/work/68/configs/rmi-naming/target/repository

    Packaging configuration /home/continuum/continuum-1.0.2/apps/continuum/work/68/configs/rmi-naming/target/plan/plan.xml

Generated package /home/continuum/continuum-1.0.2/apps/continuum/work/68/configs/rmi-naming/target/rmi-naming-1.1-SNAPSHOT.car

car:install:
    [echo] Installing...
    [echo] about to copy configs
    [echo] done copying configs

+----------------------------------------

build:end:

07:11:56,312 INFO  [ReactorTag] +----------------------------------------
| configurations Server Configuration for the J2EE Server
07:11:56,312 INFO  [ReactorTag] | configurations Server Configuration for the J2EE Server
| Memory: 37M/61M
07:11:56,312 INFO  [ReactorTag] | Memory: 37M/61M
+----------------------------------------
07:11:56,312 INFO  [ReactorTag] +----------------------------------------
DEPRECATED: the default goal should be specified in the <build> section of project.xml instead of maven.xml
07:11:56,365 WARN  [PluginScriptParser] DEPRECATED: the default goal should be specified in the <build> section of project.xml instead of maven.xml
DEPRECATED: the default goal should be specified in the <build> section of project.xml instead of maven.xml
07:11:56,368 WARN  [PluginScriptParser] DEPRECATED: the default goal should be specified in the <build> section of project.xml instead of maven.xml
Attempting to download rmi-naming-1.1-SNAPSHOT.car.
07:11:56,679 INFO  [DependencyVerifier] Attempting to download rmi-naming-1.1-SNAPSHOT.car.
Error retrieving artifact from [http://dist.codehaus.org]: org.apache.maven.wagon.TransferFailedException: Connection refused
07:11:56,814 WARN  [DependencyVerifier] Error retrieving artifact from [http://dist.codehaus.org]: org.apache.maven.wagon.TransferFailedException: Connection refused
Attempting to download geronimo-activation-1.1-SNAPSHOT.jar.
07:11:57,312 INFO  [DependencyVerifier] Attempting to download geronimo-activation-1.1-SNAPSHOT.jar.
Error retrieving artifact from [http://dist.codehaus.org]: org.apache.maven.wagon.TransferFailedException: Connection refused
07:11:57,433 WARN  [DependencyVerifier] Error retrieving artifact from [http://dist.codehaus.org]: org.apache.maven.wagon.TransferFailedException: Connection refused
build:start:

multiproject:install-callback:
    [echo] Running car:install for Server Configuration for the J2EE Server
car:prepare-plan:

car:package:
    [delete] Deleting directory /home/continuum/continuum-1.0.2/apps/continuum/work/68/configs/j2ee-server/target/repository
    [mkdir] Created dir: /home/continuum/continuum-1.0.2/apps/continuum/work/68/configs/j2ee-server/target/repository

    Packaging configuration /home/continuum/continuum-1.0.2/apps/continuum/work/68/configs/j2ee-server/target/plan/plan.xml

Generated package /home/continuum/continuum-1.0.2/apps/continuum/work/68/configs/j2ee-server/target/j2ee-server-1.1-SNAPSHOT.car

car:install:
    [echo] Installing...
    [echo] about to copy configs
    [echo] done copying configs

+----------------------------------------

build:end:

07:11:59,314 INFO  [ReactorTag] +----------------------------------------
| configurations System Configuration for the J2EE Client
07:11:59,314 INFO  [ReactorTag] | configurations System Configuration for the J2EE Client
| Memory: 41M/61M
07:11:59,314 INFO  [ReactorTag] | Memory: 41M/61M
+----------------------------------------
07:11:59,314 INFO  [ReactorTag] +----------------------------------------
DEPRECATED: the default goal should be specified in the <build> section of project.xml instead of maven.xml
07:11:59,336 WARN  [PluginScriptParser] DEPRECATED: the default goal should be specified in the <build> section of project.xml instead of maven.xml
DEPRECATED: the default goal should be specified in the <build> section of project.xml instead of maven.xml
07:11:59,337 WARN  [PluginScriptParser] DEPRECATED: the default goal should be specified in the <build> section of project.xml instead of maven.xml
build:start:

multiproject:install-callback:
    [echo] Running car:install for System Configuration for the J2EE Client
car:prepare-plan:

car:package:
    [delete] Deleting directory /home/continuum/continuum-1.0.2/apps/continuum/work/68/configs/client-system/target/repository
    [mkdir] Created dir: /home/continuum/continuum-1.0.2/apps/continuum/work/68/configs/client-system/target/repository

    Packaging configuration /home/continuum/continuum-1.0.2/apps/continuum/work/68/configs/client-system/target/plan/plan.xml

Generated package /home/continuum/continuum-1.0.2/apps/continuum/work/68/configs/client-system/target/client-system-1.1-SNAPSHOT.car

car:install:
    [echo] Installing...
Uploading to geronimo/cars/client-system-1.1-SNAPSHOT.car: 
.................... (7K)
Uploading to geronimo/poms/client-system-1.1-SNAPSHOT.pom: 
.................... (13K)
    [echo] about to copy configs
    [echo] done copying configs

+----------------------------------------

build:end:

07:12:00,271 INFO  [ReactorTag] +----------------------------------------
| configurations Configuration for the J2EE Client
07:12:00,271 INFO  [ReactorTag] | configurations Configuration for the J2EE Client
| Memory: 44M/61M
07:12:00,271 INFO  [ReactorTag] | Memory: 44M/61M
+----------------------------------------
07:12:00,272 INFO  [ReactorTag] +----------------------------------------
DEPRECATED: the default goal should be specified in the <build> section of project.xml instead of maven.xml
07:12:00,296 WARN  [PluginScriptParser] DEPRECATED: the default goal should be specified in the <build> section of project.xml instead of maven.xml
DEPRECATED: the default goal should be specified in the <build> section of project.xml instead of maven.xml
07:12:00,297 WARN  [PluginScriptParser] DEPRECATED: the default goal should be specified in the <build> section of project.xml instead of maven.xml
Attempting to download client-system-1.1-SNAPSHOT.car.
07:12:00,591 INFO  [DependencyVerifier] Attempting to download client-system-1.1-SNAPSHOT.car.
Error retrieving artifact from [http://dist.codehaus.org]: org.apache.maven.wagon.TransferFailedException: Connection refused
07:12:00,735 WARN  [DependencyVerifier] Error retrieving artifact from [http://dist.codehaus.org]: org.apache.maven.wagon.TransferFailedException: Connection refused
build:start:

multiproject:install-callback:
    [echo] Running car:install for Configuration for the J2EE Client
car:prepare-plan:

car:package:
    [delete] Deleting directory /home/continuum/continuum-1.0.2/apps/continuum/work/68/configs/client/target/repository
    [mkdir] Created dir: /home/continuum/continuum-1.0.2/apps/continuum/work/68/configs/client/target/repository

    Packaging configuration /home/continuum/continuum-1.0.2/apps/continuum/work/68/configs/client/target/plan/plan.xml

07:12:03,058 ERROR [PackageBuilder] org.apache.geronimo.common.DeploymentException: Unable to create configuration for deployment
org.apache.geronimo.common.DeploymentException: Unable to create configuration for deployment
	at org.apache.geronimo.deployment.DeploymentContext.createTempConfiguration(DeploymentContext.java:116)
	at org.apache.geronimo.deployment.DeploymentContext.<init>(DeploymentContext.java:96)
	at org.apache.geronimo.deployment.DeploymentContext.<init>(DeploymentContext.java:78)
	at org.apache.geronimo.deployment.service.ServiceConfigBuilder.buildConfiguration(ServiceConfigBuilder.java:235)
	at org.apache.geronimo.deployment.service.ServiceConfigBuilder.buildConfiguration(ServiceConfigBuilder.java:211)
	at org.apache.geronimo.deployment.service.ServiceConfigBuilder$$FastClassByCGLIB$$9f173be6.invoke(<generated>)
	at net.sf.cglib.reflect.FastMethod.invoke(FastMethod.java:53)
	at org.apache.geronimo.gbean.runtime.FastMethodInvoker.invoke(FastMethodInvoker.java:38)
	at org.apache.geronimo.gbean.runtime.GBeanOperation.invoke(GBeanOperation.java:122)
	at org.apache.geronimo.gbean.runtime.GBeanInstance.invoke(GBeanInstance.java:817)
	at org.apache.geronimo.gbean.runtime.RawInvoker.invoke(RawInvoker.java:57)
	at org.apache.geronimo.kernel.basic.RawOperationInvoker.invoke(RawOperationInvoker.java:35)
	at org.apache.geronimo.kernel.basic.ProxyMethodInterceptor.intercept(ProxyMethodInterceptor.java:96)
	at org.apache.geronimo.deployment.ConfigurationBuilder$$EnhancerByCGLIB$$a63bb92a.buildConfiguration(<generated>)
	at org.apache.geronimo.deployment.Deployer.deploy(Deployer.java:299)
	at org.apache.geronimo.deployment.Deployer$$FastClassByCGLIB$$734a235d.invoke(<generated>)
	at net.sf.cglib.reflect.FastMethod.invoke(FastMethod.java:53)
	at org.apache.geronimo.gbean.runtime.FastMethodInvoker.invoke(FastMethodInvoker.java:38)
	at org.apache.geronimo.gbean.runtime.GBeanOperation.invoke(GBeanOperation.java:122)
	at org.apache.geronimo.gbean.runtime.GBeanInstance.invoke(GBeanInstance.java:852)
	at org.apache.geronimo.kernel.basic.BasicKernel.invoke(BasicKernel.java:239)
	at org.apache.geronimo.plugin.packaging.PackageBuilder.invokeDeployer(PackageBuilder.java:472)
	at org.apache.geronimo.plugin.packaging.PackageBuilder.execute(PackageBuilder.java:332)
	at sun.reflect.NativeMethodAccessorImpl.invoke0(Native Method)
	at sun.reflect.NativeMethodAccessorImpl.invoke(NativeMethodAccessorImpl.java:39)
	at sun.reflect.DelegatingMethodAccessorImpl.invoke(DelegatingMethodAccessorImpl.java:25)
	at java.lang.reflect.Method.invoke(Method.java:324)
	at org.apache.geronimo.plugin.packaging.PackageBuilderShell.execute(PackageBuilderShell.java:291)
	at sun.reflect.NativeMethodAccessorImpl.invoke0(Native Method)
	at sun.reflect.NativeMethodAccessorImpl.invoke(NativeMethodAccessorImpl.java:39)
	at sun.reflect.DelegatingMethodAccessorImpl.invoke(DelegatingMethodAccessorImpl.java:25)
	at java.lang.reflect.Method.invoke(Method.java:324)
	at org.apache.commons.jelly.impl.DynamicBeanTag.doTag(DynamicBeanTag.java:180)
	at org.apache.commons.jelly.impl.StaticTagScript.run(StaticTagScript.java:102)
	at org.apache.commons.jelly.impl.ScriptBlock.run(ScriptBlock.java:95)
	at org.apache.maven.jelly.tags.werkz.MavenGoalTag.runBodyTag(MavenGoalTag.java:78)
	at org.apache.maven.jelly.tags.werkz.MavenGoalTag$MavenGoalAction.performAction(MavenGoalTag.java:109)
	at org.apache.maven.werkz.Goal.fire(Goal.java:656)
	at org.apache.maven.werkz.Goal.attain(Goal.java:592)
	at org.apache.maven.werkz.Goal.attainPrecursors(Goal.java:505)
	at org.apache.maven.werkz.Goal.attain(Goal.java:590)
	at org.apache.maven.werkz.WerkzProject.attainGoal(WerkzProject.java:210)
	at org.apache.maven.jelly.tags.werkz.MavenAttainGoalTag.doTag(MavenAttainGoalTag.java:114)
	at org.apache.commons.jelly.impl.TagScript.run(TagScript.java:247)
	at org.apache.commons.jelly.impl.ScriptBlock.run(ScriptBlock.java:95)
	at org.apache.maven.jelly.tags.werkz.MavenGoalTag.runBodyTag(MavenGoalTag.java:78)
	at org.apache.maven.jelly.tags.werkz.MavenGoalTag$MavenGoalAction.performAction(MavenGoalTag.java:109)
	at org.apache.maven.werkz.Goal.fire(Goal.java:656)
	at org.apache.maven.werkz.Goal.attain(Goal.java:592)
	at org.apache.maven.plugin.PluginManager.attainGoals(PluginManager.java:693)
	at org.apache.maven.MavenSession.attainGoals(MavenSession.java:263)
	at org.apache.maven.jelly.tags.maven.ReactorTag.doTag(ReactorTag.java:368)
	at org.apache.commons.jelly.impl.TagScript.run(TagScript.java:247)
	at org.apache.commons.jelly.impl.ScriptBlock.run(ScriptBlock.java:95)
	at org.apache.maven.jelly.tags.werkz.MavenGoalTag.runBodyTag(MavenGoalTag.java:78)
	at org.apache.maven.jelly.tags.werkz.MavenGoalTag$MavenGoalAction.performAction(MavenGoalTag.java:109)
	at org.apache.maven.werkz.Goal.fire(Goal.java:656)
	at org.apache.maven.werkz.Goal.attain(Goal.java:592)
	at org.apache.maven.werkz.WerkzProject.attainGoal(WerkzProject.java:210)
	at org.apache.maven.jelly.tags.werkz.MavenAttainGoalTag.doTag(MavenAttainGoalTag.java:114)
	at org.apache.commons.jelly.impl.TagScript.run(TagScript.java:247)
	at org.apache.commons.jelly.impl.ScriptBlock.run(ScriptBlock.java:95)
	at org.apache.maven.jelly.tags.werkz.MavenGoalTag.runBodyTag(MavenGoalTag.java:78)
	at org.apache.maven.jelly.tags.werkz.MavenGoalTag$MavenGoalAction.performAction(MavenGoalTag.java:109)
	at org.apache.maven.werkz.Goal.fire(Goal.java:656)
	at org.apache.maven.werkz.Goal.attain(Goal.java:592)
	at org.apache.maven.plugin.PluginManager.attainGoals(PluginManager.java:693)
	at org.apache.maven.MavenSession.attainGoals(MavenSession.java:263)
	at org.apache.maven.cli.App.doMain(App.java:511)
	at org.apache.maven.cli.App.main(App.java:1258)
	at sun.reflect.NativeMethodAccessorImpl.invoke0(Native Method)
	at sun.reflect.NativeMethodAccessorImpl.invoke(NativeMethodAccessorImpl.java:39)
	at sun.reflect.DelegatingMethodAccessorImpl.invoke(DelegatingMethodAccessorImpl.java:25)
	at java.lang.reflect.Method.invoke(Method.java:324)
	at com.werken.forehead.Forehead.run(Forehead.java:551)
	at com.werken.forehead.Forehead.main(Forehead.java:581)
Caused by: org.apache.geronimo.kernel.config.LifecycleException: load of geronimo/client/1.1-SNAPSHOT/car failed
	at org.apache.geronimo.kernel.config.SimpleConfigurationManager.loadConfiguration(SimpleConfigurationManager.java:300)
	at org.apache.geronimo.deployment.DeploymentConfigurationManager.loadConfiguration(DeploymentConfigurationManager.java:115)
	at org.apache.geronimo.kernel.config.SimpleConfigurationManager.loadConfiguration(SimpleConfigurationManager.java:259)
	at org.apache.geronimo.deployment.DeploymentConfigurationManager.loadConfiguration(DeploymentConfigurationManager.java:111)
	at org.apache.geronimo.deployment.DeploymentContext.createTempConfiguration(DeploymentContext.java:113)
	... 75 more
Caused by: org.apache.geronimo.kernel.config.InvalidConfigException: Error starting configuration gbean geronimo/client/1.1-SNAPSHOT/car
	at org.apache.geronimo.kernel.config.SimpleConfigurationManager.load(SimpleConfigurationManager.java:325)
	at org.apache.geronimo.deployment.DeploymentConfigurationManager.load(DeploymentConfigurationManager.java:119)
	at org.apache.geronimo.kernel.config.SimpleConfigurationManager.loadConfiguration(SimpleConfigurationManager.java:285)
	... 79 more
Caused by: org.apache.geronimo.kernel.repository.MissingDependencyException: Unable to resolve dependency org.apache.geronimo.specs/geronimo-javamail_1.3.1_spec/1.0/jar
	at org.apache.geronimo.kernel.config.ConfigurationResolver.resolve(ConfigurationResolver.java:112)
	at org.apache.geronimo.kernel.config.Configuration.buildClassPath(Configuration.java:397)
	at org.apache.geronimo.kernel.config.Configuration.createConfigurationClasssLoader(Configuration.java:322)
	at org.apache.geronimo.kernel.config.Configuration.<init>(Configuration.java:267)
	at org.apache.geronimo.kernel.config.SimpleConfigurationManager.load(SimpleConfigurationManager.java:321)
	... 81 more
java.lang.reflect.InvocationTargetException: null
java.lang.reflect.InvocationTargetException
	at sun.reflect.NativeMethodAccessorImpl.invoke0(Native Method)
	at sun.reflect.NativeMethodAccessorImpl.invoke(NativeMethodAccessorImpl.java:39)
	at sun.reflect.DelegatingMethodAccessorImpl.invoke(DelegatingMethodAccessorImpl.java:25)
	at java.lang.reflect.Method.invoke(Method.java:324)
	at org.apache.geronimo.plugin.packaging.PackageBuilderShell.execute(PackageBuilderShell.java:291)
	at sun.reflect.NativeMethodAccessorImpl.invoke0(Native Method)
	at sun.reflect.NativeMethodAccessorImpl.invoke(NativeMethodAccessorImpl.java:39)
	at sun.reflect.DelegatingMethodAccessorImpl.invoke(DelegatingMethodAccessorImpl.java:25)
	at java.lang.reflect.Method.invoke(Method.java:324)
	at org.apache.commons.jelly.impl.DynamicBeanTag.doTag(DynamicBeanTag.java:180)
	at org.apache.commons.jelly.impl.StaticTagScript.run(StaticTagScript.java:102)
	at org.apache.commons.jelly.impl.ScriptBlock.run(ScriptBlock.java:95)
	at org.apache.maven.jelly.tags.werkz.MavenGoalTag.runBodyTag(MavenGoalTag.java:78)
	at org.apache.maven.jelly.tags.werkz.MavenGoalTag$MavenGoalAction.performAction(MavenGoalTag.java:109)
	at org.apache.maven.werkz.Goal.fire(Goal.java:656)
	at org.apache.maven.werkz.Goal.attain(Goal.java:592)
	at org.apache.maven.werkz.Goal.attainPrecursors(Goal.java:505)
	at org.apache.maven.werkz.Goal.attain(Goal.java:590)
	at org.apache.maven.werkz.WerkzProject.attainGoal(WerkzProject.java:210)
	at org.apache.maven.jelly.tags.werkz.MavenAttainGoalTag.doTag(MavenAttainGoalTag.java:114)
	at org.apache.commons.jelly.impl.TagScript.run(TagScript.java:247)
	at org.apache.commons.jelly.impl.ScriptBlock.run(ScriptBlock.java:95)
	at org.apache.maven.jelly.tags.werkz.MavenGoalTag.runBodyTag(MavenGoalTag.java:78)
	at org.apache.maven.jelly.tags.werkz.MavenGoalTag$MavenGoalAction.performAction(MavenGoalTag.java:109)
	at org.apache.maven.werkz.Goal.fire(Goal.java:656)
	at org.apache.maven.werkz.Goal.attain(Goal.java:592)
	at org.apache.maven.plugin.PluginManager.attainGoals(PluginManager.java:693)
	at org.apache.maven.MavenSession.attainGoals(MavenSession.java:263)
	at org.apache.maven.jelly.tags.maven.ReactorTag.doTag(ReactorTag.java:368)
	at org.apache.commons.jelly.impl.TagScript.run(TagScript.java:247)
	at org.apache.commons.jelly.impl.ScriptBlock.run(ScriptBlock.java:95)
	at org.apache.maven.jelly.tags.werkz.MavenGoalTag.runBodyTag(MavenGoalTag.java:78)
	at org.apache.maven.jelly.tags.werkz.MavenGoalTag$MavenGoalAction.performAction(MavenGoalTag.java:109)
	at org.apache.maven.werkz.Goal.fire(Goal.java:656)
	at org.apache.maven.werkz.Goal.attain(Goal.java:592)
	at org.apache.maven.werkz.WerkzProject.attainGoal(WerkzProject.java:210)
	at org.apache.maven.jelly.tags.werkz.MavenAttainGoalTag.doTag(MavenAttainGoalTag.java:114)
	at org.apache.commons.jelly.impl.TagScript.run(TagScript.java:247)
	at org.apache.commons.jelly.impl.ScriptBlock.run(ScriptBlock.java:95)
	at org.apache.maven.jelly.tags.werkz.MavenGoalTag.runBodyTag(MavenGoalTag.java:78)
	at org.apache.maven.jelly.tags.werkz.MavenGoalTag$MavenGoalAction.performAction(MavenGoalTag.java:109)
	at org.apache.maven.werkz.Goal.fire(Goal.java:656)
	at org.apache.maven.werkz.Goal.attain(Goal.java:592)
	at org.apache.maven.plugin.PluginManager.attainGoals(PluginManager.java:693)
	at org.apache.maven.MavenSession.attainGoals(MavenSession.java:263)
	at org.apache.maven.cli.App.doMain(App.java:511)
	at org.apache.maven.cli.App.main(App.java:1258)
	at sun.reflect.NativeMethodAccessorImpl.invoke0(Native Method)
	at sun.reflect.NativeMethodAccessorImpl.invoke(NativeMethodAccessorImpl.java:39)
	at sun.reflect.DelegatingMethodAccessorImpl.invoke(DelegatingMethodAccessorImpl.java:25)
	at java.lang.reflect.Method.invoke(Method.java:324)
	at com.werken.forehead.Forehead.run(Forehead.java:551)
	at com.werken.forehead.Forehead.main(Forehead.java:581)
Caused by: org.apache.geronimo.common.DeploymentException: Unable to create configuration for deployment
	at org.apache.geronimo.deployment.DeploymentContext.createTempConfiguration(DeploymentContext.java:116)
	at org.apache.geronimo.deployment.DeploymentContext.<init>(DeploymentContext.java:96)
	at org.apache.geronimo.deployment.DeploymentContext.<init>(DeploymentContext.java:78)
	at org.apache.geronimo.deployment.service.ServiceConfigBuilder.buildConfiguration(ServiceConfigBuilder.java:235)
	at org.apache.geronimo.deployment.service.ServiceConfigBuilder.buildConfiguration(ServiceConfigBuilder.java:211)
	at org.apache.geronimo.deployment.service.ServiceConfigBuilder$$FastClassByCGLIB$$9f173be6.invoke(<generated>)
	at net.sf.cglib.reflect.FastMethod.invoke(FastMethod.java:53)
	at org.apache.geronimo.gbean.runtime.FastMethodInvoker.invoke(FastMethodInvoker.java:38)
	at org.apache.geronimo.gbean.runtime.GBeanOperation.invoke(GBeanOperation.java:122)
	at org.apache.geronimo.gbean.runtime.GBeanInstance.invoke(GBeanInstance.java:817)
	at org.apache.geronimo.gbean.runtime.RawInvoker.invoke(RawInvoker.java:57)
	at org.apache.geronimo.kernel.basic.RawOperationInvoker.invoke(RawOperationInvoker.java:35)
	at org.apache.geronimo.kernel.basic.ProxyMethodInterceptor.intercept(ProxyMethodInterceptor.java:96)
	at org.apache.geronimo.deployment.ConfigurationBuilder$$EnhancerByCGLIB$$a63bb92a.buildConfiguration(<generated>)
	at org.apache.geronimo.deployment.Deployer.deploy(Deployer.java:299)
	at org.apache.geronimo.deployment.Deployer$$FastClassByCGLIB$$734a235d.invoke(<generated>)
	at net.sf.cglib.reflect.FastMethod.invoke(FastMethod.java:53)
	at org.apache.geronimo.gbean.runtime.FastMethodInvoker.invoke(FastMethodInvoker.java:38)
	at org.apache.geronimo.gbean.runtime.GBeanOperation.invoke(GBeanOperation.java:122)
	at org.apache.geronimo.gbean.runtime.GBeanInstance.invoke(GBeanInstance.java:852)
	at org.apache.geronimo.kernel.basic.BasicKernel.invoke(BasicKernel.java:239)
	at org.apache.geronimo.plugin.packaging.PackageBuilder.invokeDeployer(PackageBuilder.java:472)
	at org.apache.geronimo.plugin.packaging.PackageBuilder.execute(PackageBuilder.java:332)
	... 53 more
Caused by: org.apache.geronimo.kernel.config.LifecycleException: load of geronimo/client/1.1-SNAPSHOT/car failed
	at org.apache.geronimo.kernel.config.SimpleConfigurationManager.loadConfiguration(SimpleConfigurationManager.java:300)
	at org.apache.geronimo.deployment.DeploymentConfigurationManager.loadConfiguration(DeploymentConfigurationManager.java:115)
	at org.apache.geronimo.kernel.config.SimpleConfigurationManager.loadConfiguration(SimpleConfigurationManager.java:259)
	at org.apache.geronimo.deployment.DeploymentConfigurationManager.loadConfiguration(DeploymentConfigurationManager.java:111)
	at org.apache.geronimo.deployment.DeploymentContext.createTempConfiguration(DeploymentContext.java:113)
	... 75 more
Caused by: org.apache.geronimo.kernel.config.InvalidConfigException: Error starting configuration gbean geronimo/client/1.1-SNAPSHOT/car
	at org.apache.geronimo.kernel.config.SimpleConfigurationManager.load(SimpleConfigurationManager.java:325)
	at org.apache.geronimo.deployment.DeploymentConfigurationManager.load(DeploymentConfigurationManager.java:119)
	at org.apache.geronimo.kernel.config.SimpleConfigurationManager.loadConfiguration(SimpleConfigurationManager.java:285)
	... 79 more
Caused by: org.apache.geronimo.kernel.repository.MissingDependencyException: Unable to resolve dependency org.apache.geronimo.specs/geronimo-javamail_1.3.1_spec/1.0/jar
	at org.apache.geronimo.kernel.config.ConfigurationResolver.resolve(ConfigurationResolver.java:112)
	at org.apache.geronimo.kernel.config.Configuration.buildClassPath(Configuration.java:397)
	at org.apache.geronimo.kernel.config.Configuration.createConfigurationClasssLoader(Configuration.java:322)
	at org.apache.geronimo.kernel.config.Configuration.<init>(Configuration.java:267)
	at org.apache.geronimo.kernel.config.SimpleConfigurationManager.load(SimpleConfigurationManager.java:321)
	... 81 more
07:12:03,272 ERROR [PlanProcessor] java.lang.reflect.InvocationTargetException: null
java.lang.reflect.InvocationTargetException
	at sun.reflect.NativeMethodAccessorImpl.invoke0(Native Method)
	at sun.reflect.NativeMethodAccessorImpl.invoke(NativeMethodAccessorImpl.java:39)
	at sun.reflect.DelegatingMethodAccessorImpl.invoke(DelegatingMethodAccessorImpl.java:25)
	at java.lang.reflect.Method.invoke(Method.java:324)
	at org.apache.geronimo.plugin.packaging.PackageBuilderShell.execute(PackageBuilderShell.java:291)
	at sun.reflect.NativeMethodAccessorImpl.invoke0(Native Method)
	at sun.reflect.NativeMethodAccessorImpl.invoke(NativeMethodAccessorImpl.java:39)
	at sun.reflect.DelegatingMethodAccessorImpl.invoke(DelegatingMethodAccessorImpl.java:25)
	at java.lang.reflect.Method.invoke(Method.java:324)
	at org.apache.commons.jelly.impl.DynamicBeanTag.doTag(DynamicBeanTag.java:180)
	at org.apache.commons.jelly.impl.StaticTagScript.run(StaticTagScript.java:102)
	at org.apache.commons.jelly.impl.ScriptBlock.run(ScriptBlock.java:95)
	at org.apache.maven.jelly.tags.werkz.MavenGoalTag.runBodyTag(MavenGoalTag.java:78)
	at org.apache.maven.jelly.tags.werkz.MavenGoalTag$MavenGoalAction.performAction(MavenGoalTag.java:109)
	at org.apache.maven.werkz.Goal.fire(Goal.java:656)
	at org.apache.maven.werkz.Goal.attain(Goal.java:592)
	at org.apache.maven.werkz.Goal.attainPrecursors(Goal.java:505)
	at org.apache.maven.werkz.Goal.attain(Goal.java:590)
	at org.apache.maven.werkz.WerkzProject.attainGoal(WerkzProject.java:210)
	at org.apache.maven.jelly.tags.werkz.MavenAttainGoalTag.doTag(MavenAttainGoalTag.java:114)
	at org.apache.commons.jelly.impl.TagScript.run(TagScript.java:247)
	at org.apache.commons.jelly.impl.ScriptBlock.run(ScriptBlock.java:95)
	at org.apache.maven.jelly.tags.werkz.MavenGoalTag.runBodyTag(MavenGoalTag.java:78)
	at org.apache.maven.jelly.tags.werkz.MavenGoalTag$MavenGoalAction.performAction(MavenGoalTag.java:109)
	at org.apache.maven.werkz.Goal.fire(Goal.java:656)
	at org.apache.maven.werkz.Goal.attain(Goal.java:592)
	at org.apache.maven.plugin.PluginManager.attainGoals(PluginManager.java:693)
	at org.apache.maven.MavenSession.attainGoals(MavenSession.java:263)
	at org.apache.maven.jelly.tags.maven.ReactorTag.doTag(ReactorTag.java:368)
	at org.apache.commons.jelly.impl.TagScript.run(TagScript.java:247)
	at org.apache.commons.jelly.impl.ScriptBlock.run(ScriptBlock.java:95)
	at org.apache.maven.jelly.tags.werkz.MavenGoalTag.runBodyTag(MavenGoalTag.java:78)
	at org.apache.maven.jelly.tags.werkz.MavenGoalTag$MavenGoalAction.performAction(MavenGoalTag.java:109)
	at org.apache.maven.werkz.Goal.fire(Goal.java:656)
	at org.apache.maven.werkz.Goal.attain(Goal.java:592)
	at org.apache.maven.werkz.WerkzProject.attainGoal(WerkzProject.java:210)
	at org.apache.maven.jelly.tags.werkz.MavenAttainGoalTag.doTag(MavenAttainGoalTag.java:114)
	at org.apache.commons.jelly.impl.TagScript.run(TagScript.java:247)
	at org.apache.commons.jelly.impl.ScriptBlock.run(ScriptBlock.java:95)
	at org.apache.maven.jelly.tags.werkz.MavenGoalTag.runBodyTag(MavenGoalTag.java:78)
	at org.apache.maven.jelly.tags.werkz.MavenGoalTag$MavenGoalAction.performAction(MavenGoalTag.java:109)
	at org.apache.maven.werkz.Goal.fire(Goal.java:656)
	at org.apache.maven.werkz.Goal.attain(Goal.java:592)
	at org.apache.maven.plugin.PluginManager.attainGoals(PluginManager.java:693)
	at org.apache.maven.MavenSession.attainGoals(MavenSession.java:263)
	at org.apache.maven.cli.App.doMain(App.java:511)
	at org.apache.maven.cli.App.main(App.java:1258)
	at sun.reflect.NativeMethodAccessorImpl.invoke0(Native Method)
	at sun.reflect.NativeMethodAccessorImpl.invoke(NativeMethodAccessorImpl.java:39)
	at sun.reflect.DelegatingMethodAccessorImpl.invoke(DelegatingMethodAccessorImpl.java:25)
	at java.lang.reflect.Method.invoke(Method.java:324)
	at com.werken.forehead.Forehead.run(Forehead.java:551)
	at com.werken.forehead.Forehead.main(Forehead.java:581)
Caused by: org.apache.geronimo.common.DeploymentException: Unable to create configuration for deployment
	at org.apache.geronimo.deployment.DeploymentContext.createTempConfiguration(DeploymentContext.java:116)
	at org.apache.geronimo.deployment.DeploymentContext.<init>(DeploymentContext.java:96)
	at org.apache.geronimo.deployment.DeploymentContext.<init>(DeploymentContext.java:78)
	at org.apache.geronimo.deployment.service.ServiceConfigBuilder.buildConfiguration(ServiceConfigBuilder.java:235)
	at org.apache.geronimo.deployment.service.ServiceConfigBuilder.buildConfiguration(ServiceConfigBuilder.java:211)
	at org.apache.geronimo.deployment.service.ServiceConfigBuilder$$FastClassByCGLIB$$9f173be6.invoke(<generated>)
	at net.sf.cglib.reflect.FastMethod.invoke(FastMethod.java:53)
	at org.apache.geronimo.gbean.runtime.FastMethodInvoker.invoke(FastMethodInvoker.java:38)
	at org.apache.geronimo.gbean.runtime.GBeanOperation.invoke(GBeanOperation.java:122)
	at org.apache.geronimo.gbean.runtime.GBeanInstance.invoke(GBeanInstance.java:817)
	at org.apache.geronimo.gbean.runtime.RawInvoker.invoke(RawInvoker.java:57)
	at org.apache.geronimo.kernel.basic.RawOperationInvoker.invoke(RawOperationInvoker.java:35)
	at org.apache.geronimo.kernel.basic.ProxyMethodInterceptor.intercept(ProxyMethodInterceptor.java:96)
	at org.apache.geronimo.deployment.ConfigurationBuilder$$EnhancerByCGLIB$$a63bb92a.buildConfiguration(<generated>)
	at org.apache.geronimo.deployment.Deployer.deploy(Deployer.java:299)
	at org.apache.geronimo.deployment.Deployer$$FastClassByCGLIB$$734a235d.invoke(<generated>)
	at net.sf.cglib.reflect.FastMethod.invoke(FastMethod.java:53)
	at org.apache.geronimo.gbean.runtime.FastMethodInvoker.invoke(FastMethodInvoker.java:38)
	at org.apache.geronimo.gbean.runtime.GBeanOperation.invoke(GBeanOperation.java:122)
	at org.apache.geronimo.gbean.runtime.GBeanInstance.invoke(GBeanInstance.java:852)
	at org.apache.geronimo.kernel.basic.BasicKernel.invoke(BasicKernel.java:239)
	at org.apache.geronimo.plugin.packaging.PackageBuilder.invokeDeployer(PackageBuilder.java:472)
	at org.apache.geronimo.plugin.packaging.PackageBuilder.execute(PackageBuilder.java:332)
	... 53 more
Caused by: org.apache.geronimo.kernel.config.LifecycleException: load of geronimo/client/1.1-SNAPSHOT/car failed
	at org.apache.geronimo.kernel.config.SimpleConfigurationManager.loadConfiguration(SimpleConfigurationManager.java:300)
	at org.apache.geronimo.deployment.DeploymentConfigurationManager.loadConfiguration(DeploymentConfigurationManager.java:115)
	at org.apache.geronimo.kernel.config.SimpleConfigurationManager.loadConfiguration(SimpleConfigurationManager.java:259)
	at org.apache.geronimo.deployment.DeploymentConfigurationManager.loadConfiguration(DeploymentConfigurationManager.java:111)
	at org.apache.geronimo.deployment.DeploymentContext.createTempConfiguration(DeploymentContext.java:113)
	... 75 more
Caused by: org.apache.geronimo.kernel.config.InvalidConfigException: Error starting configuration gbean geronimo/client/1.1-SNAPSHOT/car
	at org.apache.geronimo.kernel.config.SimpleConfigurationManager.load(SimpleConfigurationManager.java:325)
	at org.apache.geronimo.deployment.DeploymentConfigurationManager.load(DeploymentConfigurationManager.java:119)
	at org.apache.geronimo.kernel.config.SimpleConfigurationManager.loadConfiguration(SimpleConfigurationManager.java:285)
	... 79 more
Caused by: org.apache.geronimo.kernel.repository.MissingDependencyException: Unable to resolve dependency org.apache.geronimo.specs/geronimo-javamail_1.3.1_spec/1.0/jar
	at org.apache.geronimo.kernel.config.ConfigurationResolver.resolve(ConfigurationResolver.java:112)
	at org.apache.geronimo.kernel.config.Configuration.buildClassPath(Configuration.java:397)
	at org.apache.geronimo.kernel.config.Configuration.createConfigurationClasssLoader(Configuration.java:322)
	at org.apache.geronimo.kernel.config.Configuration.<init>(Configuration.java:267)
	at org.apache.geronimo.kernel.config.SimpleConfigurationManager.load(SimpleConfigurationManager.java:321)
	... 81 more

BUILD FAILED
File...... /home/continuum/continuum-1.0.2/apps/continuum/work/68/maven.xml
Element... maven:reactor
Line...... 58
Column.... -1
Unable to obtain goal [multiproject:install-callback] -- /home/continuum/.geronimo-1.1-maven/cache/geronimo-packaging-plugin-1.1.0-9/plugin.jelly:72:-1: <car:package> null
Total time   : 24 minutes 47 seconds 
07:12:03,598 INFO  [App] Total time   : 24 minutes 47 seconds 
Finished at  : Tuesday, May 16, 2006 7:12:03 AM PDT
07:12:03,598 INFO  [App] Finished at  : Tuesday, May 16, 2006 7:12:03 AM PDT

07:12:03,598 INFO  [App] 

****************************************************************************



Mime
View raw message