geronimo-scm mailing list archives

Site index · List index
Message view « Date » · « Thread »
Top « Date » · « Thread »
From continuum <contin...@stan.gbuild.org>
Subject [continuum] BUILD FAILURE: Geronimo
Date Mon, 29 May 2006 16:46:15 GMT
Online report : http://ci.gbuild.org/continuum/servlet/continuum/target/ProjectBuild.vm/view/ProjectBuild/id/1/buildId/3633
Build statistics:
  State: Failed
  Previous State: Failed
  Started at: Mon, 29 May 2006 09:41:24 -0700
  Finished at: Mon, 29 May 2006 09:46:13 -0700
  Total time: 4m 49s
  Build Trigger: Forced
  Exit code: 70
  Building machine hostname: stan.gbuild.org
  Operating system : Linux(unknown)
  Java version : 1.4.2_08(Sun Microsystems Inc.)

Changes
      No files changed
  
****************************************************************************
Output:
****************************************************************************
 __  __
|  \/  |__ _Apache__ ___
| |\/| / _` \ V / -_) ' \  ~ intelligent projects ~
|_|  |_\__,_|\_/\___|_||_|  v. 1.1-beta-2

DEPRECATED: the default goal should be specified in the <build> section of project.xml
instead of maven.xml
DEPRECATED: the default goal should be specified in the <build> section of project.xml
instead of maven.xml
build:start:

clean:clean:
modules:clean:
modules:reactor:init:

    [echo] +----------------------------------------
    [echo] | Cleaning: applications/console-core 
    [echo] +----------------------------------------
    [echo] 
    [echo] +----------------------------------------
    [echo] | Cleaning: applications/console-ear 
    [echo] +----------------------------------------
    [echo] 
    [echo] +----------------------------------------
    [echo] | Cleaning: applications/console-framework 
    [echo] +----------------------------------------
    [echo] 
    [echo] +----------------------------------------
    [echo] | Cleaning: applications/console-standard 
    [echo] +----------------------------------------
    [echo] 
    [echo] +----------------------------------------
    [echo] | Cleaning: applications/demo 
    [echo] +----------------------------------------
    [echo] 
    [echo] +----------------------------------------
    [echo] | Cleaning: applications/ldap-realm-demo 
    [echo] +----------------------------------------
    [echo] 
    [echo] +----------------------------------------
    [echo] | Cleaning: applications/magicGball 
    [echo] +----------------------------------------
    [echo] 
    [echo] +----------------------------------------
    [echo] | Cleaning: applications/remote-deploy-lib 
    [echo] +----------------------------------------
    [echo] 
    [echo] +----------------------------------------
    [echo] | Cleaning: applications/remote-deploy 
    [echo] +----------------------------------------
    [echo] 
    [echo] +----------------------------------------
    [echo] | Cleaning: applications/uddi-db 
    [echo] +----------------------------------------
    [echo] 
    [echo] +----------------------------------------
    [echo] | Cleaning: applications/uddi-server 
    [echo] +----------------------------------------
    [echo] 
    [echo] +----------------------------------------
    [echo] | Cleaning: applications/welcome 
    [echo] +----------------------------------------
    [echo] 
    [echo] +----------------------------------------
    [echo] | Cleaning: modules/activation 
    [echo] +----------------------------------------
    [echo] 
    [echo] +----------------------------------------
    [echo] | Cleaning: modules/activemq-embedded-rar 
    [echo] +----------------------------------------
    [echo] 
    [echo] +----------------------------------------
    [echo] | Cleaning: modules/axis-builder 
    [echo] +----------------------------------------
    [echo] 
    [echo] +----------------------------------------
    [echo] | Cleaning: modules/axis 
    [echo] +----------------------------------------
    [echo] 
    [echo] +----------------------------------------
    [echo] | Cleaning: modules/client-builder 
    [echo] +----------------------------------------
    [echo] 
    [echo] +----------------------------------------
    [echo] | Cleaning: modules/client 
    [echo] +----------------------------------------
    [echo] 
    [echo] +----------------------------------------
    [echo] | Cleaning: modules/common 
    [echo] +----------------------------------------
    [echo] 
    [echo] +----------------------------------------
    [echo] | Cleaning: modules/connector-builder 
    [echo] +----------------------------------------
    [echo] 
    [echo] +----------------------------------------
    [echo] | Cleaning: modules/connector 
    [echo] +----------------------------------------
    [echo] 
    [echo] +----------------------------------------
    [echo] | Cleaning: modules/console-web 
    [echo] +----------------------------------------
    [echo] 
    [echo] +----------------------------------------
    [echo] | Cleaning: modules/converter 
    [echo] +----------------------------------------
    [echo] 
    [echo] +----------------------------------------
    [echo] | Cleaning: modules/core 
    [echo] +----------------------------------------
    [echo] 
    [echo] +----------------------------------------
    [echo] | Cleaning: modules/deploy-config 
    [echo] +----------------------------------------
    [echo] 
    [echo] +----------------------------------------
    [echo] | Cleaning: modules/deploy-jsr88 
    [echo] +----------------------------------------
    [echo] 
    [echo] +----------------------------------------
    [echo] | Cleaning: modules/deploy-tool 
    [echo] +----------------------------------------
    [echo] 
    [echo] +----------------------------------------
    [echo] | Cleaning: modules/deployment 
    [echo] +----------------------------------------
    [echo] 
    [echo] +----------------------------------------
    [echo] | Cleaning: modules/derby 
    [echo] +----------------------------------------
    [echo] 
    [echo] +----------------------------------------
    [echo] | Cleaning: modules/directory 
    [echo] +----------------------------------------
    [echo] 
    [echo] +----------------------------------------
    [echo] | Cleaning: modules/hot-deploy 
    [echo] +----------------------------------------
    [echo] 
    [echo] +----------------------------------------
    [echo] | Cleaning: modules/installer-processing 
    [echo] +----------------------------------------
    [echo] 
    [echo] +----------------------------------------
    [echo] | Cleaning: modules/installer-support 
    [echo] +----------------------------------------
    [echo] 
    [echo] +----------------------------------------
    [echo] | Cleaning: modules/j2ee-builder 
    [echo] +----------------------------------------
    [echo] 
    [echo] +----------------------------------------
    [echo] | Cleaning: modules/j2ee-schema 
    [echo] +----------------------------------------
    [echo] 
    [echo] +----------------------------------------
    [echo] | Cleaning: modules/j2ee 
    [echo] +----------------------------------------
    [echo] 
    [echo] +----------------------------------------
    [echo] | Cleaning: modules/javamail-transport 
    [echo] +----------------------------------------
    [echo] 
    [echo] +----------------------------------------
    [echo] | Cleaning: modules/jetty-builder 
    [echo] +----------------------------------------
    [echo] 
    [echo] +----------------------------------------
    [echo] | Cleaning: modules/jetty 
    [echo] +----------------------------------------
    [echo] 
    [echo] +----------------------------------------
    [echo] | Cleaning: modules/jmx-remoting 
    [echo] +----------------------------------------
    [echo] 
    [echo] +----------------------------------------
    [echo] | Cleaning: modules/kernel 
    [echo] +----------------------------------------
    [echo] 
    [echo] +----------------------------------------
    [echo] | Cleaning: modules/mail 
    [echo] +----------------------------------------
    [echo] 
    [echo] +----------------------------------------
    [echo] | Cleaning: modules/management 
    [echo] +----------------------------------------
    [echo] 
    [echo] +----------------------------------------
    [echo] | Cleaning: modules/naming-builder 
    [echo] +----------------------------------------
    [echo] 
    [echo] +----------------------------------------
    [echo] | Cleaning: modules/naming 
    [echo] +----------------------------------------
    [echo] 
    [echo] +----------------------------------------
    [echo] | Cleaning: modules/scripts 
    [echo] +----------------------------------------
    [echo] 
    [echo] +----------------------------------------
    [echo] | Cleaning: modules/security-builder 
    [echo] +----------------------------------------
    [echo] 
    [echo] +----------------------------------------
    [echo] | Cleaning: modules/security 
    [echo] +----------------------------------------
    [echo] 
    [echo] +----------------------------------------
    [echo] | Cleaning: modules/service-builder 
    [echo] +----------------------------------------
    [echo] 
    [echo] +----------------------------------------
    [echo] | Cleaning: modules/system 
    [echo] +----------------------------------------
    [echo] 
    [echo] +----------------------------------------
    [echo] | Cleaning: modules/test-ddbean 
    [echo] +----------------------------------------
    [echo] 
    [echo] +----------------------------------------
    [echo] | Cleaning: modules/timer 
    [echo] +----------------------------------------
    [echo] 
    [echo] +----------------------------------------
    [echo] | Cleaning: modules/tomcat-builder 
    [echo] +----------------------------------------
    [echo] 
    [echo] +----------------------------------------
    [echo] | Cleaning: modules/tomcat 
    [echo] +----------------------------------------
    [echo] 
    [echo] +----------------------------------------
    [echo] | Cleaning: modules/transaction 
    [echo] +----------------------------------------
    [echo] 
    [echo] +----------------------------------------
    [echo] | Cleaning: modules/upgrade 
    [echo] +----------------------------------------
    [echo] 
    [echo] +----------------------------------------
    [echo] | Cleaning: modules/util 
    [echo] +----------------------------------------
    [echo] 
    [echo] +----------------------------------------
    [echo] | Cleaning: modules/web-builder 
    [echo] +----------------------------------------
    [echo] 
    [echo] +----------------------------------------
    [echo] | Cleaning: modules/webservices 
    [echo] +----------------------------------------
    [echo] 
    [echo] +----------------------------------------
    [echo] | Cleaning: plugins/geronimo-assembly-plugin 
    [echo] +----------------------------------------
    [echo] 
    [echo] +----------------------------------------
    [echo] | Cleaning: plugins/geronimo-dependency-plugin 
    [echo] +----------------------------------------
    [echo] 
    [echo] +----------------------------------------
    [echo] | Cleaning: plugins/geronimo-deployment-plugin 
    [echo] +----------------------------------------
    [echo] 
    [echo] +----------------------------------------
    [echo] | Cleaning: plugins/geronimo-izpack-plugin 
    [echo] +----------------------------------------
    [echo] 
    [echo] +----------------------------------------
    [echo] | Cleaning: plugins/geronimo-packaging-plugin 
    [echo] +----------------------------------------
    [echo] 
    [echo] +----------------------------------------
    [echo] | Cleaning: target/geronimo-1.2-SNAPSHOT 
    [echo] +----------------------------------------

xdoc:clean:

Starting the reactor...
Our processing order:
Geronimo :: Activation
Geronimo :: ActiveMQ Embedded RAR
Geronimo :: Kernel
Geronimo :: Common
Geronimo :: Util
Geronimo :: System
Geronimo :: Deployment
Geronimo :: Deploy :: Common Config
Geronimo :: Management API
Geronimo :: Core
Geronimo :: J2EE
Geronimo :: J2EE Schema
Geronimo :: Service :: Builder
Geronimo :: Maven Dependency Plugin
Geronimo :: Naming
Geronimo :: Security
Geronimo :: Web Services
Geronimo :: Axis
Geronimo :: Test :: DDBeans
Geronimo :: Transaction
Geronimo :: Connector
Geronimo :: Security :: Builder
Geronimo :: J2EE
Geronimo :: Naming :: Builder
Geronimo :: Connector :: Builder
Geronimo :: Axis :: Builder
Geronimo :: Client
Geronimo :: Client Builder
Geronimo :: Console Web
Geronimo :: Configuration Converter
Geronimo :: Web :: Builder
Geronimo :: Deploy :: JSR-88
Geronimo :: Deploy :: CLI Tool
Geronimo :: Derby
Geronimo :: Directory
Geronimo :: Deploy :: Hot Deployer
Geronimo :: Installer Processing
Geronimo :: Installer Support
Geronimo :: JavaMail Transport
Geronimo :: Jetty
Geronimo :: Jetty :: Builder
Geronimo :: JMX Remoting
Geronimo :: Mail
Geronimo :: Scripts
Geronimo :: Timer
Geronimo :: Tomcat
Geronimo :: Tomcat :: Builder
Geronimo :: Upgrade
Geronimo :: Maven Assembly Plugin
Geronimo :: Maven Deployment Plugin
Geronimo :: IZPack Installer Build Plugin
Geronimo :: Maven Packaging Plugin
+----------------------------------------
| geronimo and geronimo-plugins Geronimo :: Activation
| Memory: 8M/11M
+----------------------------------------
DEPRECATED: the default goal should be specified in the <build> section of project.xml
instead of maven.xml

clean:

new1:
Attempting to download geronimo-javamail_1.3.1_spec-1.1-SNAPSHOT.jar.
build:start:

multiproject:install-callback:
    [echo] Running jar:install for Geronimo :: Activation
Attempting to download geronimo-common-1.1-SNAPSHOT.jar.
Attempting to download geronimo-kernel-1.1-SNAPSHOT.jar.
Attempting to download geronimo-deployment-1.1-SNAPSHOT.jar.
Attempting to download geronimo-deploy-jsr88-1.1-SNAPSHOT.jar.
Attempting to download geronimo-system-1.1-SNAPSHOT.jar.
Error retrieving artifact from [http://people.apache.org/~djencks/maven]: org.apache.maven.wagon.TransferFailedException:
Connection timed out
java:prepare-filesystem:
    [mkdir] Created dir: /home/continuum/continuum-1.0.2/apps/continuum/work/1/modules/activation/target/classes

java:compile:
<depend closure="false" srcdir="1.4" dump="false" destdir="/home/continuum/continuum-1.0.2/apps/continuum/work/1/modules/activation/target/classes"></depend>
   [echo] Compiling to /home/continuum/continuum-1.0.2/apps/continuum/work/1/modules/activation/target/classes
    [javac] Compiling 8 source files to /home/continuum/continuum-1.0.2/apps/continuum/work/1/modules/activation/target/classes

java:jar-resources:
Copying 1 file to /home/continuum/continuum-1.0.2/apps/continuum/work/1/modules/activation/target/classes

test:prepare-filesystem:
    [mkdir] Created dir: /home/continuum/continuum-1.0.2/apps/continuum/work/1/modules/activation/target/test-classes
    [mkdir] Created dir: /home/continuum/continuum-1.0.2/apps/continuum/work/1/modules/activation/target/test-reports

test:test-resources:

test:compile:
    [javac] Compiling 5 source files to /home/continuum/continuum-1.0.2/apps/continuum/work/1/modules/activation/target/test-classes

test:test:
    [junit] Running org.apache.geronimo.activation.handlers.MailcapTest
    [junit] Tests run: 1, Failures: 0, Errors: 0, Time elapsed: 0.548 sec
    [junit] Running org.apache.geronimo.activation.handlers.TextHtmlTest
    [junit] Tests run: 3, Failures: 0, Errors: 0, Time elapsed: 0.029 sec
    [junit] Running org.apache.geronimo.activation.handlers.TextPlainTest
    [junit] Tests run: 3, Failures: 0, Errors: 0, Time elapsed: 0.025 sec
    [junit] Running org.apache.geronimo.activation.handlers.TextXmlTest
    [junit] Tests run: 3, Failures: 0, Errors: 0, Time elapsed: 0.013 sec
Running post goal: test:test
    [touch] Creating /home/continuum/continuum-1.0.2/apps/continuum/work/1/modules/activation/target/test-reports/tstamp

jar:jar:
    [jar] Building jar: /home/continuum/continuum-1.0.2/apps/continuum/work/1/modules/activation/target/geronimo-activation-1.2-SNAPSHOT.jar

jar:install:
    [echo] Installing...
Uploading to geronimo/jars/geronimo-activation-1.2-SNAPSHOT.jar: 
.................... (13K)
Uploading to geronimo/poms/geronimo-activation-1.2-SNAPSHOT.pom: 
.................... (10K)

+----------------------------------------
| geronimo and geronimo-plugins Geronimo :: ActiveMQ Embedded RAR
| Memory: 10M/15M
+----------------------------------------
DEPRECATED: the default goal should be specified in the <build> section of project.xml
instead of maven.xml
DEPRECATED: the default goal should be specified in the <build> section of project.xml
instead of maven.xml

build:end:

Attempting to download activemq-core-3.2.4-SNAPSHOT.jar.
2/967K
4/967K
5/967K
7/967K
8/967K
9/967K
11/967K
12/967K
14/967K
15/967K
16/967K
18/967K
22/967K
26/967K
30/967K
34/967K
36/967K
40/967K
42/967K
43/967K
45/967K
46/967K
48/967K
49/967K
50/967K
52/967K
53/967K
55/967K
56/967K
57/967K
59/967K
60/967K
62/967K
63/967K
65/967K
66/967K
67/967K
69/967K
70/967K
72/967K
73/967K
74/967K
76/967K
77/967K
79/967K
80/967K
82/967K
83/967K
84/967K
86/967K
87/967K
89/967K
90/967K
91/967K
93/967K
94/967K
96/967K
100/967K
104/967K
108/967K
112/967K
113/967K
114/967K
115/967K
119/967K
123/967K
124/967K
125/967K
127/967K
128/967K
130/967K
131/967K
132/967K
134/967K
135/967K
137/967K
138/967K
139/967K
141/967K
142/967K
144/967K
145/967K
147/967K
148/967K
149/967K
151/967K
152/967K
154/967K
155/967K
156/967K
158/967K
159/967K
161/967K
162/967K
164/967K
165/967K
166/967K
168/967K
169/967K
171/967K
172/967K
173/967K
175/967K
176/967K
178/967K
179/967K
181/967K
182/967K
183/967K
185/967K
186/967K
188/967K
189/967K
190/967K
192/967K
193/967K
195/967K
196/967K
197/967K
199/967K
200/967K
202/967K
203/967K
205/967K
206/967K
207/967K
209/967K
210/967K
212/967K
213/967K
214/967K
216/967K
217/967K
219/967K
220/967K
222/967K
226/967K
229/967K
230/967K
231/967K
233/967K
234/967K
236/967K
237/967K
238/967K
240/967K
241/967K
243/967K
247/967K
251/967K
255/967K
259/967K
261/967K
263/967K
264/967K
265/967K
267/967K
268/967K
270/967K
271/967K
272/967K
274/967K
275/967K
277/967K
278/967K
279/967K
281/967K
282/967K
284/967K
285/967K
287/967K
288/967K
289/967K
291/967K
292/967K
294/967K
295/967K
296/967K
298/967K
299/967K
301/967K
302/967K
304/967K
305/967K
306/967K
308/967K
309/967K
311/967K
312/967K
313/967K
315/967K
316/967K
318/967K
319/967K
320/967K
322/967K
323/967K
325/967K
326/967K
328/967K
329/967K
330/967K
332/967K
333/967K
335/967K
336/967K
337/967K
339/967K
340/967K
344/967K
348/967K
352/967K
356/967K
360/967K
364/967K
364/967K
366/967K
367/967K
369/967K
370/967K
371/967K
373/967K
374/967K
376/967K
377/967K
378/967K
380/967K
381/967K
383/967K
384/967K
386/967K
387/967K
388/967K
390/967K
391/967K
393/967K
394/967K
395/967K
397/967K
398/967K
400/967K
401/967K
403/967K
404/967K
405/967K
407/967K
408/967K
410/967K
411/967K
412/967K
414/967K
415/967K
417/967K
418/967K
419/967K
421/967K
422/967K
424/967K
425/967K
427/967K
428/967K
429/967K
431/967K
432/967K
434/967K
435/967K
436/967K
438/967K
439/967K
441/967K
442/967K
444/967K
445/967K
446/967K
448/967K
449/967K
451/967K
452/967K
453/967K
455/967K
456/967K
458/967K
459/967K
460/967K
462/967K
463/967K
465/967K
466/967K
468/967K
469/967K
470/967K
472/967K
473/967K
475/967K
476/967K
477/967K
479/967K
480/967K
482/967K
483/967K
485/967K
486/967K
487/967K
489/967K
490/967K
492/967K
493/967K
494/967K
496/967K
497/967K
499/967K
500/967K
501/967K
503/967K
504/967K
506/967K
507/967K
509/967K
510/967K
511/967K
513/967K
514/967K
516/967K
517/967K
518/967K
520/967K
521/967K
523/967K
524/967K
526/967K
527/967K
528/967K
530/967K
531/967K
533/967K
534/967K
535/967K
537/967K
538/967K
540/967K
541/967K
543/967K
544/967K
545/967K
547/967K
548/967K
550/967K
551/967K
552/967K
554/967K
555/967K
557/967K
558/967K
559/967K
561/967K
562/967K
564/967K
565/967K
567/967K
568/967K
569/967K
571/967K
572/967K
574/967K
575/967K
576/967K
578/967K
579/967K
581/967K
582/967K
584/967K
585/967K
586/967K
588/967K
589/967K
591/967K
592/967K
593/967K
595/967K
596/967K
598/967K
599/967K
600/967K
602/967K
603/967K
605/967K
606/967K
610/967K
614/967K
618/967K
622/967K
626/967K
627/967K
629/967K
630/967K
632/967K
633/967K
634/967K
636/967K
637/967K
641/967K
645/967K
649/967K
650/967K
651/967K
653/967K
654/967K
656/967K
657/967K
658/967K
660/967K
661/967K
663/967K
664/967K
666/967K
667/967K
668/967K
670/967K
671/967K
673/967K
674/967K
675/967K
677/967K
678/967K
680/967K
681/967K
682/967K
684/967K
685/967K
687/967K
688/967K
690/967K
691/967K
692/967K
694/967K
695/967K
697/967K
698/967K
699/967K
701/967K
702/967K
704/967K
705/967K
707/967K
708/967K
709/967K
711/967K
712/967K
714/967K
715/967K
716/967K
718/967K
719/967K
721/967K
722/967K
724/967K
725/967K
726/967K
728/967K
729/967K
731/967K
732/967K
733/967K
735/967K
736/967K
738/967K
739/967K
740/967K
742/967K
743/967K
745/967K
746/967K
748/967K
749/967K
750/967K
752/967K
753/967K
755/967K
756/967K
757/967K
759/967K
763/967K
766/967K
770/967K
774/967K
778/967K
779/967K
780/967K
781/967K
783/967K
784/967K
786/967K
787/967K
789/967K
790/967K
791/967K
793/967K
794/967K
796/967K
797/967K
798/967K
800/967K
801/967K
803/967K
804/967K
806/967K
807/967K
808/967K
810/967K
811/967K
813/967K
814/967K
815/967K
817/967K
818/967K
820/967K
821/967K
822/967K
824/967K
825/967K
827/967K
828/967K
830/967K
831/967K
832/967K
836/967K
840/967K
842/967K
846/967K
850/967K
851/967K
852/967K
854/967K
855/967K
856/967K
858/967K
859/967K
861/967K
862/967K
863/967K
865/967K
866/967K
868/967K
869/967K
871/967K
872/967K
873/967K
875/967K
876/967K
878/967K
879/967K
880/967K
882/967K
883/967K
885/967K
886/967K
888/967K
889/967K
890/967K
892/967K
893/967K
895/967K
896/967K
897/967K
899/967K
900/967K
902/967K
903/967K
905/967K
906/967K
907/967K
909/967K
910/967K
912/967K
913/967K
914/967K
916/967K
917/967K
919/967K
920/967K
921/967K
923/967K
924/967K
926/967K
927/967K
929/967K
930/967K
931/967K
933/967K
934/967K
936/967K
937/967K
938/967K
940/967K
941/967K
943/967K
944/967K
946/967K
947/967K
948/967K
950/967K
951/967K
953/967K
954/967K
955/967K
957/967K
958/967K
960/967K
961/967K
962/967K
964/967K
965/967K
967/967K
967K downloaded
Attempting to download activemq-ra-3.2.4-SNAPSHOT.jar.
1/69K
2/69K
4/69K
5/69K
7/69K
8/69K
9/69K
11/69K
12/69K
14/69K
15/69K
16/69K
18/69K
19/69K
21/69K
22/69K
24/69K
25/69K
29/69K
33/69K
36/69K
38/69K
42/69K
46/69K
48/69K
49/69K
53/69K
56/69K
57/69K
59/69K
60/69K
62/69K
63/69K
65/69K
66/69K
67/69K
69/69K
69K downloaded
build:start:

multiproject:install-callback:
    [echo] Running rar:install for Geronimo :: ActiveMQ Embedded RAR
rar:init:
    [mkdir] Created dir: /home/continuum/continuum-1.0.2/apps/continuum/work/1/modules/activemq-embedded-rar/target

rar:rar:
    [echo] Building rar ge-activemq-rar-1.2-SNAPSHOT with ra.xml "/home/continuum/continuum-1.0.2/apps/continuum/work/1/modules/activemq-embedded-rar/src/rar/META-INF/ra.xml"
    [echo] trying to include /home/continuum/continuum-1.0.2/apps/continuum/work/1/modules/activemq-embedded-rar/target/ge-activemq-rar-1.2-SNAPSHOT.jar
    [echo] Bundling: jar - activemq:activemq-core
    [echo] Bundling: jar - activemq:activemq-ra
    [mkdir] Created dir: /home/continuum/continuum-1.0.2/apps/continuum/work/1/modules/activemq-embedded-rar/target/rar
    [jar] Building jar: /home/continuum/continuum-1.0.2/apps/continuum/work/1/modules/activemq-embedded-rar/target/ge-activemq-rar-1.2-SNAPSHOT.rar

rar:install:
    [echo] Installing...
Uploading to geronimo/rars/ge-activemq-rar-1.2-SNAPSHOT.rar: 
.................... (949K)
Uploading to geronimo/poms/ge-activemq-rar-1.2-SNAPSHOT.pom: 
.................... (11K)

+----------------------------------------
| geronimo and geronimo-plugins Geronimo :: Kernel
| Memory: 9M/15M
+----------------------------------------
DEPRECATED: the default goal should be specified in the <build> section of project.xml
instead of maven.xml
DEPRECATED: the default goal should be specified in the <build> section of project.xml
instead of maven.xml

build:end:

build:start:

multiproject:install-callback:
    [echo] Running jar:install for Geronimo :: Kernel
Tag library requested that is not present: 'xmlbeans2:maven' in plugin: 'null'
java:prepare-filesystem:
    [mkdir] Created dir: /home/continuum/continuum-1.0.2/apps/continuum/work/1/modules/kernel/target/classes

java:compile:
<depend closure="false" srcdir="1.4" dump="false" destdir="/home/continuum/continuum-1.0.2/apps/continuum/work/1/modules/kernel/target/classes"></depend>
   [echo] Compiling to /home/continuum/continuum-1.0.2/apps/continuum/work/1/modules/kernel/target/classes
    [javac] Compiling 175 source files to /home/continuum/continuum-1.0.2/apps/continuum/work/1/modules/kernel/target/classes
    [javac] Note: Some input files use or override a deprecated API.
    [javac] Note: Recompile with -deprecation for details.

java:jar-resources:

test:prepare-filesystem:
    [mkdir] Created dir: /home/continuum/continuum-1.0.2/apps/continuum/work/1/modules/kernel/target/test-classes
    [mkdir] Created dir: /home/continuum/continuum-1.0.2/apps/continuum/work/1/modules/kernel/target/test-reports

test:test-resources:
Copying 2 files to /home/continuum/continuum-1.0.2/apps/continuum/work/1/modules/kernel/target/test-classes

test:compile:
    [javac] Compiling 28 source files to /home/continuum/continuum-1.0.2/apps/continuum/work/1/modules/kernel/target/test-classes

test:test:
    [junit] Running org.apache.geronimo.kernel.repository.ArtifactResolverTest
    [junit] Tests run: 4, Failures: 0, Errors: 0, Time elapsed: 0.37 sec
    [junit] Tests run: 9, Failures: 0, Errors: 0, Time elapsed: 0.027 sec
    [junit] Tests run: 4, Failures: 0, Errors: 0, Time elapsed: 0.488 sec
    [junit] Tests run: 1, Failures: 0, Errors: 0, Time elapsed: 0.059 sec
    [junit] Tests run: 1, Failures: 0, Errors: 0, Time elapsed: 0.047 sec
    [junit] Tests run: 10, Failures: 0, Errors: 0, Time elapsed: 0.012 sec
    [junit] Tests run: 3, Failures: 0, Errors: 0, Time elapsed: 1.128 sec
    [junit] Tests run: 18, Failures: 0, Errors: 0, Time elapsed: 0.92 sec
    [junit] Tests run: 1, Failures: 0, Errors: 0, Time elapsed: 0.111 sec
    [junit] Tests run: 7, Failures: 0, Errors: 0, Time elapsed: 1.062 sec
    [junit] Tests run: 7, Failures: 0, Errors: 0, Time elapsed: 0.051 sec
    [junit] Tests run: 8, Failures: 0, Errors: 0, Time elapsed: 0.866 sec
    [junit] Tests run: 4, Failures: 0, Errors: 0, Time elapsed: 0.012 sec
    [junit] Tests run: 1, Failures: 0, Errors: 0, Time elapsed: 0.356 sec
    [junit] Tests run: 14, Failures: 0, Errors: 0, Time elapsed: 0.632 sec
    [junit] Tests run: 5, Failures: 0, Errors: 0, Time elapsed: 0.003 sec
    [junit] Tests run: 3, Failures: 0, Errors: 0, Time elapsed: 0.004 sec
    [junit] Tests run: 4, Failures: 0, Errors: 0, Time elapsed: 0.016 sec
Running post goal: test:test
    [touch] Creating /home/continuum/continuum-1.0.2/apps/continuum/work/1/modules/kernel/target/test-reports/tstamp

jar:jar:
    [copy] Copying 1 file to /home/continuum/continuum-1.0.2/apps/continuum/work/1/modules/kernel/target/classes/META-INF
    [jar] Building jar: /home/continuum/continuum-1.0.2/apps/continuum/work/1/modules/kernel/target/geronimo-kernel-1.2-SNAPSHOT.jar

jar:install:
    [echo] Installing...
Uploading to geronimo/jars/geronimo-kernel-1.2-SNAPSHOT.jar: 
.................... (337K)
Uploading to geronimo/poms/geronimo-kernel-1.2-SNAPSHOT.pom: 
.................... (11K)

+----------------------------------------
| geronimo and geronimo-plugins Geronimo :: Common
| Memory: 17M/28M
+----------------------------------------
DEPRECATED: the default goal should be specified in the <build> section of project.xml
instead of maven.xml

build:end:

Attempting to download geronimo-kernel-1.2-SNAPSHOT.jar.
build:start:

multiproject:install-callback:
    [echo] Running jar:install for Geronimo :: Common
java:prepare-filesystem:
    [mkdir] Created dir: /home/continuum/continuum-1.0.2/apps/continuum/work/1/modules/common/target/classes

java:compile:
<depend closure="false" srcdir="1.4" dump="false" destdir="/home/continuum/continuum-1.0.2/apps/continuum/work/1/modules/common/target/classes"></depend>
   [echo] Compiling to /home/continuum/continuum-1.0.2/apps/continuum/work/1/modules/common/target/classes
    [javac] Compiling 43 source files to /home/continuum/continuum-1.0.2/apps/continuum/work/1/modules/common/target/classes

java:jar-resources:

test:prepare-filesystem:
    [mkdir] Created dir: /home/continuum/continuum-1.0.2/apps/continuum/work/1/modules/common/target/test-classes
    [mkdir] Created dir: /home/continuum/continuum-1.0.2/apps/continuum/work/1/modules/common/target/test-reports

test:test-resources:

test:compile:
    [javac] Compiling 17 source files to /home/continuum/continuum-1.0.2/apps/continuum/work/1/modules/common/target/test-classes

test:test:
    [junit] Running org.apache.geronimo.common.DeploymentExceptionTest
    [junit] Tests run: 1, Failures: 0, Errors: 0, Time elapsed: 0.026 sec
    [junit] Running org.apache.geronimo.common.GeronimoEnvironmentTest
    [junit] Tests run: 1, Failures: 0, Errors: 0, Time elapsed: 0.014 sec
    [junit] Running org.apache.geronimo.common.propertyeditor.ArrayListEditorTest
    [junit] Tests run: 4, Failures: 0, Errors: 0, Time elapsed: 0.026 sec
    [junit] Running org.apache.geronimo.common.propertyeditor.ArrayPropertyEditorAdapterTest
    [junit] Tests run: 2, Failures: 0, Errors: 0, Time elapsed: 0.024 sec
    [junit] Running org.apache.geronimo.common.propertyeditor.CollectionEditorTest
    [junit] Tests run: 4, Failures: 0, Errors: 0, Time elapsed: 0.025 sec
    [junit] Running org.apache.geronimo.common.propertyeditor.HashSetEditorTest
    [junit] Tests run: 4, Failures: 0, Errors: 0, Time elapsed: 0.023 sec
    [junit] Running org.apache.geronimo.common.propertyeditor.LinkedListEditorTest
    [junit] Tests run: 4, Failures: 0, Errors: 0, Time elapsed: 0.02 sec
    [junit] Running org.apache.geronimo.common.propertyeditor.ListEditorTest
    [junit] Tests run: 4, Failures: 0, Errors: 0, Time elapsed: 0.024 sec
    [junit] Running org.apache.geronimo.common.propertyeditor.PropertiesEditorTest
    [junit] Tests run: 4, Failures: 0, Errors: 0, Time elapsed: 0.025 sec
    [junit] Running org.apache.geronimo.common.propertyeditor.PropertyEditorsTest
    [junit] Tests run: 2, Failures: 0, Errors: 0, Time elapsed: 0.01 sec
    [junit] Running org.apache.geronimo.common.propertyeditor.SetEditorTest
    [junit] Tests run: 4, Failures: 0, Errors: 0, Time elapsed: 0.02 sec
    [junit] Running org.apache.geronimo.common.propertyeditor.StackEditorTest
    [junit] Tests run: 4, Failures: 0, Errors: 0, Time elapsed: 0.023 sec
    [junit] Running org.apache.geronimo.common.propertyeditor.TreeSetEditorTest
    [junit] Tests run: 4, Failures: 0, Errors: 0, Time elapsed: 0.022 sec
    [junit] Running org.apache.geronimo.common.propertyeditor.URLEditorTest
    [junit] Tests run: 5, Failures: 0, Errors: 0, Time elapsed: 0.099 sec
    [junit] Running org.apache.geronimo.common.propertyeditor.VectorEditorTest
    [junit] Tests run: 4, Failures: 0, Errors: 0, Time elapsed: 0.019 sec
Running post goal: test:test
    [touch] Creating /home/continuum/continuum-1.0.2/apps/continuum/work/1/modules/common/target/test-reports/tstamp

jar:jar:
    [jar] Building jar: /home/continuum/continuum-1.0.2/apps/continuum/work/1/modules/common/target/geronimo-common-1.2-SNAPSHOT.jar

jar:install:
    [echo] Installing...
Uploading to geronimo/jars/geronimo-common-1.2-SNAPSHOT.jar: 
.................... (36K)
Uploading to geronimo/poms/geronimo-common-1.2-SNAPSHOT.pom: 
.................... (10K)

+----------------------------------------
| geronimo and geronimo-plugins Geronimo :: Util
| Memory: 13M/28M
+----------------------------------------
DEPRECATED: the default goal should be specified in the <build> section of project.xml
instead of maven.xml

build:end:

build:start:

multiproject:install-callback:
    [echo] Running jar:install for Geronimo :: Util
java:prepare-filesystem:
    [mkdir] Created dir: /home/continuum/continuum-1.0.2/apps/continuum/work/1/modules/util/target/classes

java:compile:
<depend closure="false" srcdir="1.4" dump="false" destdir="/home/continuum/continuum-1.0.2/apps/continuum/work/1/modules/util/target/classes"></depend>
   [echo] Compiling to /home/continuum/continuum-1.0.2/apps/continuum/work/1/modules/util/target/classes
    [javac] Compiling 175 source files to /home/continuum/continuum-1.0.2/apps/continuum/work/1/modules/util/target/classes
    [javac] Note: Some input files use or override a deprecated API.
    [javac] Note: Recompile with -deprecation for details.

java:jar-resources:

test:prepare-filesystem:
    [mkdir] Created dir: /home/continuum/continuum-1.0.2/apps/continuum/work/1/modules/util/target/test-classes
    [mkdir] Created dir: /home/continuum/continuum-1.0.2/apps/continuum/work/1/modules/util/target/test-reports

test:test-resources:

test:compile:
    [javac] Compiling 1 source file to /home/continuum/continuum-1.0.2/apps/continuum/work/1/modules/util/target/test-classes

test:test:
    [junit] Running org.apache.geronimo.util.SimpleEncryptionTest
    [junit] Tests run: 1, Failures: 0, Errors: 0, Time elapsed: 0.644 sec
Running post goal: test:test
    [touch] Creating /home/continuum/continuum-1.0.2/apps/continuum/work/1/modules/util/target/test-reports/tstamp

jar:jar:
    [jar] Building jar: /home/continuum/continuum-1.0.2/apps/continuum/work/1/modules/util/target/geronimo-util-1.2-SNAPSHOT.jar

jar:install:
    [echo] Installing...
Uploading to geronimo/jars/geronimo-util-1.2-SNAPSHOT.jar: 
.................... (243K)
Uploading to geronimo/poms/geronimo-util-1.2-SNAPSHOT.pom: 
.................... (10K)

+----------------------------------------
| geronimo and geronimo-plugins Geronimo :: System
| Memory: 23M/28M
+----------------------------------------
DEPRECATED: the default goal should be specified in the <build> section of project.xml
instead of maven.xml
DEPRECATED: the default goal should be specified in the <build> section of project.xml
instead of maven.xml

build:end:

Attempting to download geronimo-common-1.2-SNAPSHOT.jar.
Attempting to download geronimo-util-1.2-SNAPSHOT.jar.
build:start:

multiproject:install-callback:
    [echo] Running jar:install for Geronimo :: System
java:prepare-filesystem:
    [mkdir] Created dir: /home/continuum/continuum-1.0.2/apps/continuum/work/1/modules/system/target/classes

java:compile:
<depend closure="false" srcdir="1.4" dump="false" destdir="/home/continuum/continuum-1.0.2/apps/continuum/work/1/modules/system/target/classes"></depend>
   [echo] Compiling to /home/continuum/continuum-1.0.2/apps/continuum/work/1/modules/system/target/classes
    [javac] Compiling 80 source files to /home/continuum/continuum-1.0.2/apps/continuum/work/1/modules/system/target/classes
    [javac] Note: /home/continuum/continuum-1.0.2/apps/continuum/work/1/modules/system/src/java/org/apache/geronimo/system/configuration/XMLSerializer.java
uses or overrides a deprecated API.
    [javac] Note: Recompile with -deprecation for details.
Running post goal: java:compile
    [mkdir] Created dir: /home/continuum/continuum-1.0.2/apps/continuum/work/1/modules/system/target/classes/META-INF
    [mkdir] Created dir: /home/continuum/continuum-1.0.2/apps/continuum/work/1/modules/system/target/classes/META-INF/schema
    [copy] Copying 2 files to /home/continuum/continuum-1.0.2/apps/continuum/work/1/modules/system/target/classes/META-INF/schema

java:jar-resources:

test:prepare-filesystem:
    [mkdir] Created dir: /home/continuum/continuum-1.0.2/apps/continuum/work/1/modules/system/target/test-classes
    [mkdir] Created dir: /home/continuum/continuum-1.0.2/apps/continuum/work/1/modules/system/target/test-reports

test:test-resources:
Copying 2 files to /home/continuum/continuum-1.0.2/apps/continuum/work/1/modules/system/target/test-classes/META-INF
Copying 3 files to /home/continuum/continuum-1.0.2/apps/continuum/work/1/modules/system/target/test-classes
Running post goal: test:test-resources
    [mkdir] Created dir: /home/continuum/continuum-1.0.2/apps/continuum/work/1/modules/system/target/tmp
    [mkdir] Created dir: /home/continuum/continuum-1.0.2/apps/continuum/work/1/modules/system/target/m1
    [mkdir] Created dir: /home/continuum/continuum-1.0.2/apps/continuum/work/1/modules/system/target/m2
    [copy] Copying 4 files to /home/continuum/continuum-1.0.2/apps/continuum/work/1/modules/system/target/m1
    [copy] Copying 4 files to /home/continuum/continuum-1.0.2/apps/continuum/work/1/modules/system/target/m2

test:compile:
    [javac] Compiling 16 source files to /home/continuum/continuum-1.0.2/apps/continuum/work/1/modules/system/target/test-classes

test:test:
    [junit] Running org.apache.geronimo.system.configuration.ConfigurationStoreUtilTest
    [junit] Tests run: 4, Failures: 0, Errors: 0, Time elapsed: 0.441 sec
    [junit] Running org.apache.geronimo.system.configuration.InPlaceConfigurationUtilTest
    [junit] Tests run: 3, Failures: 0, Errors: 0, Time elapsed: 0.446 sec
    [junit] Running org.apache.geronimo.system.configuration.LocalAttributeManagerTest
    [junit] Tests run: 6, Failures: 0, Errors: 0, Time elapsed: 0.503 sec
    [junit] Running org.apache.geronimo.system.configuration.ServerOverrideTest
    [junit] Tests run: 4, Failures: 0, Errors: 0, Time elapsed: 0.645 sec
    [junit] Running org.apache.geronimo.system.logging.log4j.XLevelTest
    [junit] Tests run: 4, Failures: 0, Errors: 0, Time elapsed: 0.33 sec
    [junit] Running org.apache.geronimo.system.plugin.PluginInstallerTest
    [junit] Tests run: 1, Failures: 0, Errors: 1, Time elapsed: 0.941 sec
    [junit] [ERROR] Test org.apache.geronimo.system.plugin.PluginInstallerTest FAILED
    [junit] Running org.apache.geronimo.system.properties.NamingPropertiesTest
    [junit] Tests run: 1, Failures: 0, Errors: 0, Time elapsed: 0.392 sec
    [junit] Running org.apache.geronimo.system.repository.Maven1RepositoryTest
    [junit] Tests run: 10, Failures: 0, Errors: 0, Time elapsed: 0.508 sec
    [junit] Running org.apache.geronimo.system.repository.Maven2RepositoryTest
    [junit] Tests run: 10, Failures: 0, Errors: 0, Time elapsed: 0.509 sec
    [junit] Running org.apache.geronimo.system.rmi.RMIClassLoaderSpiImplTest
    [junit] Tests run: 3, Failures: 0, Errors: 0, Time elapsed: 0.351 sec
    [junit] Running org.apache.geronimo.system.serverinfo.ServerInfoTest
    [junit] Tests run: 5, Failures: 0, Errors: 0, Time elapsed: 0.375 sec

BUILD FAILED
File...... /home/continuum/continuum-1.0.2/apps/continuum/work/1/maven.xml
Element... maven:reactor
Line...... 43
Column.... -1
Unable to obtain goal [multiproject:install-callback] -- /home/continuum/.maven/cache/maven-test-plugin-1.7/plugin.jelly:183:-1:
<fail> There were test failures.
Total time   : 4 minutes 48 seconds 
Finished at  : Monday, May 29, 2006 9:46:13 AM PDT


****************************************************************************



Mime
View raw message