geronimo-scm mailing list archives

Site index · List index
Message view « Date » · « Thread »
Top « Date » · « Thread »
From continuum <contin...@stan.gbuild.org>
Subject [continuum] BUILD FAILURE: Geronimo 1.1
Date Wed, 12 Apr 2006 05:26:44 GMT
Online report : http://ci.gbuild.org/continuum/servlet/continuum/target/ProjectBuild.vm/view/ProjectBuild/id/68/buildId/2219
Build statistics:
  State: Failed
  Previous State: Ok
  Started at: Tue, 11 Apr 2006 22:25:03 -0700
  Finished at: Tue, 11 Apr 2006 22:26:43 -0700
  Total time: 1m 39s
  Build Trigger: Schedule
  Exit code: 70
  Building machine hostname: stan.gbuild.org
  Operating system : Linux(unknown)
  Java version : 1.4.2_08(Sun Microsystems Inc.)

Changes
                            applications/console-standard/project.xml
            applications/console-standard/src/java/org/apache/geronimo/console/apache/jk/ResultsHandler.java
            applications/console-standard/src/java/org/apache/geronimo/console/apache/jk/ApacheConfigPortlet.java
            applications/console-standard/src/java/org/apache/geronimo/console/apache/jk/ConfigHandler.java
            applications/console-standard/src/java/org/apache/geronimo/console/apache/jk/IndexHandler.java
            applications/console-standard/src/java/org/apache/geronimo/console/apache/jk/AJPHandler.java
            applications/console-standard/src/java/org/apache/geronimo/console/apache/jk/BaseApacheHandler.java
            applications/console-standard/src/java/org/apache/geronimo/console/apache/jk/WebAppHandler.java
            applications/console-standard/src/java/org/apache/geronimo/console/MultiPagePortlet.java
            applications/console-standard/src/java/org/apache/geronimo/console/jmsmanager/wizard/JMSResourcePortlet.java
            applications/console-standard/src/java/org/apache/geronimo/console/keystores/UnlockKeystoreHandler.java
            applications/console-standard/src/java/org/apache/geronimo/console/keystores/ConfigureNewKeyHandler.java
            applications/console-standard/src/java/org/apache/geronimo/console/keystores/KeystoresPortlet.java
            applications/console-standard/src/java/org/apache/geronimo/console/keystores/ConfirmKeyHandler.java
            applications/console-standard/src/java/org/apache/geronimo/console/keystores/UploadCertificateHandler.java
            applications/console-standard/src/java/org/apache/geronimo/console/keystores/CreateKeystoreHandler.java
            applications/console-standard/src/java/org/apache/geronimo/console/keystores/ListHandler.java
            applications/console-standard/src/java/org/apache/geronimo/console/keystores/BaseKeystoreHandler.java
            applications/console-standard/src/java/org/apache/geronimo/console/keystores/ConfirmCertificateHandler.java
            applications/console-standard/src/java/org/apache/geronimo/console/keystores/ViewKeystoreHandler.java
            applications/console-standard/src/java/org/apache/geronimo/console/MultiPageAbstractHandler.java
            applications/console-standard/src/java/org/apache/geronimo/console/threads/ThreadPoolPortlet.java
            applications/console-standard/src/java/org/apache/geronimo/console/util/PortletManager.java
            applications/console-standard/src/webapp/WEB-INF/portlet.xml
            applications/console-standard/src/webapp/WEB-INF/view/apache/jk/config.jsp
            applications/console-standard/src/webapp/WEB-INF/view/apache/jk/index.jsp
            applications/console-standard/src/webapp/WEB-INF/view/apache/jk/ajpPort.jsp
            applications/console-standard/src/webapp/WEB-INF/view/apache/jk/results.jsp
            applications/console-standard/src/webapp/WEB-INF/view/apache/jk/webApps.jsp
            applications/console-standard/src/webapp/WEB-INF/view/keystore/confirmKey.jsp
            applications/console-standard/src/webapp/WEB-INF/view/keystore/index.jsp
            applications/console-standard/src/webapp/WEB-INF/view/keystore/uploadCertificate.jsp
            applications/console-standard/src/webapp/WEB-INF/view/keystore/createKeystore.jsp
            applications/console-standard/src/webapp/WEB-INF/view/keystore/configureKey.jsp
            applications/console-standard/src/webapp/WEB-INF/view/keystore/confirmCertificate.jsp
            applications/console-standard/src/webapp/WEB-INF/view/keystore/viewKeystore.jsp
            applications/console-standard/src/webapp/WEB-INF/view/keystore/unlockKeystore.jsp
            applications/console-standard/src/webapp/WEB-INF/web.xml
            applications/console-core/src/java/org/apache/geronimo/console/util/ManagementHelper.java
            applications/console-core/src/java/org/apache/geronimo/console/util/KernelManagementHelper.java
            applications/console-framework/src/webapp/WEB-INF/data/pageregistry.xml
            applications/console-framework/src/webapp/WEB-INF/data/portletentityregistry.xml
            assemblies/j2ee-jetty-server/src/var/config/config.xml
            configs/j2ee-security/project.xml
            configs/j2ee-security/src/plan/plan.xml
            configs/rmi-naming/project.xml
            modules/kernel/src/test/org/apache/geronimo/kernel/repository/ArtifactResolverTest.java
            modules/kernel/src/test/org/apache/geronimo/kernel/config/ConfigurationManagerTest.java
            modules/kernel/src/java/org/apache/geronimo/kernel/config/ConfigurationManager.java
            modules/kernel/src/java/org/apache/geronimo/kernel/config/Configuration.java
            modules/kernel/src/java/org/apache/geronimo/kernel/config/SimpleConfigurationManager.java
            modules/kernel/src/java/org/apache/geronimo/kernel/config/ConfigurationInfo.java
            modules/kernel/src/java/org/apache/geronimo/kernel/config/ConfigurationStore.java
            modules/jetty-builder/src/test/org/apache/geronimo/jetty/deployment/JettyModuleBuilderTest.java
            modules/system/src/java/org/apache/geronimo/system/configuration/RepositoryConfigurationStore.java
            modules/j2ee/src/java/org/apache/geronimo/j2ee/j2eeobjectnames/NameFactory.java
            modules/j2ee/src/java/org/apache/geronimo/j2ee/management/impl/Util.java
            modules/j2ee/src/java/org/apache/geronimo/j2ee/management/impl/J2EEServerImpl.java
            modules/deploy-tool/src/java/org/apache/geronimo/deployment/PluginBootstrap.java
            modules/connector-builder/src/test/org/apache/geronimo/connector/deployment/ConnectorModuleBuilderTest.java
            modules/security/project.xml
            modules/security/src/java/org/apache/geronimo/security/keystore/FileKeystoreManager.java
            modules/security/src/java/org/apache/geronimo/security/keystore/KeystoreManager.java
            modules/security/src/java/org/apache/geronimo/security/keystore/KeystoreIsLocked.java
            modules/security/src/java/org/apache/geronimo/security/keystore/KeyIsLocked.java
            modules/security/src/java/org/apache/geronimo/security/keystore/FileKeystoreInstance.java
            modules/security/src/java/org/apache/geronimo/security/keystore/KeystoreInstance.java
            modules/j2ee-builder/src/test/org/apache/geronimo/j2ee/deployment/EARConfigBuilderTest.java
            modules/tomcat-builder/src/test/org/apache/geronimo/tomcat/deployment/TomcatModuleBuilderTest.java
            modules/management/src/java/org/apache/geronimo/management/geronimo/KeystoreManager.java
            modules/management/src/java/org/apache/geronimo/management/geronimo/KeyIsLocked.java
            modules/management/src/java/org/apache/geronimo/management/geronimo/J2EEServer.java
            modules/management/src/java/org/apache/geronimo/management/geronimo/KeystoreIsLocked.java
            modules/management/src/java/org/apache/geronimo/management/geronimo/KeystoreInstance.java
            modules/util/src/java/org/apache/geronimo/util/CertificateUtil.java
        
****************************************************************************
Output:
****************************************************************************
 __  __
|  \/  |__ _Apache__ ___
| |\/| / _` \ V / -_) ' \  ~ intelligent projects ~
|_|  |_\__,_|\_/\___|_||_|  v. 1.1-beta-2

DEPRECATED: the default goal should be specified in the <build> section of project.xml
instead of maven.xml
DEPRECATED: the default goal should be specified in the <build> section of project.xml
instead of maven.xml
build:start:

m:checkout:
    [exec] Checked out revision 2599.
Starting the reactor...
Our processing order:

new:
new0:

Starting the reactor...
Our processing order:
new00:

Starting the reactor...
Our processing order:
Geronimo :: Activation
Geronimo :: Kernel
Geronimo :: Common
Geronimo :: Util
Geronimo :: System
Geronimo :: Deployment
Geronimo :: Management API
Geronimo :: Core
Geronimo :: J2EE
Geronimo :: J2EE Schema
Geronimo :: Service :: Builder
Geronimo :: Maven Dependency Plugin
Geronimo :: Security
Geronimo :: Web Services
Geronimo :: Axis
Geronimo :: Naming
Geronimo :: Deploy :: Common Config
Geronimo :: Test :: DDBeans
Geronimo :: Transaction
Geronimo :: Connector
Geronimo :: Security :: Builder
Geronimo :: J2EE
Geronimo :: Naming :: Builder
Geronimo :: Connector :: Builder
Geronimo :: Axis :: Builder
Geronimo :: Client
Geronimo :: Client Builder
Geronimo :: Console Web
Geronimo :: Configuration Converter
Geronimo :: Web :: Builder
Geronimo :: Deploy :: JSR-88
Geronimo :: Deploy :: CLI Tool
Geronimo :: Derby
Geronimo :: Directory
Geronimo :: Deploy :: Hot Deployer
Geronimo :: Installer Processing
Geronimo :: Installer Support
Geronimo :: JavaMail Transport
Geronimo :: Jetty
Geronimo :: Jetty :: Builder
Geronimo :: JMX Remoting
Geronimo :: Mail
Geronimo :: Scripts
Geronimo :: Timer
Geronimo :: Tomcat
Geronimo :: Tomcat :: Builder
Geronimo :: Upgrade
Geronimo :: Maven Assembly Plugin
Geronimo :: Maven Deployment Plugin
Geronimo :: IZPack Installer Build Plugin
Geronimo :: Maven Packaging Plugin
+----------------------------------------
| geronimo and geronimo-plugins Geronimo :: Activation
| Memory: 7M/10M
+----------------------------------------
DEPRECATED: the default goal should be specified in the <build> section of project.xml
instead of maven.xml
new1:
Attempting to download geronimo-javamail_1.3.1_spec-1.1-SNAPSHOT.jar.
build:start:

multiproject:install-callback:
    [echo] Running jar:install for Geronimo :: Activation
java:prepare-filesystem:

java:compile:
<depend closure="false" srcdir="1.4" dump="false" destdir="/home/continuum/continuum-1.0.2/apps/continuum/work/68/modules/activation/target/classes"></depend>
   [echo] Compiling to /home/continuum/continuum-1.0.2/apps/continuum/work/68/modules/activation/target/classes

java:jar-resources:

test:prepare-filesystem:

test:test-resources:

test:compile:

test:test:
    [echo] NOTICE: Skipping tests; they seem to have passed already
    [echo] No tests to run.
Running post goal: test:test

jar:jar:

jar:install:
    [echo] Installing...
Uploading to geronimo/jars/geronimo-activation-1.1-SNAPSHOT.jar: 
.................... (13K)
Uploading to geronimo/poms/geronimo-activation-1.1-SNAPSHOT.pom: 
.................... (10K)

+----------------------------------------
| geronimo and geronimo-plugins Geronimo :: Kernel
| Memory: 8M/11M
+----------------------------------------
DEPRECATED: the default goal should be specified in the <build> section of project.xml
instead of maven.xml
DEPRECATED: the default goal should be specified in the <build> section of project.xml
instead of maven.xml

build:end:

build:start:

multiproject:install-callback:
    [echo] Running jar:install for Geronimo :: Kernel
Tag library requested that is not present: 'xmlbeans2:maven' in plugin: 'null'
java:prepare-filesystem:

java:compile:
<depend closure="false" srcdir="1.4" dump="false" destdir="/home/continuum/continuum-1.0.2/apps/continuum/work/68/modules/kernel/target/classes"></depend>
   [echo] Compiling to /home/continuum/continuum-1.0.2/apps/continuum/work/68/modules/kernel/target/classes
    [javac] Compiling 5 source files to /home/continuum/continuum-1.0.2/apps/continuum/work/68/modules/kernel/target/classes

java:jar-resources:

test:prepare-filesystem:

test:test-resources:

test:compile:
    [javac] Compiling 2 source files to /home/continuum/continuum-1.0.2/apps/continuum/work/68/modules/kernel/target/test-classes

test:test:
    [junit] Running org.apache.geronimo.gbean.GBeanInfoFactoryTest
    [junit] Tests run: 4, Failures: 0, Errors: 0, Time elapsed: 0.505 sec
    [junit] Running org.apache.geronimo.gbean.GBeanInfoTest
    [junit] Tests run: 9, Failures: 0, Errors: 0, Time elapsed: 0.042 sec
    [junit] Running org.apache.geronimo.gbean.GBeanNameTest
    [junit] Tests run: 7, Failures: 0, Errors: 0, Time elapsed: 0.065 sec
    [junit] Running org.apache.geronimo.gbean.runtime.GBeanAttributeTest
    [junit] Tests run: 4, Failures: 0, Errors: 0, Time elapsed: 0.628 sec
    [junit] Running org.apache.geronimo.gbean.runtime.GBeanDependencyTest
    [junit] Tests run: 1, Failures: 0, Errors: 0, Time elapsed: 0.435 sec
    [junit] Running org.apache.geronimo.kernel.BootstrapTest
    [junit] Tests run: 1, Failures: 0, Errors: 0, Time elapsed: 0.376 sec
    [junit] Running org.apache.geronimo.kernel.ClassloadingTest
    [junit] Tests run: 10, Failures: 0, Errors: 0, Time elapsed: 0.075 sec
    [junit] Running org.apache.geronimo.kernel.ConfigTest
    [junit] Tests run: 3, Failures: 0, Errors: 0, Time elapsed: 1.209 sec
    [junit] Running org.apache.geronimo.kernel.GBeanTest
    [junit] Tests run: 27, Failures: 0, Errors: 0, Time elapsed: 2.625 sec
    [junit] Running org.apache.geronimo.kernel.SimpleGBeanTest
    [junit] Tests run: 1, Failures: 0, Errors: 0, Time elapsed: 0.573 sec
    [junit] Running org.apache.geronimo.kernel.basic.BasicProxyMapTest
    [junit] Tests run: 7, Failures: 0, Errors: 0, Time elapsed: 1.18 sec
    [junit] Running org.apache.geronimo.kernel.config.ConfigurationManagerTest
    [junit] Tests run: 1, Failures: 0, Errors: 0, Time elapsed: 0.563 sec
    [junit] Running org.apache.geronimo.kernel.config.ConfigurationUtilTest
    [junit] Tests run: 1, Failures: 0, Errors: 0, Time elapsed: 0.477 sec
    [junit] Running org.apache.geronimo.kernel.config.MultiParentClassLoaderTest
    [junit] Tests run: 14, Failures: 0, Errors: 0, Time elapsed: 0.661 sec
    [junit] Running org.apache.geronimo.kernel.management.StateTest
    [junit] Tests run: 5, Failures: 0, Errors: 0, Time elapsed: 0.01 sec
    [junit] Running org.apache.geronimo.kernel.repository.ArtifactManagerTest
    [junit] Tests run: 3, Failures: 0, Errors: 0, Time elapsed: 0.034 sec
    [junit] Running org.apache.geronimo.kernel.repository.ArtifactResolverTest
    [junit] Tests run: 4, Failures: 0, Errors: 0, Time elapsed: 0.149 sec
Running post goal: test:test

jar:jar:
    [jar] Building jar: /home/continuum/continuum-1.0.2/apps/continuum/work/68/modules/kernel/target/geronimo-kernel-1.1-SNAPSHOT.jar

jar:install:
    [echo] Installing...
Uploading to geronimo/jars/geronimo-kernel-1.1-SNAPSHOT.jar: 
.................... (303K)
Uploading to geronimo/poms/geronimo-kernel-1.1-SNAPSHOT.pom: 
.................... (11K)

+----------------------------------------
| geronimo and geronimo-plugins Geronimo :: Common
| Memory: 15M/22M
+----------------------------------------
DEPRECATED: the default goal should be specified in the <build> section of project.xml
instead of maven.xml

build:end:

Attempting to download geronimo-kernel-1.1-SNAPSHOT.jar.
build:start:

multiproject:install-callback:
    [echo] Running jar:install for Geronimo :: Common
java:prepare-filesystem:

java:compile:
<depend closure="false" srcdir="1.4" dump="false" destdir="/home/continuum/continuum-1.0.2/apps/continuum/work/68/modules/common/target/classes"></depend>
   [echo] Compiling to /home/continuum/continuum-1.0.2/apps/continuum/work/68/modules/common/target/classes

java:jar-resources:

test:prepare-filesystem:

test:test-resources:

test:compile:

test:test:
    [echo] NOTICE: Skipping tests; they seem to have passed already
    [echo] No tests to run.
Running post goal: test:test

jar:jar:

jar:install:
    [echo] Installing...
Uploading to geronimo/jars/geronimo-common-1.1-SNAPSHOT.jar: 
.................... (36K)
Uploading to geronimo/poms/geronimo-common-1.1-SNAPSHOT.pom: 
.................... (10K)

+----------------------------------------
| geronimo and geronimo-plugins Geronimo :: Util
| Memory: 14M/22M
+----------------------------------------
DEPRECATED: the default goal should be specified in the <build> section of project.xml
instead of maven.xml

build:end:

build:start:

multiproject:install-callback:
    [echo] Running jar:install for Geronimo :: Util
java:prepare-filesystem:

java:compile:
<depend closure="false" srcdir="1.4" dump="false" destdir="/home/continuum/continuum-1.0.2/apps/continuum/work/68/modules/util/target/classes"></depend>
   [echo] Compiling to /home/continuum/continuum-1.0.2/apps/continuum/work/68/modules/util/target/classes
    [javac] Compiling 1 source file to /home/continuum/continuum-1.0.2/apps/continuum/work/68/modules/util/target/classes

java:jar-resources:

test:prepare-filesystem:

test:test-resources:

test:compile:

test:test:
    [junit] Running org.apache.geronimo.util.SimpleEncryptionTest
    [junit] Tests run: 1, Failures: 0, Errors: 0, Time elapsed: 0.637 sec
Running post goal: test:test

jar:jar:
    [jar] Building jar: /home/continuum/continuum-1.0.2/apps/continuum/work/68/modules/util/target/geronimo-util-1.1-SNAPSHOT.jar

jar:install:
    [echo] Installing...
Uploading to geronimo/jars/geronimo-util-1.1-SNAPSHOT.jar: 
.................... (243K)
Uploading to geronimo/poms/geronimo-util-1.1-SNAPSHOT.pom: 
.................... (10K)

+----------------------------------------
| geronimo and geronimo-plugins Geronimo :: System
| Memory: 19M/22M
+----------------------------------------
DEPRECATED: the default goal should be specified in the <build> section of project.xml
instead of maven.xml
DEPRECATED: the default goal should be specified in the <build> section of project.xml
instead of maven.xml

build:end:

Attempting to download geronimo-common-1.1-SNAPSHOT.jar.
Attempting to download geronimo-util-1.1-SNAPSHOT.jar.
build:start:

multiproject:install-callback:
    [echo] Running jar:install for Geronimo :: System
java:prepare-filesystem:

java:compile:
<depend closure="false" srcdir="1.4" dump="false" destdir="/home/continuum/continuum-1.0.2/apps/continuum/work/68/modules/system/target/classes"></depend>
   [echo] Compiling to /home/continuum/continuum-1.0.2/apps/continuum/work/68/modules/system/target/classes
    [javac] Compiling 1 source file to /home/continuum/continuum-1.0.2/apps/continuum/work/68/modules/system/target/classes
Running post goal: java:compile

java:jar-resources:

test:prepare-filesystem:

test:test-resources:
Running post goal: test:test-resources
    [delete] Deleting directory /home/continuum/continuum-1.0.2/apps/continuum/work/68/modules/system/target/tmp
    [mkdir] Created dir: /home/continuum/continuum-1.0.2/apps/continuum/work/68/modules/system/target/tmp

test:compile:

test:test:
    [junit] Running org.apache.geronimo.system.configuration.ConfigurationStoreUtilTest
    [junit] Tests run: 4, Failures: 0, Errors: 0, Time elapsed: 0.458 sec
    [junit] Running org.apache.geronimo.system.configuration.LocalAttributeManagerTest
    [junit] Tests run: 6, Failures: 0, Errors: 0, Time elapsed: 0.54 sec
    [junit] Running org.apache.geronimo.system.configuration.ServerOverrideTest
    [junit] Tests run: 4, Failures: 0, Errors: 0, Time elapsed: 0.53 sec
    [junit] Running org.apache.geronimo.system.logging.log4j.XLevelTest
    [junit] Tests run: 4, Failures: 0, Errors: 0, Time elapsed: 0.335 sec
    [junit] Running org.apache.geronimo.system.properties.NamingPropertiesTest
    [junit] Tests run: 1, Failures: 0, Errors: 0, Time elapsed: 0.402 sec
    [junit] Running org.apache.geronimo.system.repository.Maven1RepositoryTest
    [junit] Tests run: 3, Failures: 0, Errors: 0, Time elapsed: 0.593 sec
    [junit] Running org.apache.geronimo.system.repository.Maven2RepositoryTest
    [junit] Tests run: 3, Failures: 0, Errors: 0, Time elapsed: 0.599 sec
    [junit] Running org.apache.geronimo.system.rmi.RMIClassLoaderSpiImplTest
    [junit] Tests run: 3, Failures: 0, Errors: 0, Time elapsed: 0.393 sec
    [junit] Running org.apache.geronimo.system.serverinfo.ServerInfoTest
    [junit] Tests run: 2, Failures: 0, Errors: 0, Time elapsed: 0.374 sec
Running post goal: test:test

jar:jar:
    [jar] Building jar: /home/continuum/continuum-1.0.2/apps/continuum/work/68/modules/system/target/geronimo-system-1.1-SNAPSHOT.jar

jar:install:
    [echo] Installing...
Uploading to geronimo/jars/geronimo-system-1.1-SNAPSHOT.jar: 
.................... (172K)
Uploading to geronimo/poms/geronimo-system-1.1-SNAPSHOT.pom: 
.................... (11K)

+----------------------------------------
| geronimo and geronimo-plugins Geronimo :: Deployment
| Memory: 16M/25M
+----------------------------------------
DEPRECATED: the default goal should be specified in the <build> section of project.xml
instead of maven.xml
DEPRECATED: the default goal should be specified in the <build> section of project.xml
instead of maven.xml

build:end:

Attempting to download geronimo-system-1.1-SNAPSHOT.jar.
build:start:

multiproject:install-callback:
    [echo] Running jar:install for Geronimo :: Deployment
java:prepare-filesystem:

java:compile:
<depend closure="false" srcdir="1.4" dump="false" destdir="/home/continuum/continuum-1.0.2/apps/continuum/work/68/modules/deployment/target/classes"></depend>
   [echo] Compiling to /home/continuum/continuum-1.0.2/apps/continuum/work/68/modules/deployment/target/classes

java:jar-resources:

test:prepare-filesystem:

test:test-resources:

test:compile:

test:test:
    [echo] NOTICE: Skipping tests; they seem to have passed already
    [echo] No tests to run.
Running post goal: test:test

jar:jar:

jar:install:
    [echo] Installing...
Uploading to geronimo/jars/geronimo-deployment-1.1-SNAPSHOT.jar: 
.................... (46K)
Uploading to geronimo/poms/geronimo-deployment-1.1-SNAPSHOT.pom: 
.................... (11K)

+----------------------------------------
| geronimo and geronimo-plugins Geronimo :: Management API
| Memory: 16M/25M
+----------------------------------------
DEPRECATED: the default goal should be specified in the <build> section of project.xml
instead of maven.xml
DEPRECATED: the default goal should be specified in the <build> section of project.xml
instead of maven.xml

build:end:

build:start:

multiproject:install-callback:
    [echo] Running jar:install for Geronimo :: Management API
java:prepare-filesystem:

java:compile:
<depend closure="false" srcdir="1.4" dump="false" destdir="/home/continuum/continuum-1.0.2/apps/continuum/work/68/modules/management/target/classes"></depend>
   [echo] Compiling to /home/continuum/continuum-1.0.2/apps/continuum/work/68/modules/management/target/classes
    [javac] Compiling 5 source files to /home/continuum/continuum-1.0.2/apps/continuum/work/68/modules/management/target/classes

java:jar-resources:

test:prepare-filesystem:

test:test-resources:

test:compile:
    [echo] No test source files to compile.

test:test:
    [echo] No tests to run.
Running post goal: test:test

jar:jar:
    [jar] Building jar: /home/continuum/continuum-1.0.2/apps/continuum/work/68/modules/management/target/geronimo-management-1.1-SNAPSHOT.jar

jar:install:
    [echo] Installing...
Uploading to geronimo/jars/geronimo-management-1.1-SNAPSHOT.jar: 
.................... (38K)
Uploading to geronimo/poms/geronimo-management-1.1-SNAPSHOT.pom: 
.................... (10K)

+----------------------------------------
| geronimo and geronimo-plugins Geronimo :: Core
| Memory: 19M/25M
+----------------------------------------
DEPRECATED: the default goal should be specified in the <build> section of project.xml
instead of maven.xml
DEPRECATED: the default goal should be specified in the <build> section of project.xml
instead of maven.xml

build:end:

Attempting to download geronimo-management-1.1-SNAPSHOT.jar.
build:start:

multiproject:install-callback:
    [echo] Running jar:install for Geronimo :: Core
java:prepare-filesystem:

java:compile:
<depend closure="false" srcdir="1.4" dump="false" destdir="/home/continuum/continuum-1.0.2/apps/continuum/work/68/modules/core/target/classes"></depend>
   [echo] Compiling to /home/continuum/continuum-1.0.2/apps/continuum/work/68/modules/core/target/classes

java:jar-resources:

test:prepare-filesystem:

test:test-resources:

test:compile:

test:test:
    [echo] NOTICE: Skipping tests; they seem to have passed already
    [echo] No tests to run.
Running post goal: test:test

jar:jar:

jar:install:
    [echo] Installing...
Uploading to geronimo/jars/geronimo-core-1.1-SNAPSHOT.jar: 
.................... (39K)
Uploading to geronimo/poms/geronimo-core-1.1-SNAPSHOT.pom: 
.................... (11K)

+----------------------------------------
| geronimo and geronimo-plugins Geronimo :: J2EE
| Memory: 19M/25M
+----------------------------------------
DEPRECATED: the default goal should be specified in the <build> section of project.xml
instead of maven.xml
DEPRECATED: the default goal should be specified in the <build> section of project.xml
instead of maven.xml

build:end:

Attempting to download geronimo-core-1.1-SNAPSHOT.jar.
build:start:

multiproject:install-callback:
    [echo] Running jar:install for Geronimo :: J2EE
java:prepare-filesystem:

java:compile:
<depend closure="false" srcdir="1.4" dump="false" destdir="/home/continuum/continuum-1.0.2/apps/continuum/work/68/modules/j2ee/target/classes"></depend>
   [echo] Compiling to /home/continuum/continuum-1.0.2/apps/continuum/work/68/modules/j2ee/target/classes
    [javac] Compiling 3 source files to /home/continuum/continuum-1.0.2/apps/continuum/work/68/modules/j2ee/target/classes
    [javac] Note: /home/continuum/continuum-1.0.2/apps/continuum/work/68/modules/j2ee/src/java/org/apache/geronimo/j2ee/management/impl/Util.java
uses or overrides a deprecated API.
    [javac] Note: Recompile with -deprecation for details.

java:jar-resources:

test:prepare-filesystem:

test:test-resources:

test:compile:

test:test:
    [junit] Running org.apache.geronimo.j2ee.management.DomainTest
    [junit] Tests run: 2, Failures: 0, Errors: 2, Time elapsed: 0.659 sec
    [junit] [ERROR] Test org.apache.geronimo.j2ee.management.DomainTest FAILED
    [junit] Running org.apache.geronimo.j2ee.management.JVMTest
    [junit] Tests run: 5, Failures: 0, Errors: 0, Time elapsed: 0.618 sec
    [junit] Running org.apache.geronimo.j2ee.management.ServerTest
    [junit] Tests run: 2, Failures: 0, Errors: 0, Time elapsed: 0.47 sec

BUILD FAILED
File...... /home/continuum/continuum-1.0.2/apps/continuum/work/68/maven.xml
Element... maven:reactor
Line...... 43
Column.... -1
Unable to obtain goal [multiproject:install-callback] -- /home/continuum/.geronimo-1.1-maven/cache/maven-test-plugin-1.7/plugin.jelly:183:-1:
<fail> There were test failures.
Total time   : 1 minutes 38 seconds 
Finished at  : Tuesday, April 11, 2006 10:26:43 PM PDT


****************************************************************************



Mime
View raw message