geronimo-scm mailing list archives

Site index · List index
Message view « Date » · « Thread »
Top « Date » · « Thread »
From continuum <contin...@stan.gbuild.org>
Subject [continuum] BUILD FAILURE: Geronimo 1.1
Date Thu, 20 Apr 2006 07:19:30 GMT
Online report : http://ci.gbuild.org/continuum/servlet/continuum/target/ProjectBuild.vm/view/ProjectBuild/id/68/buildId/2445
Build statistics:
  State: Failed
  Previous State: Failed
  Started at: Thu, 20 Apr 2006 00:02:29 -0700
  Finished at: Thu, 20 Apr 2006 00:19:28 -0700
  Total time: 16m 58s
  Build Trigger: Schedule
  Exit code: 70
  Building machine hostname: stan.gbuild.org
  Operating system : Linux(unknown)
  Java version : 1.4.2_08(Sun Microsystems Inc.)

Changes
                            configs/openejb-deployer/NOTICE.txt
            configs/openejb-deployer/LICENSE.txt
            configs/openejb-deployer/project.properties
            configs/openejb-deployer/maven.xml
            configs/openejb-deployer/project.xml
            configs/openejb-deployer/src/plan/plan.xml
            configs/openejb/NOTICE.txt
            configs/openejb/LICENSE.txt
            configs/openejb/project.properties
            configs/openejb/maven.xml
            configs/openejb/project.xml
            configs/openejb/src/plan/plan.xml
            configs/axis-deployer/NOTICE.txt
            configs/axis-deployer/LICENSE.txt
            configs/axis-deployer/project.properties
            configs/axis-deployer/maven.xml
            configs/axis-deployer/project.xml
            configs/axis-deployer/src/plan/plan.xml
            configs/client-deployer/NOTICE.txt
            configs/client-deployer/LICENSE.txt
            configs/client-deployer/project.properties
            configs/client-deployer/maven.xml
            configs/client-deployer/project.xml
            configs/client-deployer/src/plan/plan.xml
            configs/axis/NOTICE.txt
            configs/axis/LICENSE.txt
            configs/axis/project.properties
            configs/axis/maven.xml
            configs/axis/project.xml
            configs/axis/src/plan/plan.xml
            modules/kernel/src/java/org/apache/geronimo/gbean/SingleElementCollection.java
            modules/connector-builder/src/test/org/apache/geronimo/connector/deployment/ConnectorModuleBuilderTest.java
            modules/j2ee-builder/src/java/org/apache/geronimo/j2ee/deployment/EARConfigBuilder.java
            etc/project.properties
        
****************************************************************************
Output:
****************************************************************************
 __  __
|  \/  |__ _Apache__ ___
| |\/| / _` \ V / -_) ' \  ~ intelligent projects ~
|_|  |_\__,_|\_/\___|_||_|  v. 1.1-beta-2

DEPRECATED: the default goal should be specified in the <build> section of project.xml instead of maven.xml
DEPRECATED: the default goal should be specified in the <build> section of project.xml instead of maven.xml
build:start:

m:checkout:
    [exec] Checked out revision 2615.
Starting the reactor...
Our processing order:

new:
new0:

Starting the reactor...
Our processing order:
new00:

Starting the reactor...
Our processing order:
Geronimo :: Activation
Geronimo :: Kernel
Geronimo :: Common
Geronimo :: Util
Geronimo :: System
Geronimo :: Deployment
Geronimo :: Deploy :: Common Config
Geronimo :: Management API
Geronimo :: Core
Geronimo :: J2EE
Geronimo :: J2EE Schema
Geronimo :: Service :: Builder
Geronimo :: Maven Dependency Plugin
Geronimo :: Naming
Geronimo :: Security
Geronimo :: Web Services
Geronimo :: Axis
Geronimo :: Test :: DDBeans
Geronimo :: Transaction
Geronimo :: Connector
Geronimo :: Security :: Builder
Geronimo :: J2EE
Geronimo :: Naming :: Builder
Geronimo :: Connector :: Builder
Geronimo :: Axis :: Builder
Geronimo :: Client
Geronimo :: Client Builder
Geronimo :: Console Web
Geronimo :: Configuration Converter
Geronimo :: Web :: Builder
Geronimo :: Deploy :: JSR-88
Geronimo :: Deploy :: CLI Tool
Geronimo :: Derby
Geronimo :: Directory
Geronimo :: Deploy :: Hot Deployer
Geronimo :: Installer Processing
Geronimo :: Installer Support
Geronimo :: JavaMail Transport
Geronimo :: Jetty
Geronimo :: Jetty :: Builder
Geronimo :: JMX Remoting
Geronimo :: Mail
Geronimo :: Scripts
Geronimo :: Timer
Geronimo :: Tomcat
Geronimo :: Tomcat :: Builder
Geronimo :: Upgrade
Geronimo :: Maven Assembly Plugin
Geronimo :: Maven Deployment Plugin
Geronimo :: IZPack Installer Build Plugin
Geronimo :: Maven Packaging Plugin
+----------------------------------------
| geronimo and geronimo-plugins Geronimo :: Activation
| Memory: 5M/9M
+----------------------------------------
DEPRECATED: the default goal should be specified in the <build> section of project.xml instead of maven.xml
new1:
Attempting to download geronimo-javamail_1.3.1_spec-1.1-SNAPSHOT.jar.
build:start:

multiproject:install-callback:
    [echo] Running jar:install for Geronimo :: Activation
java:prepare-filesystem:

java:compile:
<depend closure="false" srcdir="1.4" dump="false" destdir="/home/continuum/continuum-1.0.2/apps/continuum/work/68/modules/activation/target/classes"></depend>    [echo] Compiling to /home/continuum/continuum-1.0.2/apps/continuum/work/68/modules/activation/target/classes

java:jar-resources:

test:prepare-filesystem:

test:test-resources:

test:compile:

test:test:
    [echo] NOTICE: Skipping tests; they seem to have passed already
    [echo] No tests to run.
Running post goal: test:test

jar:jar:

jar:install:
    [echo] Installing...
Uploading to geronimo/jars/geronimo-activation-1.1-SNAPSHOT.jar: 
.................... (13K)
Uploading to geronimo/poms/geronimo-activation-1.1-SNAPSHOT.pom: 
.................... (10K)

+----------------------------------------
| geronimo and geronimo-plugins Geronimo :: Kernel
| Memory: 7M/13M
+----------------------------------------
DEPRECATED: the default goal should be specified in the <build> section of project.xml instead of maven.xml
DEPRECATED: the default goal should be specified in the <build> section of project.xml instead of maven.xml

build:end:

build:start:

multiproject:install-callback:
    [echo] Running jar:install for Geronimo :: Kernel
Tag library requested that is not present: 'xmlbeans2:maven' in plugin: 'null'
java:prepare-filesystem:

java:compile:
<depend closure="false" srcdir="1.4" dump="false" destdir="/home/continuum/continuum-1.0.2/apps/continuum/work/68/modules/kernel/target/classes"></depend>    [echo] Compiling to /home/continuum/continuum-1.0.2/apps/continuum/work/68/modules/kernel/target/classes
    [javac] Compiling 1 source file to /home/continuum/continuum-1.0.2/apps/continuum/work/68/modules/kernel/target/classes

java:jar-resources:

test:prepare-filesystem:

test:test-resources:

test:compile:

test:test:
    [junit] Running org.apache.geronimo.gbean.GBeanInfoFactoryTest
    [junit] Tests run: 4, Failures: 0, Errors: 0, Time elapsed: 0.52 sec
    [junit] Running org.apache.geronimo.gbean.GBeanInfoTest
    [junit] Tests run: 9, Failures: 0, Errors: 0, Time elapsed: 0.064 sec
    [junit] Running org.apache.geronimo.gbean.GBeanNameTest
    [junit] Tests run: 7, Failures: 0, Errors: 0, Time elapsed: 0.106 sec
    [junit] Running org.apache.geronimo.gbean.runtime.GBeanAttributeTest
    [junit] Tests run: 4, Failures: 0, Errors: 0, Time elapsed: 0.677 sec
    [junit] Running org.apache.geronimo.gbean.runtime.GBeanDependencyTest
    [junit] Tests run: 1, Failures: 0, Errors: 0, Time elapsed: 0.462 sec
    [junit] Running org.apache.geronimo.kernel.BootstrapTest
    [junit] Tests run: 1, Failures: 0, Errors: 0, Time elapsed: 0.361 sec
    [junit] Running org.apache.geronimo.kernel.ClassloadingTest
    [junit] Tests run: 10, Failures: 0, Errors: 0, Time elapsed: 0.075 sec
    [junit] Running org.apache.geronimo.kernel.ConfigTest
    [junit] Tests run: 3, Failures: 0, Errors: 0, Time elapsed: 1.329 sec
    [junit] Running org.apache.geronimo.kernel.GBeanTest
    [junit] Tests run: 18, Failures: 0, Errors: 0, Time elapsed: 1.815 sec
    [junit] Running org.apache.geronimo.kernel.SimpleGBeanTest
    [junit] Tests run: 1, Failures: 0, Errors: 0, Time elapsed: 0.653 sec
    [junit] Running org.apache.geronimo.kernel.basic.BasicProxyMapTest
    [junit] Tests run: 7, Failures: 0, Errors: 0, Time elapsed: 1.18 sec
    [junit] Running org.apache.geronimo.kernel.config.ConfigurationManagerTest
    [junit] Tests run: 7, Failures: 0, Errors: 0, Time elapsed: 1.162 sec
    [junit] Running org.apache.geronimo.kernel.config.ConfigurationModelTest
    [junit] Tests run: 4, Failures: 0, Errors: 0, Time elapsed: 0.015 sec
    [junit] Running org.apache.geronimo.kernel.config.ConfigurationUtilTest
    [junit] Tests run: 1, Failures: 0, Errors: 0, Time elapsed: 0.485 sec
    [junit] Running org.apache.geronimo.kernel.config.MultiParentClassLoaderTest
    [junit] Tests run: 14, Failures: 0, Errors: 0, Time elapsed: 0.616 sec
    [junit] Running org.apache.geronimo.kernel.management.StateTest
    [junit] Tests run: 5, Failures: 0, Errors: 0, Time elapsed: 0.008 sec
    [junit] Running org.apache.geronimo.kernel.repository.ArtifactManagerTest
    [junit] Tests run: 3, Failures: 0, Errors: 0, Time elapsed: 0.028 sec
    [junit] Running org.apache.geronimo.kernel.repository.ArtifactResolverTest
    [junit] Tests run: 4, Failures: 0, Errors: 0, Time elapsed: 0.162 sec
Running post goal: test:test

jar:jar:
    [jar] Building jar: /home/continuum/continuum-1.0.2/apps/continuum/work/68/modules/kernel/target/geronimo-kernel-1.1-SNAPSHOT.jar

jar:install:
    [echo] Installing...
Uploading to geronimo/jars/geronimo-kernel-1.1-SNAPSHOT.jar: 
.................... (306K)
Uploading to geronimo/poms/geronimo-kernel-1.1-SNAPSHOT.pom: 
.................... (11K)

+----------------------------------------
| geronimo and geronimo-plugins Geronimo :: Common
| Memory: 16M/19M
+----------------------------------------
DEPRECATED: the default goal should be specified in the <build> section of project.xml instead of maven.xml

build:end:

Attempting to download geronimo-kernel-1.1-SNAPSHOT.jar.
build:start:

multiproject:install-callback:
    [echo] Running jar:install for Geronimo :: Common
java:prepare-filesystem:

java:compile:
<depend closure="false" srcdir="1.4" dump="false" destdir="/home/continuum/continuum-1.0.2/apps/continuum/work/68/modules/common/target/classes"></depend>    [echo] Compiling to /home/continuum/continuum-1.0.2/apps/continuum/work/68/modules/common/target/classes

java:jar-resources:

test:prepare-filesystem:

test:test-resources:

test:compile:

test:test:
    [echo] NOTICE: Skipping tests; they seem to have passed already
    [echo] No tests to run.
Running post goal: test:test

jar:jar:

jar:install:
    [echo] Installing...
Uploading to geronimo/jars/geronimo-common-1.1-SNAPSHOT.jar: 
.................... (36K)
Uploading to geronimo/poms/geronimo-common-1.1-SNAPSHOT.pom: 
.................... (10K)

+----------------------------------------
| geronimo and geronimo-plugins Geronimo :: Util
| Memory: 16M/19M
+----------------------------------------
DEPRECATED: the default goal should be specified in the <build> section of project.xml instead of maven.xml

build:end:

build:start:

multiproject:install-callback:
    [echo] Running jar:install for Geronimo :: Util
java:prepare-filesystem:

java:compile:
<depend closure="false" srcdir="1.4" dump="false" destdir="/home/continuum/continuum-1.0.2/apps/continuum/work/68/modules/util/target/classes"></depend>    [echo] Compiling to /home/continuum/continuum-1.0.2/apps/continuum/work/68/modules/util/target/classes

java:jar-resources:

test:prepare-filesystem:

test:test-resources:

test:compile:

test:test:
    [echo] NOTICE: Skipping tests; they seem to have passed already
    [echo] No tests to run.
Running post goal: test:test

jar:jar:

jar:install:
    [echo] Installing...
Uploading to geronimo/jars/geronimo-util-1.1-SNAPSHOT.jar: 
.................... (243K)
Uploading to geronimo/poms/geronimo-util-1.1-SNAPSHOT.pom: 
.................... (10K)

+----------------------------------------
| geronimo and geronimo-plugins Geronimo :: System
| Memory: 17M/19M
+----------------------------------------
DEPRECATED: the default goal should be specified in the <build> section of project.xml instead of maven.xml
DEPRECATED: the default goal should be specified in the <build> section of project.xml instead of maven.xml

build:end:

Attempting to download geronimo-common-1.1-SNAPSHOT.jar.
Attempting to download geronimo-util-1.1-SNAPSHOT.jar.
build:start:

multiproject:install-callback:
    [echo] Running jar:install for Geronimo :: System
java:prepare-filesystem:

java:compile:
<depend closure="false" srcdir="1.4" dump="false" destdir="/home/continuum/continuum-1.0.2/apps/continuum/work/68/modules/system/target/classes"></depend>    [echo] Compiling to /home/continuum/continuum-1.0.2/apps/continuum/work/68/modules/system/target/classes
Running post goal: java:compile

java:jar-resources:

test:prepare-filesystem:

test:test-resources:
Running post goal: test:test-resources
    [delete] Deleting directory /home/continuum/continuum-1.0.2/apps/continuum/work/68/modules/system/target/tmp
    [mkdir] Created dir: /home/continuum/continuum-1.0.2/apps/continuum/work/68/modules/system/target/tmp

test:compile:

test:test:
    [echo] NOTICE: Skipping tests; they seem to have passed already
    [echo] No tests to run.
Running post goal: test:test

jar:jar:
    [jar] Building jar: /home/continuum/continuum-1.0.2/apps/continuum/work/68/modules/system/target/geronimo-system-1.1-SNAPSHOT.jar

jar:install:
    [echo] Installing...
Uploading to geronimo/jars/geronimo-system-1.1-SNAPSHOT.jar: 
.................... (232K)
Uploading to geronimo/poms/geronimo-system-1.1-SNAPSHOT.pom: 
.................... (11K)

+----------------------------------------
| geronimo and geronimo-plugins Geronimo :: Deployment
| Memory: 19M/19M
+----------------------------------------
DEPRECATED: the default goal should be specified in the <build> section of project.xml instead of maven.xml
DEPRECATED: the default goal should be specified in the <build> section of project.xml instead of maven.xml

build:end:

Attempting to download geronimo-system-1.1-SNAPSHOT.jar.
build:start:

multiproject:install-callback:
    [echo] Running jar:install for Geronimo :: Deployment
java:prepare-filesystem:

java:compile:
<depend closure="false" srcdir="1.4" dump="false" destdir="/home/continuum/continuum-1.0.2/apps/continuum/work/68/modules/deployment/target/classes"></depend>    [echo] Compiling to /home/continuum/continuum-1.0.2/apps/continuum/work/68/modules/deployment/target/classes

java:jar-resources:

test:prepare-filesystem:

test:test-resources:

test:compile:

test:test:
    [echo] NOTICE: Skipping tests; they seem to have passed already
    [echo] No tests to run.
Running post goal: test:test

jar:jar:

jar:install:
    [echo] Installing...
Uploading to geronimo/jars/geronimo-deployment-1.1-SNAPSHOT.jar: 
.................... (52K)
Uploading to geronimo/poms/geronimo-deployment-1.1-SNAPSHOT.pom: 
.................... (11K)

+----------------------------------------
| geronimo and geronimo-plugins Geronimo :: Deploy :: Common Config
| Memory: 13M/20M
+----------------------------------------
DEPRECATED: the default goal should be specified in the <build> section of project.xml instead of maven.xml
DEPRECATED: the default goal should be specified in the <build> section of project.xml instead of maven.xml

build:end:

build:start:

multiproject:install-callback:
    [echo] Running jar:install for Geronimo :: Deploy :: Common Config
java:prepare-filesystem:

java:compile:
<depend closure="false" srcdir="1.4" dump="false" destdir="/home/continuum/continuum-1.0.2/apps/continuum/work/68/modules/deploy-config/target/classes"></depend>    [echo] Compiling to /home/continuum/continuum-1.0.2/apps/continuum/work/68/modules/deploy-config/target/classes

java:jar-resources:

test:prepare-filesystem:

test:test-resources:

test:compile:

test:test:
    [echo] NOTICE: Skipping tests; they seem to have passed already
    [echo] No tests to run.
Running post goal: test:test

jar:jar:

jar:install:
    [echo] Installing...
Uploading to geronimo/jars/geronimo-deploy-config-1.1-SNAPSHOT.jar: 
.................... (10K)
Uploading to geronimo/poms/geronimo-deploy-config-1.1-SNAPSHOT.pom: 
.................... (11K)

+----------------------------------------
| geronimo and geronimo-plugins Geronimo :: Management API
| Memory: 13M/20M
+----------------------------------------
DEPRECATED: the default goal should be specified in the <build> section of project.xml instead of maven.xml
DEPRECATED: the default goal should be specified in the <build> section of project.xml instead of maven.xml

build:end:

build:start:

multiproject:install-callback:
    [echo] Running jar:install for Geronimo :: Management API
java:prepare-filesystem:

java:compile:
<depend closure="false" srcdir="1.4" dump="false" destdir="/home/continuum/continuum-1.0.2/apps/continuum/work/68/modules/management/target/classes"></depend>    [echo] Compiling to /home/continuum/continuum-1.0.2/apps/continuum/work/68/modules/management/target/classes

java:jar-resources:

test:prepare-filesystem:

test:test-resources:

test:compile:
    [echo] No test source files to compile.

test:test:
    [echo] NOTICE: Skipping tests; they seem to have passed already
    [echo] No tests to run.
Running post goal: test:test

jar:jar:

jar:install:
    [echo] Installing...
Uploading to geronimo/jars/geronimo-management-1.1-SNAPSHOT.jar: 
.................... (39K)
Uploading to geronimo/poms/geronimo-management-1.1-SNAPSHOT.pom: 
.................... (10K)

+----------------------------------------
| geronimo and geronimo-plugins Geronimo :: Core
| Memory: 13M/20M
+----------------------------------------
DEPRECATED: the default goal should be specified in the <build> section of project.xml instead of maven.xml
DEPRECATED: the default goal should be specified in the <build> section of project.xml instead of maven.xml

build:end:

Attempting to download geronimo-management-1.1-SNAPSHOT.jar.
build:start:

multiproject:install-callback:
    [echo] Running jar:install for Geronimo :: Core
java:prepare-filesystem:

java:compile:
<depend closure="false" srcdir="1.4" dump="false" destdir="/home/continuum/continuum-1.0.2/apps/continuum/work/68/modules/core/target/classes"></depend>    [echo] Compiling to /home/continuum/continuum-1.0.2/apps/continuum/work/68/modules/core/target/classes

java:jar-resources:

test:prepare-filesystem:

test:test-resources:

test:compile:

test:test:
    [echo] NOTICE: Skipping tests; they seem to have passed already
    [echo] No tests to run.
Running post goal: test:test

jar:jar:

jar:install:
    [echo] Installing...
Uploading to geronimo/jars/geronimo-core-1.1-SNAPSHOT.jar: 
.................... (39K)
Uploading to geronimo/poms/geronimo-core-1.1-SNAPSHOT.pom: 
.................... (11K)

+----------------------------------------
| geronimo and geronimo-plugins Geronimo :: J2EE
| Memory: 13M/20M
+----------------------------------------
DEPRECATED: the default goal should be specified in the <build> section of project.xml instead of maven.xml
DEPRECATED: the default goal should be specified in the <build> section of project.xml instead of maven.xml

build:end:

Attempting to download geronimo-core-1.1-SNAPSHOT.jar.
build:start:

multiproject:install-callback:
    [echo] Running jar:install for Geronimo :: J2EE
java:prepare-filesystem:

java:compile:
<depend closure="false" srcdir="1.4" dump="false" destdir="/home/continuum/continuum-1.0.2/apps/continuum/work/68/modules/j2ee/target/classes"></depend>    [echo] Compiling to /home/continuum/continuum-1.0.2/apps/continuum/work/68/modules/j2ee/target/classes

java:jar-resources:

test:prepare-filesystem:

test:test-resources:

test:compile:

test:test:
    [echo] NOTICE: Skipping tests; they seem to have passed already
    [echo] No tests to run.
Running post goal: test:test

jar:jar:

jar:install:
    [echo] Installing...
Uploading to geronimo/jars/geronimo-j2ee-1.1-SNAPSHOT.jar: 
.................... (29K)
Uploading to geronimo/poms/geronimo-j2ee-1.1-SNAPSHOT.pom: 
.................... (12K)

+----------------------------------------
| geronimo and geronimo-plugins Geronimo :: J2EE Schema
| Memory: 14M/20M
+----------------------------------------
DEPRECATED: the default goal should be specified in the <build> section of project.xml instead of maven.xml
DEPRECATED: the default goal should be specified in the <build> section of project.xml instead of maven.xml

build:end:

build:start:

multiproject:install-callback:
    [echo] Running jar:install for Geronimo :: J2EE Schema
java:prepare-filesystem:

java:compile:
<depend closure="false" srcdir="1.4" dump="false" destdir="/home/continuum/continuum-1.0.2/apps/continuum/work/68/modules/j2ee-schema/target/classes"></depend>    [echo] Compiling to /home/continuum/continuum-1.0.2/apps/continuum/work/68/modules/j2ee-schema/target/classes

java:jar-resources:

test:prepare-filesystem:

test:test-resources:

test:compile:

test:test:
    [echo] NOTICE: Skipping tests; they seem to have passed already
    [echo] No tests to run.
Running post goal: test:test

jar:jar:

jar:install:
    [echo] Installing...
Uploading to geronimo/jars/geronimo-j2ee-schema-1.1-SNAPSHOT.jar: 
.................... (1501K)
Uploading to geronimo/poms/geronimo-j2ee-schema-1.1-SNAPSHOT.pom: 
.................... (11K)

+----------------------------------------
| geronimo and geronimo-plugins Geronimo :: Service :: Builder
| Memory: 17M/20M
+----------------------------------------
DEPRECATED: the default goal should be specified in the <build> section of project.xml instead of maven.xml
DEPRECATED: the default goal should be specified in the <build> section of project.xml instead of maven.xml

build:end:

Attempting to download geronimo-deployment-1.1-SNAPSHOT.jar.
Attempting to download geronimo-deploy-config-1.1-SNAPSHOT.jar.
Attempting to download geronimo-j2ee-1.1-SNAPSHOT.jar.
Attempting to download geronimo-j2ee-schema-1.1-SNAPSHOT.jar.
build:start:

multiproject:install-callback:
    [echo] Running jar:install for Geronimo :: Service :: Builder
java:prepare-filesystem:

java:compile:
<depend closure="false" srcdir="1.4" dump="false" destdir="/home/continuum/continuum-1.0.2/apps/continuum/work/68/modules/service-builder/target/classes"></depend>    [echo] Compiling to /home/continuum/continuum-1.0.2/apps/continuum/work/68/modules/service-builder/target/classes

java:jar-resources:

test:prepare-filesystem:

test:test-resources:

test:compile:

test:test:
    [echo] NOTICE: Skipping tests; they seem to have passed already
    [echo] No tests to run.
Running post goal: test:test

jar:jar:

jar:install:
    [echo] Installing...
Uploading to geronimo/jars/geronimo-service-builder-1.1-SNAPSHOT.jar: 
.................... (179K)
Uploading to geronimo/poms/geronimo-service-builder-1.1-SNAPSHOT.pom: 
.................... (12K)

+----------------------------------------
| geronimo and geronimo-plugins Geronimo :: Maven Dependency Plugin
| Memory: 19M/20M
+----------------------------------------
DEPRECATED: the default goal should be specified in the <build> section of project.xml instead of maven.xml

build:end:

Attempting to download geronimo-service-builder-1.1-SNAPSHOT.jar.
Artifact /geronimo/jars/geronimo-service-builder-1.1-SNAPSHOT.jar doesn't exist in remote repository, but it exists locally.
build:start:

multiproject:install-callback:
    [echo] Running plugin:repository-install for Geronimo :: Maven Dependency Plugin
plugin:plugin:
java:prepare-filesystem:

java:compile:
    [echo] Compiling to /home/continuum/continuum-1.0.2/apps/continuum/work/68/plugins/geronimo-dependency-plugin/target/classes

java:jar-resources:

test:prepare-filesystem:

test:test-resources:

test:compile:
    [echo] No test source files to compile.

test:test:
    [echo] No tests to run.

jar:jar:


plugin:repository-install:
    [echo] Installing...
Uploading to geronimo/plugins/geronimo-dependency-plugin-1.1.0-1.jar: 
.................... (9K)
Uploading to geronimo/poms/geronimo-dependency-plugin-1.1.0-1.pom: 
.................... (1K)

+----------------------------------------
| geronimo and geronimo-plugins Geronimo :: Naming
| Memory: 19M/20M
+----------------------------------------
DEPRECATED: the default goal should be specified in the <build> section of project.xml instead of maven.xml
DEPRECATED: the default goal should be specified in the <build> section of project.xml instead of maven.xml

build:end:

build:start:

multiproject:install-callback:
    [echo] Running jar:install for Geronimo :: Naming
java:prepare-filesystem:

java:compile:
<depend closure="false" srcdir="1.4" dump="false" destdir="/home/continuum/continuum-1.0.2/apps/continuum/work/68/modules/naming/target/classes"></depend>    [echo] Compiling to /home/continuum/continuum-1.0.2/apps/continuum/work/68/modules/naming/target/classes

java:jar-resources:

test:prepare-filesystem:

test:test-resources:

test:compile:

test:test:
    [echo] NOTICE: Skipping tests; they seem to have passed already
    [echo] No tests to run.
Running post goal: test:test

jar:jar:

jar:install:
    [echo] Installing...
Uploading to geronimo/jars/geronimo-naming-1.1-SNAPSHOT.jar: 
.................... (46K)
Uploading to geronimo/poms/geronimo-naming-1.1-SNAPSHOT.pom: 
.................... (10K)

+----------------------------------------
| geronimo and geronimo-plugins Geronimo :: Security
| Memory: 20M/20M
+----------------------------------------
DEPRECATED: the default goal should be specified in the <build> section of project.xml instead of maven.xml
DEPRECATED: the default goal should be specified in the <build> section of project.xml instead of maven.xml

build:end:

build:start:

multiproject:install-callback:
    [echo] Running jar:install for Geronimo :: Security
java:prepare-filesystem:

java:compile:
<depend closure="false" srcdir="1.4" dump="false" destdir="/home/continuum/continuum-1.0.2/apps/continuum/work/68/modules/security/target/classes"></depend>    [echo] Compiling to /home/continuum/continuum-1.0.2/apps/continuum/work/68/modules/security/target/classes

java:jar-resources:

test:prepare-filesystem:

test:test-resources:
Running post goal: test:test-resources
    [delete] Deleting directory /home/continuum/continuum-1.0.2/apps/continuum/work/68/modules/security/target/database
    [mkdir] Created dir: /home/continuum/continuum-1.0.2/apps/continuum/work/68/modules/security/target/database

test:compile:

test:test:
    [echo] NOTICE: Skipping tests; they seem to have passed already
    [echo] No tests to run.
Running post goal: test:test

jar:jar:

jar:install:
    [echo] Installing...
Uploading to geronimo/jars/geronimo-security-1.1-SNAPSHOT.jar: 
.................... (183K)
Uploading to geronimo/poms/geronimo-security-1.1-SNAPSHOT.pom: 
.................... (13K)

+----------------------------------------
| geronimo and geronimo-plugins Geronimo :: Web Services
| Memory: 14M/22M
+----------------------------------------
DEPRECATED: the default goal should be specified in the <build> section of project.xml instead of maven.xml

build:end:

build:start:

multiproject:install-callback:
    [echo] Running jar:install for Geronimo :: Web Services
java:prepare-filesystem:

java:compile:
<depend closure="false" srcdir="1.4" dump="false" destdir="/home/continuum/continuum-1.0.2/apps/continuum/work/68/modules/webservices/target/classes"></depend>    [echo] Compiling to /home/continuum/continuum-1.0.2/apps/continuum/work/68/modules/webservices/target/classes

java:jar-resources:

test:prepare-filesystem:

test:test-resources:

test:compile:
    [echo] No test source files to compile.

test:test:
    [echo] NOTICE: Skipping tests; they seem to have passed already
    [echo] No tests to run.
Running post goal: test:test

jar:jar:

jar:install:
    [echo] Installing...
Uploading to geronimo/jars/geronimo-webservices-1.1-SNAPSHOT.jar: 
.................... (34K)
Uploading to geronimo/poms/geronimo-webservices-1.1-SNAPSHOT.pom: 
.................... (12K)

+----------------------------------------
| geronimo and geronimo-plugins Geronimo :: Axis
| Memory: 15M/22M
+----------------------------------------
DEPRECATED: the default goal should be specified in the <build> section of project.xml instead of maven.xml
DEPRECATED: the default goal should be specified in the <build> section of project.xml instead of maven.xml

build:end:

Attempting to download geronimo-naming-1.1-SNAPSHOT.jar.
Attempting to download geronimo-security-1.1-SNAPSHOT.jar.
Attempting to download geronimo-webservices-1.1-SNAPSHOT.jar.
build:start:

multiproject:install-callback:
    [echo] Running jar:install for Geronimo :: Axis
java:prepare-filesystem:

java:compile:
<depend closure="false" srcdir="1.4" dump="false" destdir="/home/continuum/continuum-1.0.2/apps/continuum/work/68/modules/axis/target/classes"></depend>    [echo] Compiling to /home/continuum/continuum-1.0.2/apps/continuum/work/68/modules/axis/target/classes
Running post goal: java:compile
geronimo:dependency:


java:jar-resources:
Copying 1 file to /home/continuum/continuum-1.0.2/apps/continuum/work/68/modules/axis/target/classes

test:prepare-filesystem:

test:test-resources:

test:compile:

test:test:
    [echo] NOTICE: Skipping tests; they seem to have passed already
    [echo] No tests to run.
Running post goal: test:test

jar:jar:
    [jar] Building jar: /home/continuum/continuum-1.0.2/apps/continuum/work/68/modules/axis/target/geronimo-axis-1.1-SNAPSHOT.jar

jar:install:
    [echo] Installing...
Uploading to geronimo/jars/geronimo-axis-1.1-SNAPSHOT.jar: 
.................... (42K)
Uploading to geronimo/poms/geronimo-axis-1.1-SNAPSHOT.pom: 
.................... (12K)

+----------------------------------------
| geronimo and geronimo-plugins Geronimo :: Test :: DDBeans
| Memory: 15M/24M
+----------------------------------------
DEPRECATED: the default goal should be specified in the <build> section of project.xml instead of maven.xml
DEPRECATED: the default goal should be specified in the <build> section of project.xml instead of maven.xml

build:end:

build:start:

multiproject:install-callback:
    [echo] Running jar:install for Geronimo :: Test :: DDBeans
java:prepare-filesystem:

java:compile:
<depend closure="false" srcdir="1.4" dump="false" destdir="/home/continuum/continuum-1.0.2/apps/continuum/work/68/modules/test-ddbean/target/classes"></depend>    [echo] Compiling to /home/continuum/continuum-1.0.2/apps/continuum/work/68/modules/test-ddbean/target/classes

java:jar-resources:

test:prepare-filesystem:

test:test-resources:

test:compile:

test:test:
    [echo] NOTICE: Skipping tests; they seem to have passed already
    [echo] No tests to run.
Running post goal: test:test

jar:jar:

jar:install:
    [echo] Installing...
Uploading to geronimo/jars/geronimo-test-ddbean-1.1-SNAPSHOT.jar: 
.................... (17K)
Uploading to geronimo/poms/geronimo-test-ddbean-1.1-SNAPSHOT.pom: 
.................... (10K)

+----------------------------------------
| geronimo and geronimo-plugins Geronimo :: Transaction
| Memory: 14M/24M
+----------------------------------------
DEPRECATED: the default goal should be specified in the <build> section of project.xml instead of maven.xml

build:end:

build:start:

multiproject:install-callback:
    [echo] Running jar:install for Geronimo :: Transaction
java:prepare-filesystem:

java:compile:
<depend closure="false" srcdir="1.4" dump="false" destdir="/home/continuum/continuum-1.0.2/apps/continuum/work/68/modules/transaction/target/classes"></depend>    [echo] Compiling to /home/continuum/continuum-1.0.2/apps/continuum/work/68/modules/transaction/target/classes

java:jar-resources:

test:prepare-filesystem:

test:test-resources:

test:compile:

test:test:
    [echo] NOTICE: Skipping tests; they seem to have passed already
    [echo] No tests to run.
Running post goal: test:test

jar:jar:

jar:install:
    [echo] Installing...
Uploading to geronimo/jars/geronimo-transaction-1.1-SNAPSHOT.jar: 
.................... (73K)
Uploading to geronimo/poms/geronimo-transaction-1.1-SNAPSHOT.pom: 
.................... (12K)

+----------------------------------------
| geronimo and geronimo-plugins Geronimo :: Connector
| Memory: 15M/24M
+----------------------------------------
DEPRECATED: the default goal should be specified in the <build> section of project.xml instead of maven.xml
DEPRECATED: the default goal should be specified in the <build> section of project.xml instead of maven.xml

build:end:

Attempting to download geronimo-transaction-1.1-SNAPSHOT.jar.
build:start:

multiproject:install-callback:
    [echo] Running jar:install for Geronimo :: Connector
java:prepare-filesystem:

java:compile:
<depend closure="false" srcdir="1.4" dump="false" destdir="/home/continuum/continuum-1.0.2/apps/continuum/work/68/modules/connector/target/classes"></depend>    [echo] Compiling to /home/continuum/continuum-1.0.2/apps/continuum/work/68/modules/connector/target/classes

java:jar-resources:

test:prepare-filesystem:

test:test-resources:

test:compile:

test:test:
    [echo] NOTICE: Skipping tests; they seem to have passed already
    [echo] No tests to run.
Running post goal: test:test

jar:jar:

jar:install:
    [echo] Installing...
Uploading to geronimo/jars/geronimo-connector-1.1-SNAPSHOT.jar: 
.................... (130K)
Uploading to geronimo/poms/geronimo-connector-1.1-SNAPSHOT.pom: 
.................... (13K)

+----------------------------------------
| geronimo and geronimo-plugins Geronimo :: Security :: Builder
| Memory: 17M/24M
+----------------------------------------
DEPRECATED: the default goal should be specified in the <build> section of project.xml instead of maven.xml
DEPRECATED: the default goal should be specified in the <build> section of project.xml instead of maven.xml

build:end:

build:start:

multiproject:install-callback:
    [echo] Running jar:install for Geronimo :: Security :: Builder
java:prepare-filesystem:

java:compile:
<depend closure="false" srcdir="1.4" dump="false" destdir="/home/continuum/continuum-1.0.2/apps/continuum/work/68/modules/security-builder/target/classes"></depend>    [echo] Compiling to /home/continuum/continuum-1.0.2/apps/continuum/work/68/modules/security-builder/target/classes

java:jar-resources:

test:prepare-filesystem:

test:test-resources:
Running post goal: test:test-resources
    [delete] Deleting directory /home/continuum/continuum-1.0.2/apps/continuum/work/68/modules/security-builder/target/database
    [mkdir] Created dir: /home/continuum/continuum-1.0.2/apps/continuum/work/68/modules/security-builder/target/database

test:compile:
    [echo] No test source files to compile.

test:test:
    [echo] NOTICE: Skipping tests; they seem to have passed already
    [echo] No tests to run.
Running post goal: test:test

jar:jar:

jar:install:
    [echo] Installing...
Uploading to geronimo/jars/geronimo-security-builder-1.1-SNAPSHOT.jar: 
.................... (172K)
Uploading to geronimo/poms/geronimo-security-builder-1.1-SNAPSHOT.pom: 
.................... (12K)

+----------------------------------------
| geronimo and geronimo-plugins Geronimo :: J2EE
| Memory: 16M/24M
+----------------------------------------
DEPRECATED: the default goal should be specified in the <build> section of project.xml instead of maven.xml
DEPRECATED: the default goal should be specified in the <build> section of project.xml instead of maven.xml

build:end:

Attempting to download geronimo-security-builder-1.1-SNAPSHOT.jar.
build:start:

multiproject:install-callback:
    [echo] Running jar:install for Geronimo :: J2EE
java:prepare-filesystem:

java:compile:
<depend closure="false" srcdir="1.4" dump="false" destdir="/home/continuum/continuum-1.0.2/apps/continuum/work/68/modules/j2ee-builder/target/classes"></depend>    [echo] Compiling to /home/continuum/continuum-1.0.2/apps/continuum/work/68/modules/j2ee-builder/target/classes
    [javac] Compiling 1 source file to /home/continuum/continuum-1.0.2/apps/continuum/work/68/modules/j2ee-builder/target/classes

java:jar-resources:

test:prepare-filesystem:

test:test-resources:

test:compile:
setupEar:

setupEar:

setupUnpackedEar:
setupBaseUnpackedEar:

setupBaseUnpackedEar:

setupBaseUnpackedEar:



test:test:
    [junit] Running org.apache.geronimo.j2ee.deployment.EARConfigBuilderTest
    [junit] Tests run: 64, Failures: 0, Errors: 0, Time elapsed: 2 sec
    [junit] Running org.apache.geronimo.j2ee.deployment.EJBRefContextTest
    [junit] Tests run: 1, Failures: 0, Errors: 0, Time elapsed: 0.053 sec
Running post goal: test:test

jar:jar:
    [jar] Building jar: /home/continuum/continuum-1.0.2/apps/continuum/work/68/modules/j2ee-builder/target/geronimo-j2ee-builder-1.1-SNAPSHOT.jar

jar:install:
    [echo] Installing...
Uploading to geronimo/jars/geronimo-j2ee-builder-1.1-SNAPSHOT.jar: 
.................... (90K)
Uploading to geronimo/poms/geronimo-j2ee-builder-1.1-SNAPSHOT.pom: 
.................... (13K)

+----------------------------------------
| geronimo and geronimo-plugins Geronimo :: Naming :: Builder
| Memory: 18M/25M
+----------------------------------------
DEPRECATED: the default goal should be specified in the <build> section of project.xml instead of maven.xml
DEPRECATED: the default goal should be specified in the <build> section of project.xml instead of maven.xml

build:end:

Attempting to download geronimo-j2ee-builder-1.1-SNAPSHOT.jar.
build:start:

multiproject:install-callback:
    [echo] Running jar:install for Geronimo :: Naming :: Builder
java:prepare-filesystem:

java:compile:
<depend closure="false" srcdir="1.4" dump="false" destdir="/home/continuum/continuum-1.0.2/apps/continuum/work/68/modules/naming-builder/target/classes"></depend>    [echo] Compiling to /home/continuum/continuum-1.0.2/apps/continuum/work/68/modules/naming-builder/target/classes

java:jar-resources:

test:prepare-filesystem:

test:test-resources:

test:compile:

test:test:
    [echo] NOTICE: Skipping tests; they seem to have passed already
    [echo] No tests to run.
Running post goal: test:test

jar:jar:

jar:install:
    [echo] Installing...
Uploading to geronimo/jars/geronimo-naming-builder-1.1-SNAPSHOT.jar: 
.................... (160K)
Uploading to geronimo/poms/geronimo-naming-builder-1.1-SNAPSHOT.pom: 
.................... (13K)

+----------------------------------------
| geronimo and geronimo-plugins Geronimo :: Connector :: Builder
| Memory: 18M/25M
+----------------------------------------
DEPRECATED: the default goal should be specified in the <build> section of project.xml instead of maven.xml
DEPRECATED: the default goal should be specified in the <build> section of project.xml instead of maven.xml

build:end:

Attempting to download geronimo-test-ddbean-1.1-SNAPSHOT.jar.
Attempting to download geronimo-connector-1.1-SNAPSHOT.jar.
Attempting to download geronimo-naming-builder-1.1-SNAPSHOT.jar.
build:start:

multiproject:install-callback:
    [echo] Running jar:install for Geronimo :: Connector :: Builder
java:prepare-filesystem:

java:compile:
<depend closure="false" srcdir="1.4" dump="false" destdir="/home/continuum/continuum-1.0.2/apps/continuum/work/68/modules/connector-builder/target/classes"></depend>    [echo] Compiling to /home/continuum/continuum-1.0.2/apps/continuum/work/68/modules/connector-builder/target/classes

java:jar-resources:

test:prepare-filesystem:

test:test-resources:

test:compile:
    [javac] Compiling 1 source file to /home/continuum/continuum-1.0.2/apps/continuum/work/68/modules/connector-builder/target/test-classes

test:test:
    [junit] Running org.apache.geronimo.connector.deployment.ConnectorModuleBuilderTest
    [junit] Tests run: 10, Failures: 0, Errors: 0, Time elapsed: 5.689 sec
    [junit] Running org.apache.geronimo.connector.deployment.PlanParsingTest
    [junit] Tests run: 7, Failures: 0, Errors: 0, Time elapsed: 1.378 sec
    [junit] Running org.apache.geronimo.connector.deployment.RAR_1_0DConfigBeanTest
    [junit] Tests run: 1, Failures: 0, Errors: 0, Time elapsed: 0.354 sec
    [junit] Running org.apache.geronimo.connector.deployment.RAR_1_5DConfigBeanTest
    [junit] Tests run: 1, Failures: 0, Errors: 0, Time elapsed: 0.351 sec
    [junit] Running org.apache.geronimo.connector.deployment.jsr88.Connector15DCBTest
    [junit] Tests run: 4, Failures: 0, Errors: 0, Time elapsed: 2.743 sec
Running post goal: test:test

jar:jar:

jar:install:
    [echo] Installing...
Uploading to geronimo/jars/geronimo-connector-builder-1.1-SNAPSHOT.jar: 
.................... (202K)
Uploading to geronimo/poms/geronimo-connector-builder-1.1-SNAPSHOT.pom: 
.................... (15K)

+----------------------------------------
| geronimo and geronimo-plugins Geronimo :: Axis :: Builder
| Memory: 17M/28M
+----------------------------------------
DEPRECATED: the default goal should be specified in the <build> section of project.xml instead of maven.xml
DEPRECATED: the default goal should be specified in the <build> section of project.xml instead of maven.xml

build:end:

Attempting to download geronimo-axis-1.1-SNAPSHOT.jar.
Attempting to download geronimo-connector-builder-1.1-SNAPSHOT.jar.
build:start:

multiproject:install-callback:
    [echo] Running jar:install for Geronimo :: Axis :: Builder
java:prepare-filesystem:

java:compile:
<depend closure="false" srcdir="1.4" dump="false" destdir="/home/continuum/continuum-1.0.2/apps/continuum/work/68/modules/axis-builder/target/classes"></depend>    [echo] Compiling to /home/continuum/continuum-1.0.2/apps/continuum/work/68/modules/axis-builder/target/classes

java:jar-resources:

test:prepare-filesystem:

test:test-resources:

test:compile:

test:test:
    [echo] NOTICE: Skipping tests; they seem to have passed already
    [echo] No tests to run.
Running post goal: test:test

jar:jar:

jar:install:
    [echo] Installing...
Uploading to geronimo/jars/geronimo-axis-builder-1.1-SNAPSHOT.jar: 
.................... (218K)
Uploading to geronimo/poms/geronimo-axis-builder-1.1-SNAPSHOT.pom: 
.................... (15K)

+----------------------------------------
| geronimo and geronimo-plugins Geronimo :: Client
| Memory: 18M/28M
+----------------------------------------
DEPRECATED: the default goal should be specified in the <build> section of project.xml instead of maven.xml

build:end:

build:start:

multiproject:install-callback:
    [echo] Running jar:install for Geronimo :: Client
java:prepare-filesystem:

java:compile:
<depend closure="false" srcdir="1.4" dump="false" destdir="/home/continuum/continuum-1.0.2/apps/continuum/work/68/modules/client/target/classes"></depend>    [echo] Compiling to /home/continuum/continuum-1.0.2/apps/continuum/work/68/modules/client/target/classes

java:jar-resources:

test:prepare-filesystem:

test:test-resources:

test:compile:
    [echo] No test source files to compile.

test:test:
    [echo] NOTICE: Skipping tests; they seem to have passed already
    [echo] No tests to run.
Running post goal: test:test

jar:jar:

jar:install:
    [echo] Installing...
Uploading to geronimo/jars/geronimo-client-1.1-SNAPSHOT.jar: 
.................... (14K)
Uploading to geronimo/poms/geronimo-client-1.1-SNAPSHOT.pom: 
.................... (12K)

+----------------------------------------
| geronimo and geronimo-plugins Geronimo :: Client Builder
| Memory: 20M/28M
+----------------------------------------
DEPRECATED: the default goal should be specified in the <build> section of project.xml instead of maven.xml
DEPRECATED: the default goal should be specified in the <build> section of project.xml instead of maven.xml

build:end:

Attempting to download geronimo-client-1.1-SNAPSHOT.jar.
build:start:

multiproject:install-callback:
    [echo] Running jar:install for Geronimo :: Client Builder
java:prepare-filesystem:

java:compile:
<depend closure="false" srcdir="1.4" dump="false" destdir="/home/continuum/continuum-1.0.2/apps/continuum/work/68/modules/client-builder/target/classes"></depend>    [echo] Compiling to /home/continuum/continuum-1.0.2/apps/continuum/work/68/modules/client-builder/target/classes

java:jar-resources:

test:prepare-filesystem:

test:test-resources:

test:compile:

test:test:
    [echo] NOTICE: Skipping tests; they seem to have passed already
    [echo] No tests to run.
Running post goal: test:test

jar:jar:

jar:install:
    [echo] Installing...
Uploading to geronimo/jars/geronimo-client-builder-1.1-SNAPSHOT.jar: 
.................... (46K)
Uploading to geronimo/poms/geronimo-client-builder-1.1-SNAPSHOT.pom: 
.................... (14K)

+----------------------------------------
| geronimo and geronimo-plugins Geronimo :: Console Web
| Memory: 21M/28M
+----------------------------------------
DEPRECATED: the default goal should be specified in the <build> section of project.xml instead of maven.xml
DEPRECATED: the default goal should be specified in the <build> section of project.xml instead of maven.xml

build:end:

build:start:

multiproject:install-callback:
    [echo] Running jar:install for Geronimo :: Console Web
java:prepare-filesystem:

java:compile:
<depend closure="false" srcdir="1.4" dump="false" destdir="/home/continuum/continuum-1.0.2/apps/continuum/work/68/modules/console-web/target/classes"></depend>    [echo] Compiling to /home/continuum/continuum-1.0.2/apps/continuum/work/68/modules/console-web/target/classes

java:jar-resources:

test:prepare-filesystem:

test:test-resources:

test:compile:
    [echo] No test source files to compile.

test:test:
    [echo] NOTICE: Skipping tests; they seem to have passed already
    [echo] No tests to run.
Running post goal: test:test

jar:jar:

jar:install:
    [echo] Installing...
Uploading to geronimo/jars/geronimo-console-web-1.1-SNAPSHOT.jar: 
.................... (17K)
Uploading to geronimo/poms/geronimo-console-web-1.1-SNAPSHOT.pom: 
.................... (11K)

+----------------------------------------
| geronimo and geronimo-plugins Geronimo :: Configuration Converter
| Memory: 20M/28M
+----------------------------------------
DEPRECATED: the default goal should be specified in the <build> section of project.xml instead of maven.xml
DEPRECATED: the default goal should be specified in the <build> section of project.xml instead of maven.xml

build:end:

build:start:

multiproject:install-callback:
    [echo] Running jar:install for Geronimo :: Configuration Converter
java:prepare-filesystem:

java:compile:
<depend closure="false" srcdir="1.4" dump="false" destdir="/home/continuum/continuum-1.0.2/apps/continuum/work/68/modules/converter/target/classes"></depend>    [echo] Compiling to /home/continuum/continuum-1.0.2/apps/continuum/work/68/modules/converter/target/classes

java:jar-resources:

test:prepare-filesystem:

test:test-resources:

test:compile:
    [echo] No test source files to compile.

test:test:
    [echo] NOTICE: Skipping tests; they seem to have passed already
    [echo] No tests to run.
Running post goal: test:test

jar:jar:

jar:install:
    [echo] Installing...
Uploading to geronimo/jars/geronimo-converter-1.1-SNAPSHOT.jar: 
.................... (25K)
Uploading to geronimo/poms/geronimo-converter-1.1-SNAPSHOT.pom: 
.................... (11K)

+----------------------------------------
| geronimo and geronimo-plugins Geronimo :: Web :: Builder
| Memory: 22M/28M
+----------------------------------------
DEPRECATED: the default goal should be specified in the <build> section of project.xml instead of maven.xml
DEPRECATED: the default goal should be specified in the <build> section of project.xml instead of maven.xml

build:end:

build:start:

multiproject:install-callback:
    [echo] Running jar:install for Geronimo :: Web :: Builder
java:prepare-filesystem:

java:compile:
<depend closure="false" srcdir="1.4" dump="false" destdir="/home/continuum/continuum-1.0.2/apps/continuum/work/68/modules/web-builder/target/classes"></depend>    [echo] Compiling to /home/continuum/continuum-1.0.2/apps/continuum/work/68/modules/web-builder/target/classes

java:jar-resources:

test:prepare-filesystem:

test:test-resources:

test:compile:

test:test:
    [echo] NOTICE: Skipping tests; they seem to have passed already
    [echo] No tests to run.
Running post goal: test:test

jar:jar:

jar:install:
    [echo] Installing...
Uploading to geronimo/jars/geronimo-web-builder-1.1-SNAPSHOT.jar: 
.................... (46K)
Uploading to geronimo/poms/geronimo-web-builder-1.1-SNAPSHOT.pom: 
.................... (13K)

+----------------------------------------
| geronimo and geronimo-plugins Geronimo :: Deploy :: JSR-88
| Memory: 22M/28M
+----------------------------------------
DEPRECATED: the default goal should be specified in the <build> section of project.xml instead of maven.xml
DEPRECATED: the default goal should be specified in the <build> section of project.xml instead of maven.xml

build:end:

Attempting to download geronimo-web-builder-1.1-SNAPSHOT.jar.
build:start:

multiproject:install-callback:
    [echo] Running jar:install for Geronimo :: Deploy :: JSR-88
java:prepare-filesystem:

java:compile:
<depend closure="false" srcdir="1.4" dump="false" destdir="/home/continuum/continuum-1.0.2/apps/continuum/work/68/modules/deploy-jsr88/target/classes"></depend>    [echo] Compiling to /home/continuum/continuum-1.0.2/apps/continuum/work/68/modules/deploy-jsr88/target/classes

java:jar-resources:

test:prepare-filesystem:

test:test-resources:

test:compile:

test:test:
    [echo] NOTICE: Skipping tests; they seem to have passed already
    [echo] No tests to run.
Running post goal: test:test

jar:jar:
    [echo] Generating Manifest file for JSR88-Deployer

jar:install:
    [echo] Installing...
Uploading to geronimo/jars/geronimo-deploy-jsr88-1.1-SNAPSHOT.jar: 
.................... (64K)
Uploading to geronimo/poms/geronimo-deploy-jsr88-1.1-SNAPSHOT.pom: 
.................... (13K)

+----------------------------------------
| geronimo and geronimo-plugins Geronimo :: Deploy :: CLI Tool
| Memory: 26M/28M
+----------------------------------------
DEPRECATED: the default goal should be specified in the <build> section of project.xml instead of maven.xml
DEPRECATED: the default goal should be specified in the <build> section of project.xml instead of maven.xml

build:end:

Attempting to download geronimo-deploy-jsr88-1.1-SNAPSHOT.jar.
build:start:

multiproject:install-callback:
    [echo] Running jar:install for Geronimo :: Deploy :: CLI Tool
java:prepare-filesystem:

java:compile:
<depend closure="false" srcdir="1.4" dump="false" destdir="/home/continuum/continuum-1.0.2/apps/continuum/work/68/modules/deploy-tool/target/classes"></depend>    [echo] Compiling to /home/continuum/continuum-1.0.2/apps/continuum/work/68/modules/deploy-tool/target/classes

java:jar-resources:

test:prepare-filesystem:

test:test-resources:

test:compile:

test:test:
    [echo] NOTICE: Skipping tests; they seem to have passed already
    [echo] No tests to run.
Running post goal: test:test

jar:jar:

jar:install:
    [echo] Installing...
Uploading to geronimo/jars/geronimo-deploy-tool-1.1-SNAPSHOT.jar: 
.................... (57K)
Uploading to geronimo/poms/geronimo-deploy-tool-1.1-SNAPSHOT.pom: 
.................... (12K)

+----------------------------------------
| geronimo and geronimo-plugins Geronimo :: Derby
| Memory: 27M/28M
+----------------------------------------
DEPRECATED: the default goal should be specified in the <build> section of project.xml instead of maven.xml

build:end:

build:start:

multiproject:install-callback:
    [echo] Running jar:install for Geronimo :: Derby
java:prepare-filesystem:

java:compile:
<depend closure="false" srcdir="1.4" dump="false" destdir="/home/continuum/continuum-1.0.2/apps/continuum/work/68/modules/derby/target/classes"></depend>    [echo] Compiling to /home/continuum/continuum-1.0.2/apps/continuum/work/68/modules/derby/target/classes

java:jar-resources:

test:prepare-filesystem:

test:test-resources:

test:compile:

test:test:
    [echo] NOTICE: Skipping tests; they seem to have passed already
    [echo] No tests to run.
Running post goal: test:test

jar:jar:

jar:install:
    [echo] Installing...
Uploading to geronimo/jars/geronimo-derby-1.1-SNAPSHOT.jar: 
.................... (12K)
Uploading to geronimo/poms/geronimo-derby-1.1-SNAPSHOT.pom: 
.................... (11K)

+----------------------------------------
| geronimo and geronimo-plugins Geronimo :: Directory
| Memory: 26M/28M
+----------------------------------------
DEPRECATED: the default goal should be specified in the <build> section of project.xml instead of maven.xml
DEPRECATED: the default goal should be specified in the <build> section of project.xml instead of maven.xml

build:end:

build:start:

multiproject:install-callback:
    [echo] Running jar:install for Geronimo :: Directory
java:prepare-filesystem:

java:compile:
<depend closure="false" srcdir="1.4" dump="false" destdir="/home/continuum/continuum-1.0.2/apps/continuum/work/68/modules/directory/target/classes"></depend>    [echo] Compiling to /home/continuum/continuum-1.0.2/apps/continuum/work/68/modules/directory/target/classes
Running post goal: java:compile
geronimo:dependency:


java:jar-resources:
Copying 1 file to /home/continuum/continuum-1.0.2/apps/continuum/work/68/modules/directory/target/classes

test:prepare-filesystem:

test:test-resources:

test:compile:

test:test:
    [echo] NOTICE: Skipping tests; they seem to have passed already
    [echo] No tests to run.
Running post goal: test:test

jar:jar:
    [jar] Building jar: /home/continuum/continuum-1.0.2/apps/continuum/work/68/modules/directory/target/geronimo-directory-1.1-SNAPSHOT.jar

jar:install:
    [echo] Installing...
Uploading to geronimo/jars/geronimo-directory-1.1-SNAPSHOT.jar: 
.................... (114K)
Uploading to geronimo/poms/geronimo-directory-1.1-SNAPSHOT.pom: 
.................... (16K)

+----------------------------------------
| geronimo and geronimo-plugins Geronimo :: Deploy :: Hot Deployer
| Memory: 17M/30M
+----------------------------------------
DEPRECATED: the default goal should be specified in the <build> section of project.xml instead of maven.xml
DEPRECATED: the default goal should be specified in the <build> section of project.xml instead of maven.xml

build:end:

Attempting to download geronimo-deploy-tool-1.1-SNAPSHOT.jar.
build:start:

multiproject:install-callback:
    [echo] Running jar:install for Geronimo :: Deploy :: Hot Deployer
java:prepare-filesystem:

java:compile:
<depend closure="false" srcdir="1.4" dump="false" destdir="/home/continuum/continuum-1.0.2/apps/continuum/work/68/modules/hot-deploy/target/classes"></depend>    [echo] Compiling to /home/continuum/continuum-1.0.2/apps/continuum/work/68/modules/hot-deploy/target/classes

java:jar-resources:

test:prepare-filesystem:

test:test-resources:

test:compile:
    [echo] No test source files to compile.

test:test:
    [echo] NOTICE: Skipping tests; they seem to have passed already
    [echo] No tests to run.
Running post goal: test:test

jar:jar:

jar:install:
    [echo] Installing...
Uploading to geronimo/jars/geronimo-hot-deploy-1.1-SNAPSHOT.jar: 
.................... (19K)
Uploading to geronimo/poms/geronimo-hot-deploy-1.1-SNAPSHOT.pom: 
.................... (12K)

+----------------------------------------
| geronimo and geronimo-plugins Geronimo :: Installer Processing
| Memory: 19M/30M
+----------------------------------------
DEPRECATED: the default goal should be specified in the <build> section of project.xml instead of maven.xml
DEPRECATED: the default goal should be specified in the <build> section of project.xml instead of maven.xml

build:end:

build:start:

multiproject:install-callback:
    [echo] Running jar:install for Geronimo :: Installer Processing
java:prepare-filesystem:

java:compile:
<depend closure="false" srcdir="1.4" dump="false" destdir="/home/continuum/continuum-1.0.2/apps/continuum/work/68/modules/installer-processing/target/classes"></depend>    [echo] Compiling to /home/continuum/continuum-1.0.2/apps/continuum/work/68/modules/installer-processing/target/classes
Running post goal: java:compile
geronimo:dependency:

    [echo] Maven local repo is: /home/continuum/.geronimo-1.1-maven/repository
    [echo] Maven build dir is: /home/continuum/continuum-1.0.2/apps/continuum/work/68/modules/installer-processing/target

java:jar-resources:

test:prepare-filesystem:

test:test-resources:

test:compile:
    [echo] No test source files to compile.

test:test:
    [echo] NOTICE: Skipping tests; they seem to have passed already
    [echo] No tests to run.
Running post goal: test:test

jar:jar:

jar:install:
    [echo] Installing...
Uploading to geronimo/jars/geronimo-installer-processing-1.1-SNAPSHOT.jar: 
.................... (15K)
Uploading to geronimo/poms/geronimo-installer-processing-1.1-SNAPSHOT.pom: 
.................... (10K)

+----------------------------------------
| geronimo and geronimo-plugins Geronimo :: Installer Support
| Memory: 19M/30M
+----------------------------------------
DEPRECATED: the default goal should be specified in the <build> section of project.xml instead of maven.xml
DEPRECATED: the default goal should be specified in the <build> section of project.xml instead of maven.xml

build:end:

build:start:

multiproject:install-callback:
    [echo] Running jar:install for Geronimo :: Installer Support
java:prepare-filesystem:

java:compile:
<depend closure="false" srcdir="1.4" dump="false" destdir="/home/continuum/continuum-1.0.2/apps/continuum/work/68/modules/installer-support/target/classes"></depend>    [echo] Compiling to /home/continuum/continuum-1.0.2/apps/continuum/work/68/modules/installer-support/target/classes
Running post goal: java:compile
geronimo:dependency:

    [echo] Maven local repo is: /home/continuum/.geronimo-1.1-maven/repository
    [echo] Maven build dir is: /home/continuum/continuum-1.0.2/apps/continuum/work/68/modules/installer-support/target
    [unjar] Expanding: /home/continuum/continuum-1.0.2/apps/continuum/work/68/modules/installer-support/target/standalone-compiler-custom-3.8.0.jar into /home/continuum/continuum-1.0.2/apps/continuum/work/68/modules/installer-support/target/tmp
    [echo] Built Geronimo custom IzPack installer jar
    [echo] Copying standalone-compiler-custom-3.8.0 to local repo

java:jar-resources:

test:prepare-filesystem:

test:test-resources:

test:compile:
    [echo] No test source files to compile.

test:test:
    [echo] NOTICE: Skipping tests; they seem to have passed already
    [echo] No tests to run.
Running post goal: test:test

jar:jar:

jar:install:
    [echo] Installing...
Uploading to geronimo/jars/geronimo-installer-support-1.1-SNAPSHOT.jar: 
.................... (50K)
Uploading to geronimo/poms/geronimo-installer-support-1.1-SNAPSHOT.pom: 
.................... (10K)

+----------------------------------------
| geronimo and geronimo-plugins Geronimo :: JavaMail Transport
| Memory: 20M/30M
+----------------------------------------
DEPRECATED: the default goal should be specified in the <build> section of project.xml instead of maven.xml

build:end:

build:start:

multiproject:install-callback:
    [echo] Running jar:install for Geronimo :: JavaMail Transport
java:prepare-filesystem:

java:compile:
<depend closure="false" srcdir="1.4" dump="false" destdir="/home/continuum/continuum-1.0.2/apps/continuum/work/68/modules/javamail-transport/target/classes"></depend>    [echo] Compiling to /home/continuum/continuum-1.0.2/apps/continuum/work/68/modules/javamail-transport/target/classes

java:jar-resources:

test:prepare-filesystem:

test:test-resources:

test:compile:
    [echo] No test source files to compile.

test:test:
    [echo] NOTICE: Skipping tests; they seem to have passed already
    [echo] No tests to run.
Running post goal: test:test

jar:jar:

jar:install:
    [echo] Installing...
Uploading to geronimo/jars/geronimo-javamail-transport-1.1-SNAPSHOT.jar: 
.................... (13K)
Uploading to geronimo/poms/geronimo-javamail-transport-1.1-SNAPSHOT.pom: 
.................... (10K)

+----------------------------------------
| geronimo and geronimo-plugins Geronimo :: Jetty
| Memory: 21M/30M
+----------------------------------------
DEPRECATED: the default goal should be specified in the <build> section of project.xml instead of maven.xml
DEPRECATED: the default goal should be specified in the <build> section of project.xml instead of maven.xml

build:end:

build:start:

multiproject:install-callback:
    [echo] Running jar:install for Geronimo :: Jetty
java:prepare-filesystem:

java:compile:
<depend closure="false" srcdir="1.4" dump="false" destdir="/home/continuum/continuum-1.0.2/apps/continuum/work/68/modules/jetty/target/classes"></depend>    [echo] Compiling to /home/continuum/continuum-1.0.2/apps/continuum/work/68/modules/jetty/target/classes
Running post goal: java:compile
geronimo:dependency:


java:jar-resources:
Copying 1 file to /home/continuum/continuum-1.0.2/apps/continuum/work/68/modules/jetty/target/classes

test:prepare-filesystem:

test:test-resources:

test:compile:

test:test:
    [echo] NOTICE: Skipping tests; they seem to have passed already
    [echo] No tests to run.
Running post goal: test:test

jar:jar:
    [jar] Building jar: /home/continuum/continuum-1.0.2/apps/continuum/work/68/modules/jetty/target/geronimo-jetty-1.1-SNAPSHOT.jar

jar:install:
    [echo] Installing...
Uploading to geronimo/jars/geronimo-jetty-1.1-SNAPSHOT.jar: 
.................... (81K)
Uploading to geronimo/poms/geronimo-jetty-1.1-SNAPSHOT.pom: 
.................... (16K)

+----------------------------------------
| geronimo and geronimo-plugins Geronimo :: Jetty :: Builder
| Memory: 21M/30M
+----------------------------------------
DEPRECATED: the default goal should be specified in the <build> section of project.xml instead of maven.xml
DEPRECATED: the default goal should be specified in the <build> section of project.xml instead of maven.xml

build:end:

Attempting to download geronimo-jetty-1.1-SNAPSHOT.jar.
build:start:

multiproject:install-callback:
    [echo] Running jar:install for Geronimo :: Jetty :: Builder
java:prepare-filesystem:

java:compile:
<depend closure="false" srcdir="1.4" dump="false" destdir="/home/continuum/continuum-1.0.2/apps/continuum/work/68/modules/jetty-builder/target/classes"></depend>    [echo] Compiling to /home/continuum/continuum-1.0.2/apps/continuum/work/68/modules/jetty-builder/target/classes

java:jar-resources:

test:prepare-filesystem:

test:test-resources:

test:compile:

test:test:
    [echo] NOTICE: Skipping tests; they seem to have passed already
    [echo] No tests to run.
Running post goal: test:test

jar:jar:

jar:install:
    [echo] Installing...
Uploading to geronimo/jars/geronimo-jetty-builder-1.1-SNAPSHOT.jar: 
.................... (64K)
Uploading to geronimo/poms/geronimo-jetty-builder-1.1-SNAPSHOT.pom: 
.................... (18K)

+----------------------------------------
| geronimo and geronimo-plugins Geronimo :: JMX Remoting
| Memory: 24M/30M
+----------------------------------------
DEPRECATED: the default goal should be specified in the <build> section of project.xml instead of maven.xml

build:end:

build:start:

multiproject:install-callback:
    [echo] Running jar:install for Geronimo :: JMX Remoting
java:prepare-filesystem:

java:compile:
<depend closure="false" srcdir="1.4" dump="false" destdir="/home/continuum/continuum-1.0.2/apps/continuum/work/68/modules/jmx-remoting/target/classes"></depend>    [echo] Compiling to /home/continuum/continuum-1.0.2/apps/continuum/work/68/modules/jmx-remoting/target/classes

java:jar-resources:

test:prepare-filesystem:

test:test-resources:

test:compile:

test:test:
    [echo] NOTICE: Skipping tests; they seem to have passed already
    [echo] No tests to run.
Running post goal: test:test

jar:jar:

jar:install:
    [echo] Installing...
Uploading to geronimo/jars/geronimo-jmxremoting-1.1-SNAPSHOT.jar: 
.................... (10K)
Uploading to geronimo/poms/geronimo-jmxremoting-1.1-SNAPSHOT.pom: 
.................... (11K)

+----------------------------------------
| geronimo and geronimo-plugins Geronimo :: Mail
| Memory: 24M/30M
+----------------------------------------
DEPRECATED: the default goal should be specified in the <build> section of project.xml instead of maven.xml

build:end:

build:start:

multiproject:install-callback:
    [echo] Running jar:install for Geronimo :: Mail
java:prepare-filesystem:

java:compile:
<depend closure="false" srcdir="1.4" dump="false" destdir="/home/continuum/continuum-1.0.2/apps/continuum/work/68/modules/mail/target/classes"></depend>    [echo] Compiling to /home/continuum/continuum-1.0.2/apps/continuum/work/68/modules/mail/target/classes

java:jar-resources:

test:prepare-filesystem:

test:test-resources:

test:compile:

test:test:
    [echo] NOTICE: Skipping tests; they seem to have passed already
    [echo] No tests to run.
Running post goal: test:test

jar:jar:

jar:install:
    [echo] Installing...
Uploading to geronimo/jars/geronimo-mail-1.1-SNAPSHOT.jar: 
.................... (21K)
Uploading to geronimo/poms/geronimo-mail-1.1-SNAPSHOT.pom: 
.................... (11K)

+----------------------------------------
| geronimo and geronimo-plugins Geronimo :: Scripts
| Memory: 24M/30M
+----------------------------------------
DEPRECATED: the default goal should be specified in the <build> section of project.xml instead of maven.xml

build:end:

build:start:

multiproject:install-callback:
    [echo] Running jar:install for Geronimo :: Scripts
java:prepare-filesystem:

java:compile:
    [echo] Compiling to /home/continuum/continuum-1.0.2/apps/continuum/work/68/modules/scripts/target/classes
    [echo] No java source files to compile.

java:jar-resources:

test:prepare-filesystem:

test:test-resources:

test:compile:
    [echo] No test source files to compile.

test:test:
    [echo] NOTICE: Skipping tests; they seem to have passed already
    [echo] No tests to run.
Running post goal: test:test

jar:jar:

jar:install:
    [echo] Installing...
Uploading to geronimo/jars/geronimo-scripts-1.1-SNAPSHOT.jar: 
.................... (3214K)
Uploading to geronimo/poms/geronimo-scripts-1.1-SNAPSHOT.pom: 
.................... (10K)

+----------------------------------------
| geronimo and geronimo-plugins Geronimo :: Timer
| Memory: 26M/30M
+----------------------------------------
DEPRECATED: the default goal should be specified in the <build> section of project.xml instead of maven.xml

build:end:

build:start:

multiproject:install-callback:
    [echo] Running jar:install for Geronimo :: Timer
java:prepare-filesystem:

java:compile:
<depend closure="false" srcdir="1.4" dump="false" destdir="/home/continuum/continuum-1.0.2/apps/continuum/work/68/modules/timer/target/classes"></depend>    [echo] Compiling to /home/continuum/continuum-1.0.2/apps/continuum/work/68/modules/timer/target/classes

java:jar-resources:

test:prepare-filesystem:

test:test-resources:

test:compile:

test:test:
    [echo] NOTICE: Skipping tests; they seem to have passed already
    [echo] No tests to run.
Running post goal: test:test

jar:jar:

jar:install:
    [echo] Installing...
Uploading to geronimo/jars/geronimo-timer-1.1-SNAPSHOT.jar: 
.................... (38K)
Uploading to geronimo/poms/geronimo-timer-1.1-SNAPSHOT.pom: 
.................... (12K)

+----------------------------------------
| geronimo and geronimo-plugins Geronimo :: Tomcat
| Memory: 26M/30M
+----------------------------------------
DEPRECATED: the default goal should be specified in the <build> section of project.xml instead of maven.xml
DEPRECATED: the default goal should be specified in the <build> section of project.xml instead of maven.xml

build:end:

build:start:

multiproject:install-callback:
    [echo] Running jar:install for Geronimo :: Tomcat
java:prepare-filesystem:

java:compile:
<depend closure="false" srcdir="1.4" dump="false" destdir="/home/continuum/continuum-1.0.2/apps/continuum/work/68/modules/tomcat/target/classes"></depend>    [echo] Compiling to /home/continuum/continuum-1.0.2/apps/continuum/work/68/modules/tomcat/target/classes
Running post goal: java:compile
geronimo:dependency:


java:jar-resources:
Copying 1 file to /home/continuum/continuum-1.0.2/apps/continuum/work/68/modules/tomcat/target/classes

test:prepare-filesystem:

test:test-resources:

test:compile:

test:test:
    [echo] NOTICE: Skipping tests; they seem to have passed already
    [echo] No tests to run.
Running post goal: test:test

jar:jar:
    [jar] Building jar: /home/continuum/continuum-1.0.2/apps/continuum/work/68/modules/tomcat/target/geronimo-tomcat-1.1-SNAPSHOT.jar

jar:install:
    [echo] Installing...
Uploading to geronimo/jars/geronimo-tomcat-1.1-SNAPSHOT.jar: 
.................... (130K)
Uploading to geronimo/poms/geronimo-tomcat-1.1-SNAPSHOT.pom: 
.................... (21K)

+----------------------------------------
| geronimo and geronimo-plugins Geronimo :: Tomcat :: Builder
| Memory: 28M/30M
+----------------------------------------
DEPRECATED: the default goal should be specified in the <build> section of project.xml instead of maven.xml
DEPRECATED: the default goal should be specified in the <build> section of project.xml instead of maven.xml

build:end:

Attempting to download geronimo-tomcat-1.1-SNAPSHOT.jar.
Attempting to download geronimo-axis-builder-1.1-SNAPSHOT.jar.
build:start:

multiproject:install-callback:
    [echo] Running jar:install for Geronimo :: Tomcat :: Builder
java:prepare-filesystem:

java:compile:
<depend closure="false" srcdir="1.4" dump="false" destdir="/home/continuum/continuum-1.0.2/apps/continuum/work/68/modules/tomcat-builder/target/classes"></depend>    [echo] Compiling to /home/continuum/continuum-1.0.2/apps/continuum/work/68/modules/tomcat-builder/target/classes

java:jar-resources:

test:prepare-filesystem:

test:test-resources:

test:compile:

test:test:
    [echo] NOTICE: Skipping tests; they seem to have passed already
    [echo] No tests to run.
Running post goal: test:test

jar:jar:

jar:install:
    [echo] Installing...
Uploading to geronimo/jars/geronimo-tomcat-builder-1.1-SNAPSHOT.jar: 
.................... (65K)
Uploading to geronimo/poms/geronimo-tomcat-builder-1.1-SNAPSHOT.pom: 
.................... (20K)

+----------------------------------------
| geronimo and geronimo-plugins Geronimo :: Upgrade
| Memory: 21M/35M
+----------------------------------------
DEPRECATED: the default goal should be specified in the <build> section of project.xml instead of maven.xml

build:end:

Attempting to download geronimo-client-builder-1.1-SNAPSHOT.jar.
Attempting to download geronimo-jetty-builder-1.1-SNAPSHOT.jar.
Attempting to download geronimo-tomcat-builder-1.1-SNAPSHOT.jar.
Attempting to download openejb-builder-2.1-SNAPSHOT.jar.
build:start:

multiproject:install-callback:
    [echo] Running jar:install for Geronimo :: Upgrade
java:prepare-filesystem:

java:compile:
<depend closure="false" srcdir="1.4" dump="false" destdir="/home/continuum/continuum-1.0.2/apps/continuum/work/68/modules/upgrade/target/classes"></depend>    [echo] Compiling to /home/continuum/continuum-1.0.2/apps/continuum/work/68/modules/upgrade/target/classes

java:jar-resources:

test:prepare-filesystem:

test:test-resources:

test:compile:

test:test:
    [echo] NOTICE: Skipping tests; they seem to have passed already
    [echo] No tests to run.
Running post goal: test:test

jar:jar:

jar:install:
    [echo] Installing...
Uploading to geronimo/jars/geronimo-upgrade-1.1-SNAPSHOT.jar: 
.................... (9K)
Uploading to geronimo/poms/geronimo-upgrade-1.1-SNAPSHOT.pom: 
.................... (11K)

+----------------------------------------
| geronimo and geronimo-plugins Geronimo :: Maven Assembly Plugin
| Memory: 21M/35M
+----------------------------------------
DEPRECATED: the default goal should be specified in the <build> section of project.xml instead of maven.xml

build:end:

build:start:

multiproject:install-callback:
    [echo] Running plugin:repository-install for Geronimo :: Maven Assembly Plugin
plugin:plugin:
java:prepare-filesystem:

java:compile:
    [echo] Compiling to /home/continuum/continuum-1.0.2/apps/continuum/work/68/plugins/geronimo-assembly-plugin/target/classes

java:jar-resources:

test:prepare-filesystem:

test:test-resources:

test:compile:
    [echo] No test source files to compile.

test:test:
    [echo] No tests to run.

jar:jar:


plugin:repository-install:
    [echo] Installing...
Uploading to geronimo/plugins/geronimo-assembly-plugin-1.1.0-9.jar: 
.................... (17K)
Uploading to geronimo/poms/geronimo-assembly-plugin-1.1.0-9.pom: 
.................... (1K)

+----------------------------------------
| geronimo and geronimo-plugins Geronimo :: Maven Deployment Plugin
| Memory: 21M/35M
+----------------------------------------
DEPRECATED: the default goal should be specified in the <build> section of project.xml instead of maven.xml

build:end:

build:start:

multiproject:install-callback:
    [echo] Running plugin:repository-install for Geronimo :: Maven Deployment Plugin
plugin:plugin:
java:prepare-filesystem:

java:compile:
    [echo] Compiling to /home/continuum/continuum-1.0.2/apps/continuum/work/68/plugins/geronimo-deployment-plugin/target/classes

java:jar-resources:

test:prepare-filesystem:

test:test-resources:

test:compile:
    [echo] No test source files to compile.

test:test:
    [echo] No tests to run.

jar:jar:


plugin:repository-install:
    [echo] Installing...
Uploading to geronimo/plugins/geronimo-deployment-plugin-1.1.0-1.jar: 
.................... (31K)
Uploading to geronimo/poms/geronimo-deployment-plugin-1.1.0-1.pom: 
.................... (3K)

+----------------------------------------
| geronimo and geronimo-plugins Geronimo :: IZPack Installer Build Plugin
| Memory: 21M/35M
+----------------------------------------
DEPRECATED: the default goal should be specified in the <build> section of project.xml instead of maven.xml

build:end:

build:start:

multiproject:install-callback:
    [echo] Running plugin:repository-install for Geronimo :: IZPack Installer Build Plugin
plugin:plugin:
java:prepare-filesystem:

java:compile:
    [echo] Compiling to /home/continuum/continuum-1.0.2/apps/continuum/work/68/plugins/geronimo-izpack-plugin/target/classes
    [echo] No java source files to compile.

java:jar-resources:

test:prepare-filesystem:

test:test-resources:

test:compile:
    [echo] No test source files to compile.

test:test:
    [echo] No tests to run.

jar:jar:


plugin:repository-install:
    [echo] Installing...
Uploading to geronimo/plugins/geronimo-izpack-plugin-1.1-SNAPSHOT.jar: 
.................... (7K)
Uploading to geronimo/poms/geronimo-izpack-plugin-1.1-SNAPSHOT.pom: 
.................... (1K)

+----------------------------------------
| geronimo and geronimo-plugins Geronimo :: Maven Packaging Plugin
| Memory: 22M/35M
+----------------------------------------
DEPRECATED: the default goal should be specified in the <build> section of project.xml instead of maven.xml

build:end:

build:start:

multiproject:install-callback:
    [echo] Running plugin:repository-install for Geronimo :: Maven Packaging Plugin
plugin:plugin:
java:prepare-filesystem:

java:compile:
    [echo] Compiling to /home/continuum/continuum-1.0.2/apps/continuum/work/68/plugins/geronimo-packaging-plugin/target/classes

java:jar-resources:

test:prepare-filesystem:

test:test-resources:

test:compile:

test:test:
    [junit] Running org.apache.geronimo.plugin.packaging.PlanProcessorTest
    [junit] Tests run: 1, Failures: 0, Errors: 0, Time elapsed: 0.871 sec

jar:jar:


plugin:repository-install:
    [echo] Installing...
Uploading to geronimo/plugins/geronimo-packaging-plugin-1.1.0-4.jar: 
.................... (28K)
Uploading to geronimo/poms/geronimo-packaging-plugin-1.1.0-4.pom: 
.................... (4K)


build:end:


Starting the reactor...
Our processing order:
OpenEJB :: Core
OpenEJB :: PK Generation :: Builder
OpenEJB :: Builder
+----------------------------------------
| openejb OpenEJB :: Core
| Memory: 24M/35M
+----------------------------------------
DEPRECATED: the default goal should be specified in the <build> section of project.xml instead of maven.xml
DEPRECATED: the default goal should be specified in the <build> section of project.xml instead of maven.xml
new2:
Attempting to download geronimo-timer-1.1-SNAPSHOT.jar.
Attempting to download geronimo-corba_2.3_spec-1.1-SNAPSHOT.jar.
build:start:

multiproject:install-callback:
    [echo] Running jar:install for OpenEJB :: Core
java:prepare-filesystem:

java:compile:
<depend closure="false" srcdir="1.4" dump="false" destdir="/home/continuum/continuum-1.0.2/apps/continuum/work/68/openejb/modules/core/target/classes"></depend>    [echo] Compiling to /home/continuum/continuum-1.0.2/apps/continuum/work/68/openejb/modules/core/target/classes
Running post goal: java:compile
geronimo:dependency:


java:jar-resources:

test:prepare-filesystem:

test:test-resources:

test:compile:

test:test:
    [echo] NOTICE: Skipping tests; they seem to have passed already
    [echo] No tests to run.
Running post goal: test:test

jar:jar:

jar:install:
    [echo] Installing...
Uploading to openejb/jars/openejb-core-2.1-SNAPSHOT.jar: 
.................... (1186K)
Uploading to openejb/poms/openejb-core-2.1-SNAPSHOT.pom: 
.................... (13K)

+----------------------------------------
| openejb OpenEJB :: PK Generation :: Builder
| Memory: 28M/35M
+----------------------------------------
DEPRECATED: the default goal should be specified in the <build> section of project.xml instead of maven.xml
DEPRECATED: the default goal should be specified in the <build> section of project.xml instead of maven.xml

build:end:

Attempting to download openejb-core-2.1-SNAPSHOT.jar.
build:start:

multiproject:install-callback:
    [echo] Running jar:install for OpenEJB :: PK Generation :: Builder
java:prepare-filesystem:

java:compile:
<depend closure="false" srcdir="1.4" dump="false" destdir="/home/continuum/continuum-1.0.2/apps/continuum/work/68/openejb/modules/pkgen-builder/target/classes"></depend>    [echo] Compiling to /home/continuum/continuum-1.0.2/apps/continuum/work/68/openejb/modules/pkgen-builder/target/classes

java:jar-resources:

test:prepare-filesystem:

test:test-resources:

test:compile:
    [echo] No test source files to compile.

test:test:
    [echo] NOTICE: Skipping tests; they seem to have passed already
    [echo] No tests to run.
Running post goal: test:test

jar:jar:

jar:install:
    [echo] Installing...
Uploading to openejb/jars/openejb-pkgen-builder-2.1-SNAPSHOT.jar: 
.................... (52K)
Uploading to openejb/poms/openejb-pkgen-builder-2.1-SNAPSHOT.pom: 
.................... (6K)

+----------------------------------------
| openejb OpenEJB :: Builder
| Memory: 28M/35M
+----------------------------------------
DEPRECATED: the default goal should be specified in the <build> section of project.xml instead of maven.xml
DEPRECATED: the default goal should be specified in the <build> section of project.xml instead of maven.xml

build:end:

Attempting to download openejb-pkgen-builder-2.1-SNAPSHOT.jar.
build:start:

multiproject:install-callback:
    [echo] Running jar:install for OpenEJB :: Builder
java:prepare-filesystem:

java:compile:
<depend closure="false" srcdir="1.4" dump="false" destdir="/home/continuum/continuum-1.0.2/apps/continuum/work/68/openejb/modules/openejb-builder/target/classes"></depend>    [echo] Compiling to /home/continuum/continuum-1.0.2/apps/continuum/work/68/openejb/modules/openejb-builder/target/classes

java:jar-resources:

test:prepare-filesystem:

test:test-resources:

test:compile:

test:test:
    [echo] NOTICE: Skipping tests; they seem to have passed already
    [echo] No tests to run.
Running post goal: test:test

jar:jar:

jar:install:
    [echo] Installing...
Uploading to openejb/jars/openejb-builder-2.1-SNAPSHOT.jar: 
.................... (605K)
Uploading to openejb/poms/openejb-builder-2.1-SNAPSHOT.pom: 
.................... (16K)


build:end:


Starting the reactor...
Our processing order:
Geronimo :: Console :: Common Code
Geronimo :: Console :: Portal Framework
Geronimo :: Console :: Standard Portlets
Geronimo :: Console :: Application EAR
DayTrader :: Core
DayTrader :: Derby Database
DayTrader :: WS Application Client
DayTrader :: EJBs
DayTrader :: Web Application
DayTrader :: Quote Streamer
DayTrader :: Enterprise Application
Geronimo :: Demo Webapp
Geronimo :: JMX Debug Webapp
Geronimo :: LDAP Demo Application
Geronimo :: The Magic G Ball Sample Application
Geronimo :: Remote Deploy GBean
Geronimo :: Remote Deploy Application
Geronimo :: UDDI-Server database
Geronimo :: UDDI-Server
Geronimo :: Welcome Application
+----------------------------------------
| applications Geronimo :: Console :: Common Code
| Memory: 31M/35M
+----------------------------------------
DEPRECATED: the default goal should be specified in the <build> section of project.xml instead of maven.xml
DEPRECATED: the default goal should be specified in the <build> section of project.xml instead of maven.xml
new3:
build:start:

multiproject:install-callback:
    [echo] Running jar:install for Geronimo :: Console :: Common Code
java:prepare-filesystem:

java:compile:
<depend closure="false" srcdir="1.4" dump="false" destdir="/home/continuum/continuum-1.0.2/apps/continuum/work/68/applications/console-core/target/classes"></depend>    [echo] Compiling to /home/continuum/continuum-1.0.2/apps/continuum/work/68/applications/console-core/target/classes
Running post goal: java:compile

java:jar-resources:

test:prepare-filesystem:

test:test-resources:

test:compile:
    [echo] No test source files to compile.

test:test:
    [echo] NOTICE: Skipping tests; they seem to have passed already
    [echo] No tests to run.
Running post goal: test:test

jar:jar:
    [jar] Building jar: /home/continuum/continuum-1.0.2/apps/continuum/work/68/applications/console-core/target/geronimo-console-core-1.1-SNAPSHOT.jar

jar:install:
    [echo] Installing...
Uploading to geronimo/jars/geronimo-console-core-1.1-SNAPSHOT.jar: 
.................... (40K)
Uploading to geronimo/poms/geronimo-console-core-1.1-SNAPSHOT.pom: 
.................... (13K)

+----------------------------------------
| applications Geronimo :: Console :: Portal Framework
| Memory: 33M/35M
+----------------------------------------
DEPRECATED: the default goal should be specified in the <build> section of project.xml instead of maven.xml
DEPRECATED: the default goal should be specified in the <build> section of project.xml instead of maven.xml

build:end:

Attempting to download geronimo-j2ee_1.4_spec-1.1-SNAPSHOT.jar.
build:start:

multiproject:install-callback:
    [echo] Running war:install for Geronimo :: Console :: Portal Framework
Tag library requested that is not present: 'caller' in plugin: 'maven-war-plugin-1.6.1'
war:init:

war:war-resources:
    [copy] Copying 1 file to /home/continuum/continuum-1.0.2/apps/continuum/work/68/applications/console-framework/target/geronimo-console-framework
    [copy] Copying 1 file to /home/continuum/continuum-1.0.2/apps/continuum/work/68/applications/console-framework/target/geronimo-console-framework/WEB-INF

java:prepare-filesystem:

java:compile:
<depend closure="false" srcdir="1.4" dump="false" destdir="/home/continuum/continuum-1.0.2/apps/continuum/work/68/applications/console-framework/target/classes"></depend>    [echo] Compiling to /home/continuum/continuum-1.0.2/apps/continuum/work/68/applications/console-framework/target/classes

java:jar-resources:

test:prepare-filesystem:

test:test-resources:

test:compile:
    [echo] No test source files to compile.

test:test:
    [echo] NOTICE: Skipping tests; they seem to have passed already
    [echo] No tests to run.
Running post goal: test:test

war:webapp:
    [echo] Assembling webapp geronimo-console-framework
    [copy] Copying 1 file to /home/continuum/continuum-1.0.2/apps/continuum/work/68/applications/console-framework/target/geronimo-console-framework/WEB-INF/classes
Running post goal: war:webapp
    [echo] Use classes.jar ? true
    [copy] Copying 2 files to /home/continuum/continuum-1.0.2/apps/continuum/work/68/applications/console-framework/target/work
    [jar] Building jar: /home/continuum/continuum-1.0.2/apps/continuum/work/68/applications/console-framework/target/geronimo-console-framework/WEB-INF/lib/classes.jar
    [delete] Deleting 2 files from /home/continuum/continuum-1.0.2/apps/continuum/work/68/applications/console-framework/target/geronimo-console-framework/WEB-INF/classes
    [delete] Deleted 5 directories from /home/continuum/continuum-1.0.2/apps/continuum/work/68/applications/console-framework/target/geronimo-console-framework/WEB-INF/classes
    [delete] Deleting 2 files from /home/continuum/continuum-1.0.2/apps/continuum/work/68/applications/console-framework/target/work
    [delete] Deleted 5 directories from /home/continuum/continuum-1.0.2/apps/continuum/work/68/applications/console-framework/target/work

war:war:
    [echo] Building WAR geronimo-console-framework
    [jar] Building jar: /home/continuum/continuum-1.0.2/apps/continuum/work/68/applications/console-framework/target/geronimo-console-framework-1.1-SNAPSHOT.war

war:install:
    [echo] Installing...
Uploading to geronimo/wars/geronimo-console-framework-1.1-SNAPSHOT.war: 
.................... (2461K)
Uploading to geronimo/poms/geronimo-console-framework-1.1-SNAPSHOT.pom: 
.................... (12K)

+----------------------------------------
| applications Geronimo :: Console :: Standard Portlets
| Memory: 33M/35M
+----------------------------------------
DEPRECATED: the default goal should be specified in the <build> section of project.xml instead of maven.xml
DEPRECATED: the default goal should be specified in the <build> section of project.xml instead of maven.xml

build:end:

Attempting to download geronimo-derby-1.1-SNAPSHOT.jar.
Attempting to download geronimo-converter-1.1-SNAPSHOT.jar.
Attempting to download activemq-core-3.2.4-SNAPSHOT.jar.
Attempting to download geronimo-console-core-1.1-SNAPSHOT.jar.
build:start:

multiproject:install-callback:
    [echo] Running war:install for Geronimo :: Console :: Standard Portlets
Tag library requested that is not present: 'caller' in plugin: 'maven-war-plugin-1.6.1'
war:init:

war:war-resources:
    [copy] Copying 1 file to /home/continuum/continuum-1.0.2/apps/continuum/work/68/applications/console-standard/target/geronimo-console-standard
    [copy] Copying 1 file to /home/continuum/continuum-1.0.2/apps/continuum/work/68/applications/console-standard/target/geronimo-console-standard/WEB-INF

java:prepare-filesystem:

java:compile:
<depend closure="false" srcdir="1.4" dump="false" destdir="/home/continuum/continuum-1.0.2/apps/continuum/work/68/applications/console-standard/target/classes"></depend>    [echo] Compiling to /home/continuum/continuum-1.0.2/apps/continuum/work/68/applications/console-standard/target/classes

java:jar-resources:

test:prepare-filesystem:

test:test-resources:

test:compile:

test:test:
    [echo] NOTICE: Skipping tests; they seem to have passed already
    [echo] No tests to run.
Running post goal: test:test

war:webapp:
    [echo] Assembling webapp geronimo-console-standard
    [copy] Copying 168 files to /home/continuum/continuum-1.0.2/apps/continuum/work/68/applications/console-standard/target/geronimo-console-standard/WEB-INF/classes
Running post goal: war:webapp
    [echo] Use classes.jar ? true
    [copy] Copying 170 files to /home/continuum/continuum-1.0.2/apps/continuum/work/68/applications/console-standard/target/work
    [jar] Building jar: /home/continuum/continuum-1.0.2/apps/continuum/work/68/applications/console-standard/target/geronimo-console-standard/WEB-INF/lib/classes.jar
    [delete] Deleting 170 files from /home/continuum/continuum-1.0.2/apps/continuum/work/68/applications/console-standard/target/geronimo-console-standard/WEB-INF/classes
    [delete] Deleted 33 directories from /home/continuum/continuum-1.0.2/apps/continuum/work/68/applications/console-standard/target/geronimo-console-standard/WEB-INF/classes
    [delete] Deleting 170 files from /home/continuum/continuum-1.0.2/apps/continuum/work/68/applications/console-standard/target/work
    [delete] Deleted 33 directories from /home/continuum/continuum-1.0.2/apps/continuum/work/68/applications/console-standard/target/work

war:war:
substitute:

    [echo] Building WAR geronimo-console-standard
    [jar] Building jar: /home/continuum/continuum-1.0.2/apps/continuum/work/68/applications/console-standard/target/geronimo-console-standard-1.1-SNAPSHOT.war

war:install:
    [echo] Installing...
Uploading to geronimo/wars/geronimo-console-standard-1.1-SNAPSHOT.war: 
.................... (3082K)
Uploading to geronimo/poms/geronimo-console-standard-1.1-SNAPSHOT.pom: 
.................... (17K)

+----------------------------------------
| applications Geronimo :: Console :: Application EAR
| Memory: 23M/38M
+----------------------------------------
DEPRECATED: the default goal should be specified in the <build> section of project.xml instead of maven.xml
DEPRECATED: the default goal should be specified in the <build> section of project.xml instead of maven.xml

build:end:

Attempting to download geronimo-console-framework-1.1-SNAPSHOT.war.
Attempting to download geronimo-console-standard-1.1-SNAPSHOT.war.
build:start:

multiproject:install-callback:
    [echo] Running ear:install for Geronimo :: Console :: Application EAR
ear:init:

ear:ear:
ear:generate-ear-descriptor:
    [echo] Generating /home/continuum/continuum-1.0.2/apps/continuum/work/68/applications/console-ear/target/application.xml

    [echo] Building EAR geronimo-console-1.1-SNAPSHOT.ear with appxml "/home/continuum/continuum-1.0.2/apps/continuum/work/68/applications/console-ear/target/application.xml"
    [ear] Building ear: /home/continuum/continuum-1.0.2/apps/continuum/work/68/applications/console-ear/target/geronimo-console-1.1-SNAPSHOT.ear

ear:install:
    [echo] Installing...
Uploading to geronimo/ears/geronimo-console-1.1-SNAPSHOT.ear: 
.................... (5516K)
Uploading to geronimo/poms/geronimo-console-1.1-SNAPSHOT.pom: 
.................... (12K)

+----------------------------------------
| applications DayTrader :: Core
| Memory: 26M/38M
+----------------------------------------
DEPRECATED: the default goal should be specified in the <build> section of project.xml instead of maven.xml
DEPRECATED: the default goal should be specified in the <build> section of project.xml instead of maven.xml

build:end:

build:start:

multiproject:install-callback:
    [echo] Running jar:install for DayTrader :: Core
java:prepare-filesystem:

java:compile:
<depend closure="false" srcdir="1.4" dump="false" destdir="/home/continuum/continuum-1.0.2/apps/continuum/work/68/applications/daytrader/core/target/classes"></depend>    [echo] Compiling to /home/continuum/continuum-1.0.2/apps/continuum/work/68/applications/daytrader/core/target/classes

java:jar-resources:

test:prepare-filesystem:

test:test-resources:

test:compile:

test:test:
    [echo] NOTICE: Skipping tests; they seem to have passed already
    [echo] No tests to run.
Running post goal: test:test

jar:jar:

jar:install:
    [echo] Installing...
Uploading to geronimo/jars/daytrader-core-1.1-SNAPSHOT.jar: 
.................... (1K)
Uploading to geronimo/poms/daytrader-core-1.1-SNAPSHOT.pom: 
.................... (10K)

+----------------------------------------
| applications DayTrader :: Derby Database
| Memory: 28M/38M
+----------------------------------------
DEPRECATED: the default goal should be specified in the <build> section of project.xml instead of maven.xml
DEPRECATED: the default goal should be specified in the <build> section of project.xml instead of maven.xml

build:end:

build:start:

multiproject:install-callback:
    [echo] Running jar:install for DayTrader :: Derby Database
java:prepare-filesystem:
init-database:
    [delete] Deleting directory /home/continuum/continuum-1.0.2/apps/continuum/work/68/applications/daytrader/derby/target/resources/META-INF/geronimo-daytrader-derby-db/var/derby
    [mkdir] Created dir: /home/continuum/continuum-1.0.2/apps/continuum/work/68/applications/daytrader/derby/target/resources/META-INF/geronimo-daytrader-derby-db/var/derby
    [sql] Executing file: /home/continuum/continuum-1.0.2/apps/continuum/work/68/applications/daytrader/derby/src/sql/daytrader.sql
    [sql] 18 of 18 SQL statements executed successfully


java:compile:
    [echo] Compiling to /home/continuum/continuum-1.0.2/apps/continuum/work/68/applications/daytrader/derby/target/classes
    [echo] No java source files to compile.

java:jar-resources:
Copying 71 files to /home/continuum/continuum-1.0.2/apps/continuum/work/68/applications/daytrader/derby/target/classes

test:prepare-filesystem:

test:test-resources:

test:compile:
    [echo] No test source files to compile.

test:test:
    [echo] NOTICE: Skipping tests; they seem to have passed already
    [echo] No tests to run.
Running post goal: test:test

jar:jar:
    [jar] Building jar: /home/continuum/continuum-1.0.2/apps/continuum/work/68/applications/daytrader/derby/target/geronimo-daytrader-derby-db-1.1-SNAPSHOT.jar

jar:install:
    [echo] Installing...
Uploading to geronimo/jars/geronimo-daytrader-derby-db-1.1-SNAPSHOT.jar: 
.................... (67K)
Uploading to geronimo/poms/geronimo-daytrader-derby-db-1.1-SNAPSHOT.pom: 
.................... (10K)

+----------------------------------------
| applications DayTrader :: WS Application Client
| Memory: 24M/39M
+----------------------------------------
DEPRECATED: the default goal should be specified in the <build> section of project.xml instead of maven.xml
DEPRECATED: the default goal should be specified in the <build> section of project.xml instead of maven.xml

build:end:

build:start:

multiproject:install-callback:
    [echo] Running jar:install for DayTrader :: WS Application Client
java:prepare-filesystem:

java:compile:
<depend closure="false" srcdir="1.4" dump="false" destdir="/home/continuum/continuum-1.0.2/apps/continuum/work/68/applications/daytrader/wsappclient/target/classes"></depend>    [echo] Compiling to /home/continuum/continuum-1.0.2/apps/continuum/work/68/applications/daytrader/wsappclient/target/classes

java:jar-resources:

test:prepare-filesystem:

test:test-resources:

test:compile:

test:test:
    [echo] NOTICE: Skipping tests; they seem to have passed already
    [echo] No tests to run.
Running post goal: test:test

jar:jar:
    [echo] Generating Manifest file for Streamer Application
    [echo] And this is found in /client/META-INF

jar:install:
    [echo] Installing...
Uploading to geronimo/jars/daytrader-wsappclient-1.1-SNAPSHOT.jar: 
.................... (40K)
Uploading to geronimo/poms/daytrader-wsappclient-1.1-SNAPSHOT.pom: 
.................... (10K)

+----------------------------------------
| applications DayTrader :: EJBs
| Memory: 27M/39M
+----------------------------------------
DEPRECATED: the default goal should be specified in the <build> section of project.xml instead of maven.xml
DEPRECATED: the default goal should be specified in the <build> section of project.xml instead of maven.xml

build:end:

Attempting to download daytrader-core-1.1-SNAPSHOT.jar.
Attempting to download daytrader-wsappclient-1.1-SNAPSHOT.jar.
build:start:

multiproject:install-callback:
    [echo] Running ejb:install for DayTrader :: EJBs
ejb:init:
java:prepare-filesystem:

java:compile:
<depend closure="false" srcdir="1.4" dump="false" destdir="/home/continuum/continuum-1.0.2/apps/continuum/work/68/applications/daytrader/ejb/target/classes"></depend>    [echo] Compiling to /home/continuum/continuum-1.0.2/apps/continuum/work/68/applications/daytrader/ejb/target/classes

java:jar-resources:

test:prepare-filesystem:

test:test-resources:

test:compile:

test:test:
    [echo] NOTICE: Skipping tests; they seem to have passed already
    [echo] No tests to run.
Running post goal: test:test


ejb:ejb:
ejb:ejb-jar-internal:
    [echo] Building ejb daytrader-ejb-1.1-SNAPSHOT
    [echo] Bundling: jar - commons-logging:commons-logging


ejb:install:
    [echo] Installing...
Uploading to geronimo/ejbs/daytrader-ejb-1.1-SNAPSHOT.jar: 
.................... (140K)
Uploading to geronimo/poms/daytrader-ejb-1.1-SNAPSHOT.pom: 
.................... (10K)

+----------------------------------------
| applications DayTrader :: Web Application
| Memory: 28M/39M
+----------------------------------------
DEPRECATED: the default goal should be specified in the <build> section of project.xml instead of maven.xml
DEPRECATED: the default goal should be specified in the <build> section of project.xml instead of maven.xml

build:end:

Attempting to download daytrader-ejb-1.1-SNAPSHOT.jar.
build:start:

multiproject:install-callback:
    [echo] Running war:install for DayTrader :: Web Application
Tag library requested that is not present: 'caller' in plugin: 'maven-war-plugin-1.6.1'
war:init:

war:war-resources:

java:prepare-filesystem:

java:compile:
<depend closure="false" srcdir="1.4" dump="false" destdir="/home/continuum/continuum-1.0.2/apps/continuum/work/68/applications/daytrader/web/target/classes"></depend>    [echo] Compiling to /home/continuum/continuum-1.0.2/apps/continuum/work/68/applications/daytrader/web/target/classes

java:jar-resources:

test:prepare-filesystem:

test:test-resources:

test:compile:

test:test:
    [echo] NOTICE: Skipping tests; they seem to have passed already
    [echo] No tests to run.
Running post goal: test:test

war:webapp:
    [echo] Assembling webapp daytrader-web
    [copy] Copying 33 files to /home/continuum/continuum-1.0.2/apps/continuum/work/68/applications/daytrader/web/target/daytrader-web/WEB-INF/classes
Running post goal: war:webapp
    [echo] Generating /web.xml
Running post goal: war:webapp
    [echo] Use classes.jar ? true
    [copy] Copying 33 files to /home/continuum/continuum-1.0.2/apps/continuum/work/68/applications/daytrader/web/target/work
    [jar] Building jar: /home/continuum/continuum-1.0.2/apps/continuum/work/68/applications/daytrader/web/target/daytrader-web/WEB-INF/lib/classes.jar
    [delete] Deleting 33 files from /home/continuum/continuum-1.0.2/apps/continuum/work/68/applications/daytrader/web/target/daytrader-web/WEB-INF/classes
    [delete] Deleted 7 directories from /home/continuum/continuum-1.0.2/apps/continuum/work/68/applications/daytrader/web/target/daytrader-web/WEB-INF/classes
    [delete] Deleting 33 files from /home/continuum/continuum-1.0.2/apps/continuum/work/68/applications/daytrader/web/target/work
    [delete] Deleted 7 directories from /home/continuum/continuum-1.0.2/apps/continuum/work/68/applications/daytrader/web/target/work

war:war:
    [echo] Building WAR daytrader-web
    [jar] Building jar: /home/continuum/continuum-1.0.2/apps/continuum/work/68/applications/daytrader/web/target/daytrader-web-1.1-SNAPSHOT.war

war:install:
    [echo] Installing...
Uploading to geronimo/wars/daytrader-web-1.1-SNAPSHOT.war: 
.................... (446K)
Uploading to geronimo/poms/daytrader-web-1.1-SNAPSHOT.pom: 
.................... (10K)

+----------------------------------------
| applications DayTrader :: Quote Streamer
| Memory: 31M/39M
+----------------------------------------
DEPRECATED: the default goal should be specified in the <build> section of project.xml instead of maven.xml
DEPRECATED: the default goal should be specified in the <build> section of project.xml instead of maven.xml

build:end:

build:start:

multiproject:install-callback:
    [echo] Running jar:install for DayTrader :: Quote Streamer
java:prepare-filesystem:

java:compile:
<depend closure="false" srcdir="1.4" dump="false" destdir="/home/continuum/continuum-1.0.2/apps/continuum/work/68/applications/daytrader/streamer/target/classes"></depend>    [echo] Compiling to /home/continuum/continuum-1.0.2/apps/continuum/work/68/applications/daytrader/streamer/target/classes

java:jar-resources:

test:prepare-filesystem:

test:test-resources:

test:compile:

test:test:
    [echo] NOTICE: Skipping tests; they seem to have passed already
    [echo] No tests to run.
Running post goal: test:test

jar:jar:
    [echo] Generating Manifest file for Streamer Application
    [echo] And this is found in /client/META-INF

jar:install:
    [echo] Installing...
Uploading to geronimo/jars/daytrader-streamer-1.1-SNAPSHOT.jar: 
.................... (24K)
Uploading to geronimo/poms/daytrader-streamer-1.1-SNAPSHOT.pom: 
.................... (10K)

+----------------------------------------
| applications DayTrader :: Enterprise Application
| Memory: 31M/39M
+----------------------------------------
DEPRECATED: the default goal should be specified in the <build> section of project.xml instead of maven.xml
DEPRECATED: the default goal should be specified in the <build> section of project.xml instead of maven.xml

build:end:

Attempting to download daytrader-web-1.1-SNAPSHOT.war.
Attempting to download daytrader-streamer-1.1-SNAPSHOT.jar.
build:start:

multiproject:install-callback:
    [echo] Running ear:install for DayTrader :: Enterprise Application
ear:init:

ear:ear:
ear:generate-ear-descriptor:
    [echo] Generating /home/continuum/continuum-1.0.2/apps/continuum/work/68/applications/daytrader/ear/target/application.xml

    [echo] Building EAR daytrader-ear-1.1-SNAPSHOT.ear with appxml "/home/continuum/continuum-1.0.2/apps/continuum/work/68/applications/daytrader/ear/target/application.xml"
    [ear] Building ear: /home/continuum/continuum-1.0.2/apps/continuum/work/68/applications/daytrader/ear/target/daytrader-ear-1.1-SNAPSHOT.ear

ear:install:
    [echo] Installing...
Uploading to geronimo/ears/daytrader-ear-1.1-SNAPSHOT.ear: 
.................... (634K)
Uploading to geronimo/poms/daytrader-ear-1.1-SNAPSHOT.pom: 
.................... (11K)

+----------------------------------------
| applications Geronimo :: Demo Webapp
| Memory: 34M/39M
+----------------------------------------
DEPRECATED: the default goal should be specified in the <build> section of project.xml instead of maven.xml
DEPRECATED: the default goal should be specified in the <build> section of project.xml instead of maven.xml

build:end:

build:start:

multiproject:install-callback:
    [echo] Running war:install for Geronimo :: Demo Webapp
Tag library requested that is not present: 'caller' in plugin: 'maven-war-plugin-1.6.1'
war:init:

war:war-resources:
    [copy] Copying 1 file to /home/continuum/continuum-1.0.2/apps/continuum/work/68/applications/demo/target/geronimo-demo/WEB-INF

java:prepare-filesystem:

java:compile:
    [echo] Compiling to /home/continuum/continuum-1.0.2/apps/continuum/work/68/applications/demo/target/classes
    [echo] No java source files to compile.

java:jar-resources:

test:prepare-filesystem:

test:test-resources:

test:compile:
    [echo] No test source files to compile.

test:test:
    [echo] NOTICE: Skipping tests; they seem to have passed already
    [echo] No tests to run.
Running post goal: test:test

war:webapp:
    [echo] Assembling webapp geronimo-demo
Running post goal: war:webapp
    [echo] Use classes.jar ? true

war:war:
    [echo] Building WAR geronimo-demo
    [jar] Building jar: /home/continuum/continuum-1.0.2/apps/continuum/work/68/applications/demo/target/geronimo-demo-1.1-SNAPSHOT.war

war:install:
    [echo] Installing...
Uploading to geronimo/wars/geronimo-demo-1.1-SNAPSHOT.war: 
.................... (4K)
Uploading to geronimo/poms/geronimo-demo-1.1-SNAPSHOT.pom: 
.................... (10K)

+----------------------------------------
| applications Geronimo :: JMX Debug Webapp
| Memory: 36M/39M
+----------------------------------------
DEPRECATED: the default goal should be specified in the <build> section of project.xml instead of maven.xml
DEPRECATED: the default goal should be specified in the <build> section of project.xml instead of maven.xml

build:end:

build:start:

multiproject:install-callback:
    [echo] Running war:install for Geronimo :: JMX Debug Webapp
Tag library requested that is not present: 'caller' in plugin: 'maven-war-plugin-1.6.1'
war:init:

war:war-resources:
    [copy] Copying 1 file to /home/continuum/continuum-1.0.2/apps/continuum/work/68/applications/jmxdebug/target/geronimo-jmxdebug/WEB-INF

java:prepare-filesystem:

java:compile:
<depend closure="false" srcdir="1.4" dump="false" destdir="/home/continuum/continuum-1.0.2/apps/continuum/work/68/applications/jmxdebug/target/classes"></depend>    [echo] Compiling to /home/continuum/continuum-1.0.2/apps/continuum/work/68/applications/jmxdebug/target/classes

java:jar-resources:

test:prepare-filesystem:

test:test-resources:

test:compile:
    [echo] No test source files to compile.

test:test:
    [echo] NOTICE: Skipping tests; they seem to have passed already
    [echo] No tests to run.
Running post goal: test:test

war:webapp:
    [echo] Assembling webapp geronimo-jmxdebug
    [copy] Copying 11 files to /home/continuum/continuum-1.0.2/apps/continuum/work/68/applications/jmxdebug/target/geronimo-jmxdebug/WEB-INF/classes
Running post goal: war:webapp
    [echo] Use classes.jar ? true
    [copy] Copying 11 files to /home/continuum/continuum-1.0.2/apps/continuum/work/68/applications/jmxdebug/target/work
    [jar] Building jar: /home/continuum/continuum-1.0.2/apps/continuum/work/68/applications/jmxdebug/target/geronimo-jmxdebug/WEB-INF/lib/classes.jar
    [delete] Deleting 11 files from /home/continuum/continuum-1.0.2/apps/continuum/work/68/applications/jmxdebug/target/geronimo-jmxdebug/WEB-INF/classes
    [delete] Deleted 8 directories from /home/continuum/continuum-1.0.2/apps/continuum/work/68/applications/jmxdebug/target/geronimo-jmxdebug/WEB-INF/classes
    [delete] Deleting 11 files from /home/continuum/continuum-1.0.2/apps/continuum/work/68/applications/jmxdebug/target/work
    [delete] Deleted 8 directories from /home/continuum/continuum-1.0.2/apps/continuum/work/68/applications/jmxdebug/target/work

war:war:
    [echo] Building WAR geronimo-jmxdebug
    [jar] Building jar: /home/continuum/continuum-1.0.2/apps/continuum/work/68/applications/jmxdebug/target/geronimo-jmxdebug-1.1-SNAPSHOT.war

war:install:
    [echo] Installing...
Uploading to geronimo/wars/geronimo-jmxdebug-1.1-SNAPSHOT.war: 
.................... (470K)
Uploading to geronimo/poms/geronimo-jmxdebug-1.1-SNAPSHOT.pom: 
.................... (10K)

+----------------------------------------
| applications Geronimo :: LDAP Demo Application
| Memory: 35M/39M
+----------------------------------------
DEPRECATED: the default goal should be specified in the <build> section of project.xml instead of maven.xml
DEPRECATED: the default goal should be specified in the <build> section of project.xml instead of maven.xml

build:end:

build:start:

multiproject:install-callback:
    [echo] Running war:install for Geronimo :: LDAP Demo Application
Tag library requested that is not present: 'caller' in plugin: 'maven-war-plugin-1.6.1'
war:init:

war:war-resources:
    [copy] Copying 1 file to /home/continuum/continuum-1.0.2/apps/continuum/work/68/applications/ldap-realm-demo/target/geronimo-ldap-demo/WEB-INF

java:prepare-filesystem:

java:compile:
    [echo] Compiling to /home/continuum/continuum-1.0.2/apps/continuum/work/68/applications/ldap-realm-demo/target/classes
    [echo] No java source files to compile.

java:jar-resources:

test:prepare-filesystem:

test:test-resources:

test:compile:
    [echo] No test source files to compile.

test:test:
    [echo] NOTICE: Skipping tests; they seem to have passed already
    [echo] No tests to run.
Running post goal: test:test

war:webapp:
    [echo] Assembling webapp geronimo-ldap-demo
Running post goal: war:webapp
    [echo] Use classes.jar ? true

war:war:
    [echo] Building WAR geronimo-ldap-demo
    [jar] Building jar: /home/continuum/continuum-1.0.2/apps/continuum/work/68/applications/ldap-realm-demo/target/geronimo-ldap-demo-1.1-SNAPSHOT.war

war:install:
    [echo] Installing...
Uploading to geronimo/wars/geronimo-ldap-demo-1.1-SNAPSHOT.war: 
.................... (4K)
Uploading to geronimo/poms/geronimo-ldap-demo-1.1-SNAPSHOT.pom: 
.................... (10K)

+----------------------------------------
| applications Geronimo :: The Magic G Ball Sample Application
| Memory: 35M/39M
+----------------------------------------
DEPRECATED: the default goal should be specified in the <build> section of project.xml instead of maven.xml
DEPRECATED: the default goal should be specified in the <build> section of project.xml instead of maven.xml

build:end:

build:start:

multiproject:install-callback:
    [echo] Running war:install for Geronimo :: The Magic G Ball Sample Application
Tag library requested that is not present: 'caller' in plugin: 'maven-war-plugin-1.6.1'
war:init:

war:war-resources:
    [copy] Copying 1 file to /home/continuum/continuum-1.0.2/apps/continuum/work/68/applications/magicGball/target/magicGball/WEB-INF

java:prepare-filesystem:

java:compile:
<depend closure="false" srcdir="1.4" dump="false" destdir="/home/continuum/continuum-1.0.2/apps/continuum/work/68/applications/magicGball/target/classes"></depend>    [echo] Compiling to /home/continuum/continuum-1.0.2/apps/continuum/work/68/applications/magicGball/target/classes

java:jar-resources:

test:prepare-filesystem:

test:test-resources:

test:compile:
    [echo] No test source files to compile.

test:test:
    [echo] NOTICE: Skipping tests; they seem to have passed already
    [echo] No tests to run.
Running post goal: test:test

war:webapp:
    [echo] Assembling webapp magicGball
    [copy] Copying 1 file to /home/continuum/continuum-1.0.2/apps/continuum/work/68/applications/magicGball/target/magicGball/WEB-INF/classes
Running post goal: war:webapp
    [echo] Use classes.jar ? true
    [copy] Copying 1 file to /home/continuum/continuum-1.0.2/apps/continuum/work/68/applications/magicGball/target/work
    [jar] Building jar: /home/continuum/continuum-1.0.2/apps/continuum/work/68/applications/magicGball/target/magicGball/WEB-INF/lib/classes.jar
    [delete] Deleting 1 files from /home/continuum/continuum-1.0.2/apps/continuum/work/68/applications/magicGball/target/magicGball/WEB-INF/classes
    [delete] Deleted 2 directories from /home/continuum/continuum-1.0.2/apps/continuum/work/68/applications/magicGball/target/magicGball/WEB-INF/classes
    [delete] Deleting 1 files from /home/continuum/continuum-1.0.2/apps/continuum/work/68/applications/magicGball/target/work
    [delete] Deleted 2 directories from /home/continuum/continuum-1.0.2/apps/continuum/work/68/applications/magicGball/target/work

war:war:
    [echo] Building WAR magicGball
    [jar] Building jar: /home/continuum/continuum-1.0.2/apps/continuum/work/68/applications/magicGball/target/magicGball-1.1-SNAPSHOT.war

war:install:
    [echo] Installing...
Uploading to geronimo/wars/magicGball-1.1-SNAPSHOT.war: 
.................... (2K)
Uploading to geronimo/poms/magicGball-1.1-SNAPSHOT.pom: 
.................... (10K)

+----------------------------------------
| applications Geronimo :: Remote Deploy GBean
| Memory: 37M/39M
+----------------------------------------
DEPRECATED: the default goal should be specified in the <build> section of project.xml instead of maven.xml
DEPRECATED: the default goal should be specified in the <build> section of project.xml instead of maven.xml

build:end:

build:start:

multiproject:install-callback:
    [echo] Running jar:install for Geronimo :: Remote Deploy GBean
java:prepare-filesystem:

java:compile:
<depend closure="false" srcdir="1.4" dump="false" destdir="/home/continuum/continuum-1.0.2/apps/continuum/work/68/applications/remote-deploy-lib/target/classes"></depend>    [echo] Compiling to /home/continuum/continuum-1.0.2/apps/continuum/work/68/applications/remote-deploy-lib/target/classes

java:jar-resources:

test:prepare-filesystem:

test:test-resources:

test:compile:
    [echo] No test source files to compile.

test:test:
    [echo] NOTICE: Skipping tests; they seem to have passed already
    [echo] No tests to run.
Running post goal: test:test

jar:jar:

jar:install:
    [echo] Installing...
Uploading to geronimo/jars/geronimo-remote-deploy-lib-1.1-SNAPSHOT.jar: 
.................... (6K)
Uploading to geronimo/poms/geronimo-remote-deploy-lib-1.1-SNAPSHOT.pom: 
.................... (10K)

+----------------------------------------
| applications Geronimo :: Remote Deploy Application
| Memory: 36M/39M
+----------------------------------------
DEPRECATED: the default goal should be specified in the <build> section of project.xml instead of maven.xml
DEPRECATED: the default goal should be specified in the <build> section of project.xml instead of maven.xml

build:end:

Attempting to download geronimo-remote-deploy-lib-1.1-SNAPSHOT.jar.
build:start:

multiproject:install-callback:
    [echo] Running war:install for Geronimo :: Remote Deploy Application
Tag library requested that is not present: 'caller' in plugin: 'maven-war-plugin-1.6.1'
war:init:

war:war-resources:
    [copy] Copying 1 file to /home/continuum/continuum-1.0.2/apps/continuum/work/68/applications/remote-deploy/target/geronimo-remote-deploy/WEB-INF

java:prepare-filesystem:

java:compile:
<depend closure="false" srcdir="1.4" dump="false" destdir="/home/continuum/continuum-1.0.2/apps/continuum/work/68/applications/remote-deploy/target/classes"></depend>    [echo] Compiling to /home/continuum/continuum-1.0.2/apps/continuum/work/68/applications/remote-deploy/target/classes

java:jar-resources:

test:prepare-filesystem:

test:test-resources:

test:compile:
    [echo] No test source files to compile.

test:test:
    [echo] NOTICE: Skipping tests; they seem to have passed already
    [echo] No tests to run.
Running post goal: test:test

war:webapp:
    [echo] Assembling webapp geronimo-remote-deploy
    [copy] Copying 2 files to /home/continuum/continuum-1.0.2/apps/continuum/work/68/applications/remote-deploy/target/geronimo-remote-deploy/WEB-INF/classes
Running post goal: war:webapp
    [echo] Use classes.jar ? true
    [copy] Copying 2 files to /home/continuum/continuum-1.0.2/apps/continuum/work/68/applications/remote-deploy/target/work
    [jar] Building jar: /home/continuum/continuum-1.0.2/apps/continuum/work/68/applications/remote-deploy/target/geronimo-remote-deploy/WEB-INF/lib/classes.jar
    [delete] Deleting 2 files from /home/continuum/continuum-1.0.2/apps/continuum/work/68/applications/remote-deploy/target/geronimo-remote-deploy/WEB-INF/classes
    [delete] Deleted 5 directories from /home/continuum/continuum-1.0.2/apps/continuum/work/68/applications/remote-deploy/target/geronimo-remote-deploy/WEB-INF/classes
    [delete] Deleting 2 files from /home/continuum/continuum-1.0.2/apps/continuum/work/68/applications/remote-deploy/target/work
    [delete] Deleted 5 directories from /home/continuum/continuum-1.0.2/apps/continuum/work/68/applications/remote-deploy/target/work

war:war:
    [echo] Building WAR geronimo-remote-deploy
    [jar] Building jar: /home/continuum/continuum-1.0.2/apps/continuum/work/68/applications/remote-deploy/target/geronimo-remote-deploy-1.1-SNAPSHOT.war

war:install:
    [echo] Installing...
Uploading to geronimo/wars/geronimo-remote-deploy-1.1-SNAPSHOT.war: 
.................... (4K)
Uploading to geronimo/poms/geronimo-remote-deploy-1.1-SNAPSHOT.pom: 
.................... (11K)

+----------------------------------------
| applications Geronimo :: UDDI-Server database
| Memory: 38M/39M
+----------------------------------------
DEPRECATED: the default goal should be specified in the <build> section of project.xml instead of maven.xml
DEPRECATED: the default goal should be specified in the <build> section of project.xml instead of maven.xml

build:end:

build:start:

multiproject:install-callback:
    [echo] Running jar:install for Geronimo :: UDDI-Server database
java:prepare-filesystem:
init-database:
    [delete] Deleting directory /home/continuum/continuum-1.0.2/apps/continuum/work/68/applications/uddi-db/target/resources/META-INF/geronimo-uddi-db/var/derby
    [mkdir] Created dir: /home/continuum/continuum-1.0.2/apps/continuum/work/68/applications/uddi-db/target/resources/META-INF/geronimo-uddi-db/var/derby
    [sql] Executing file: /home/continuum/continuum-1.0.2/apps/continuum/work/68/applications/uddi-db/src/sql/juddi.sql
    [sql] 87 of 87 SQL statements executed successfully


java:compile:
    [echo] Compiling to /home/continuum/continuum-1.0.2/apps/continuum/work/68/applications/uddi-db/target/classes
    [echo] No java source files to compile.

java:jar-resources:
Copying 142 files to /home/continuum/continuum-1.0.2/apps/continuum/work/68/applications/uddi-db/target/classes

test:prepare-filesystem:

test:test-resources:

test:compile:
    [echo] No test source files to compile.

test:test:
    [echo] NOTICE: Skipping tests; they seem to have passed already
    [echo] No tests to run.
Running post goal: test:test

jar:jar:
    [jar] Building jar: /home/continuum/continuum-1.0.2/apps/continuum/work/68/applications/uddi-db/target/geronimo-uddi-db-1.1-SNAPSHOT.jar

jar:install:
    [echo] Installing...
Uploading to geronimo/jars/geronimo-uddi-db-1.1-SNAPSHOT.jar: 
.................... (140K)
Uploading to geronimo/poms/geronimo-uddi-db-1.1-SNAPSHOT.pom: 
.................... (10K)

+----------------------------------------
| applications Geronimo :: UDDI-Server
| Memory: 30M/46M
+----------------------------------------
DEPRECATED: the default goal should be specified in the <build> section of project.xml instead of maven.xml
DEPRECATED: the default goal should be specified in the <build> section of project.xml instead of maven.xml

build:end:

build:start:

multiproject:install-callback:
    [echo] Running war:install for Geronimo :: UDDI-Server
Tag library requested that is not present: 'caller' in plugin: 'maven-war-plugin-1.6.1'
war:init:

war:war-resources:
    [copy] Copying 1 file to /home/continuum/continuum-1.0.2/apps/continuum/work/68/applications/uddi-server/target/geronimo-uddi-server/WEB-INF

java:prepare-filesystem:

java:compile:
    [echo] Compiling to /home/continuum/continuum-1.0.2/apps/continuum/work/68/applications/uddi-server/target/classes
    [echo] No java source files to compile.

java:jar-resources:

test:prepare-filesystem:

test:test-resources:

test:compile:
    [echo] No test source files to compile.

test:test:
    [echo] NOTICE: Skipping tests; they seem to have passed already
    [echo] No tests to run.
Running post goal: test:test

war:webapp:
    [echo] Assembling webapp geronimo-uddi-server
Running post goal: war:webapp
    [echo] Use classes.jar ? true

war:war:
    [echo] Building WAR geronimo-uddi-server
    [jar] Building jar: /home/continuum/continuum-1.0.2/apps/continuum/work/68/applications/uddi-server/target/geronimo-uddi-server-1.1-SNAPSHOT.war

war:install:
    [echo] Installing...
Uploading to geronimo/wars/geronimo-uddi-server-1.1-SNAPSHOT.war: 
.................... (5K)
Uploading to geronimo/poms/geronimo-uddi-server-1.1-SNAPSHOT.pom: 
.................... (10K)

+----------------------------------------
| applications Geronimo :: Welcome Application
| Memory: 29M/46M
+----------------------------------------
DEPRECATED: the default goal should be specified in the <build> section of project.xml instead of maven.xml
DEPRECATED: the default goal should be specified in the <build> section of project.xml instead of maven.xml

build:end:

build:start:

multiproject:install-callback:
    [echo] Running war:install for Geronimo :: Welcome Application
Tag library requested that is not present: 'caller' in plugin: 'maven-war-plugin-1.6.1'
war:init:

war:war-resources:
    [copy] Copying 1 file to /home/continuum/continuum-1.0.2/apps/continuum/work/68/applications/welcome/target/geronimo-welcome/WEB-INF

java:prepare-filesystem:

java:compile:
    [echo] Compiling to /home/continuum/continuum-1.0.2/apps/continuum/work/68/applications/welcome/target/classes
    [echo] No java source files to compile.

java:jar-resources:

test:prepare-filesystem:

test:test-resources:

test:compile:
    [echo] No test source files to compile.

test:test:
    [echo] NOTICE: Skipping tests; they seem to have passed already
    [echo] No tests to run.
Running post goal: test:test

war:webapp:
    [echo] Assembling webapp geronimo-welcome
Running post goal: war:webapp
    [echo] Use classes.jar ? true

war:war:
    [echo] Building WAR geronimo-welcome
    [jar] Building jar: /home/continuum/continuum-1.0.2/apps/continuum/work/68/applications/welcome/target/geronimo-welcome-1.1-SNAPSHOT.war

war:install:
    [echo] Installing...
Uploading to geronimo/wars/geronimo-welcome-1.1-SNAPSHOT.war: 
.................... (33K)
Uploading to geronimo/poms/geronimo-welcome-1.1-SNAPSHOT.pom: 
.................... (10K)


build:end:


Starting the reactor...
Our processing order:
Geronimo Configuration for performing service deployments
System Configuration for the J2EE Server
RMI/Naming configuration
Server Configuration for the J2EE Server
System Configuration for the J2EE Client
Configuration for the J2EE Client
Configuration for performing J2EE deployments
System Database Configuration for the J2EE Server
ActiveMQ broker configuration
Activemq configuration
Axis Configuration for the J2EE Server
Axis Configuration for performing J2EE deployments
Corba Configuration for the J2EE Client
Configuration for application client deployments
Security Configuration for the J2EE Client
Security Configuration for the J2EE Server
Jetty Configuration for the J2EE Server
Jetty Deployer Configuration for the J2EE Server
Web console deployed on jetty
Tomcat Configuration for the J2EE Server
Tomcat Deployer Configuration for the J2EE Server
Web console deployed on tomcat
Daytrader using derby deployed on jetty
Daytrader using derby deployed on tomcat
Directory Configuration
Hot deployer
Corba Configuration for the J2EE Server
JavaMail
JMX Debug app for Jetty
JMX Debug app Tomcat
JSP Examples for Jetty
JSP Examples Tomcat
LDAP security realm
LDAP Demo for Jetty
LDAP Demo for Tomcat
Online Deployer
openejb Configuration for the J2EE Server
openejb Configuration for performing J2EE deployments
Geronimo :: Remote Deploy Jetty Application
Geronimo :: Remote Deploy Tomcat Application
Servlet Examples for Jetty
Servlet Examples Tomcat
Shared Library GBean
Shutdown
UDDI server Configuration for the J2EE Jetty Server
UDDI server Configuration for the J2EE Tomcat Server
Configuration for no j2ee app clients
Configuration for no EJBs
Unavailable Web Services deployer
Welcome app for Jetty
Welcome app Tomcat
+----------------------------------------
| configurations Geronimo Configuration for performing service deployments
| Memory: 40M/46M
+----------------------------------------
DEPRECATED: the default goal should be specified in the <build> section of project.xml instead of maven.xml
DEPRECATED: the default goal should be specified in the <build> section of project.xml instead of maven.xml
new4:
build:start:

multiproject:install-callback:
    [echo] Running car:install for Geronimo Configuration for performing service deployments
car:prepare-plan:

car:package:

    Packaging configuration /home/continuum/continuum-1.0.2/apps/continuum/work/68/configs/geronimo-gbean-deployer/target/plan/plan.xml


car:install:
    [echo] Installing...
Uploading to geronimo/cars/geronimo-gbean-deployer-1.1-SNAPSHOT.car: 
.................... (3K)
Uploading to geronimo/poms/geronimo-gbean-deployer-1.1-SNAPSHOT.pom: 
.................... (13K)

+----------------------------------------
| configurations System Configuration for the J2EE Server
| Memory: 45M/46M
+----------------------------------------
DEPRECATED: the default goal should be specified in the <build> section of project.xml instead of maven.xml
DEPRECATED: the default goal should be specified in the <build> section of project.xml instead of maven.xml

build:end:

Attempting to download geronimo-gbean-deployer-1.1-SNAPSHOT.car.
build:start:

multiproject:install-callback:
    [echo] Running car:install for System Configuration for the J2EE Server

    Packaging configuration /home/continuum/continuum-1.0.2/apps/continuum/work/68/configs/j2ee-system/target/plan/plan.xml

0 [main] DEBUG org.apache.geronimo.kernel.basic.BasicKernel  - Starting boot
244 [main] DEBUG org.apache.geronimo.gbean.runtime.GBeanInstanceState  - GBeanInstanceState for: geronimo/boot/none/car?role=kernel State changed from stopped to starting
244 [main] DEBUG org.apache.geronimo.gbean.runtime.GBeanInstanceState  - GBeanInstanceState for: geronimo/boot/none/car?role=kernel State changed from starting to running
244 [main] DEBUG org.apache.geronimo.kernel.basic.BasicKernel  - Booted
348 [main] DEBUG org.apache.geronimo.gbean.runtime.GBeanInstanceState  - GBeanInstanceState for: geronimo/packaging/fixed/car?configurationName=geronimo/packaging/fixed/car State changed from stopped to starting
349 [main] DEBUG org.apache.geronimo.kernel.config.Configuration  - ClassPath for geronimo/packaging/fixed/car resolved to []
351 [main] DEBUG org.apache.geronimo.kernel.config.Configuration  - Started configuration geronimo/packaging/fixed/car
351 [main] DEBUG org.apache.geronimo.gbean.runtime.GBeanInstanceState  - GBeanInstanceState for: geronimo/packaging/fixed/car?configurationName=geronimo/packaging/fixed/car State changed from starting to running
474 [main] DEBUG org.apache.geronimo.gbean.runtime.GBeanInstanceState  - GBeanInstanceState for: geronimo/packaging/fixed/car?j2eeType=ConfigurationStore,name=ConfigStore State changed from stopped to starting
475 [main] DEBUG org.apache.geronimo.gbean.runtime.GBeanSingleReference  - Waiting to start geronimo/packaging/fixed/car?j2eeType=ConfigurationStore,name=ConfigStore because no targets are running for reference Repository matching the patterns geronimo/packaging/fixed/car?j2eeType=Repository,name=Repository
475 [main] DEBUG org.apache.geronimo.gbean.runtime.GBeanInstanceState  - GBeanInstanceState for: geronimo/packaging/fixed/car?j2eeType=ArtifactResolver,name=ArtifactResolver State changed from stopped to starting
475 [main] DEBUG org.apache.geronimo.gbean.runtime.GBeanSingleReference  - Waiting to start geronimo/packaging/fixed/car?j2eeType=ArtifactResolver,name=ArtifactResolver because no targets are running for reference ArtifactManager matching the patterns geronimo/packaging/fixed/car?j2eeType=ArtifactManager,name=ArtifactManager
534 [main] DEBUG org.apache.geronimo.gbean.runtime.GBeanInstanceState  - GBeanInstanceState for: geronimo/packaging/fixed/car?j2eeType=ArtifactManager,name=ArtifactManager State changed from stopped to starting
535 [main] DEBUG org.apache.geronimo.gbean.runtime.GBeanInstanceState  - GBeanInstanceState for: geronimo/packaging/fixed/car?j2eeType=ArtifactManager,name=ArtifactManager State changed from starting to running
535 [main] DEBUG org.apache.geronimo.gbean.runtime.GBeanInstanceState  - GBeanInstanceState for: geronimo/packaging/fixed/car?j2eeType=ConfigurationManager,name=ConfigManager State changed from stopped to starting
535 [main] DEBUG org.apache.geronimo.gbean.runtime.GBeanSingleReference  - Waiting to start geronimo/packaging/fixed/car?j2eeType=ConfigurationManager,name=ConfigManager because no targets are running for reference AttributeStore matching the patterns geronimo/packaging/fixed/car?j2eeType=GBean,name=AttributeStore
583 [main] DEBUG org.apache.geronimo.gbean.runtime.GBeanSingleReference  - Waiting to start geronimo/packaging/fixed/car?j2eeType=ConfigurationManager,name=ConfigManager because no targets are running for reference ArtifactResolver matching the patterns geronimo/packaging/fixed/car?j2eeType=ArtifactResolver,name=ArtifactResolver
955 [main] DEBUG org.apache.geronimo.gbean.runtime.GBeanInstanceState  - Checking if parent is running: parent=geronimo/packaging/fixed/car?configurationName=geronimo/packaging/fixed/car
955 [main] DEBUG org.apache.geronimo.gbean.runtime.GBeanInstanceState  - Parent is running: parent=geronimo/packaging/fixed/car?configurationName=geronimo/packaging/fixed/car
980 [main] DEBUG org.apache.geronimo.gbean.runtime.GBeanInstanceState  - GBeanInstanceState for: geronimo/packaging/fixed/car?j2eeType=ArtifactResolver,name=ArtifactResolver State changed from starting to running
980 [main] DEBUG org.apache.geronimo.gbean.runtime.GBeanInstanceState  - Checking if parent is running: parent=geronimo/packaging/fixed/car?configurationName=geronimo/packaging/fixed/car
980 [main] DEBUG org.apache.geronimo.gbean.runtime.GBeanInstanceState  - Parent is running: parent=geronimo/packaging/fixed/car?configurationName=geronimo/packaging/fixed/car
980 [main] DEBUG org.apache.geronimo.gbean.runtime.GBeanInstanceState  - Checking if parent is running: parent=geronimo/packaging/fixed/car?j2eeType=ArtifactManager,name=ArtifactManager
980 [main] DEBUG org.apache.geronimo.gbean.runtime.GBeanInstanceState  - Parent is running: parent=geronimo/packaging/fixed/car?j2eeType=ArtifactManager,name=ArtifactManager
981 [main] DEBUG org.apache.geronimo.gbean.runtime.GBeanSingleReference  - Waiting to start geronimo/packaging/fixed/car?j2eeType=ConfigurationManager,name=ConfigManager because no targets are running for reference AttributeStore matching the patterns geronimo/packaging/fixed/car?j2eeType=GBean,name=AttributeStore
1004 [main] DEBUG org.apache.geronimo.gbean.runtime.GBeanInstanceState  - GBeanInstanceState for: geronimo/packaging/fixed/car?j2eeType=GBean,name=AttributeStore State changed from stopped to starting
1004 [main] DEBUG org.apache.geronimo.gbean.runtime.GBeanInstanceState  - GBeanInstanceState for: geronimo/packaging/fixed/car?j2eeType=GBean,name=AttributeStore State changed from starting to running
1004 [main] DEBUG org.apache.geronimo.gbean.runtime.GBeanInstanceState  - Checking if parent is running: parent=geronimo/packaging/fixed/car?configurationName=geronimo/packaging/fixed/car
1004 [main] DEBUG org.apache.geronimo.gbean.runtime.GBeanInstanceState  - Parent is running: parent=geronimo/packaging/fixed/car?configurationName=geronimo/packaging/fixed/car
1004 [main] DEBUG org.apache.geronimo.gbean.runtime.GBeanInstanceState  - Checking if parent is running: parent=geronimo/packaging/fixed/car?j2eeType=ArtifactResolver,name=ArtifactResolver
1004 [main] DEBUG org.apache.geronimo.gbean.runtime.GBeanInstanceState  - Parent is running: parent=geronimo/packaging/fixed/car?j2eeType=ArtifactResolver,name=ArtifactResolver
1005 [main] DEBUG org.apache.geronimo.gbean.runtime.GBeanInstanceState  - Checking if parent is running: parent=geronimo/packaging/fixed/car?j2eeType=ArtifactManager,name=ArtifactManager
1005 [main] DEBUG org.apache.geronimo.gbean.runtime.GBeanInstanceState  - Parent is running: parent=geronimo/packaging/fixed/car?j2eeType=ArtifactManager,name=ArtifactManager
1030 [main] DEBUG org.apache.geronimo.gbean.runtime.GBeanInstanceState  - GBeanInstanceState for: geronimo/packaging/fixed/car?j2eeType=ConfigurationManager,name=ConfigManager State changed from starting to running
1030 [main] DEBUG org.apache.geronimo.gbean.runtime.GBeanInstanceState  - GBeanInstanceState for: geronimo/packaging/fixed/car?j2eeType=Repository,name=Repository State changed from stopped to starting
1031 [main] DEBUG org.apache.geronimo.system.repository.AbstractRepository  - Repository root is /home/continuum/.geronimo-1.1-maven/repository
1032 [main] DEBUG org.apache.geronimo.gbean.runtime.GBeanInstanceState  - GBeanInstanceState for: geronimo/packaging/fixed/car?j2eeType=Repository,name=Repository State changed from starting to running
1037 [main] DEBUG org.apache.geronimo.gbean.runtime.GBeanInstanceState  - Checking if parent is running: parent=geronimo/packaging/fixed/car?configurationName=geronimo/packaging/fixed/car
1037 [main] DEBUG org.apache.geronimo.gbean.runtime.GBeanInstanceState  - Parent is running: parent=geronimo/packaging/fixed/car?configurationName=geronimo/packaging/fixed/car
1089 [main] DEBUG org.apache.geronimo.gbean.runtime.GBeanInstanceState  - GBeanInstanceState for: geronimo/packaging/fixed/car?j2eeType=ConfigurationStore,name=ConfigStore State changed from starting to running
1210 [main] DEBUG org.apache.geronimo.gbean.runtime.GBeanInstanceState  - GBeanInstanceState for: geronimo/geronimo-gbean-deployer/1.1-SNAPSHOT/car?configurationName=geronimo/geronimo-gbean-deployer/1.1-SNAPSHOT/car State changed from stopped to starting
1217 [main] DEBUG org.apache.geronimo.kernel.config.Configuration  - ClassPath for geronimo/geronimo-gbean-deployer/1.1-SNAPSHOT/car resolved to [file:/home/continuum/.geronimo-1.1-maven/repository/geronimo/jars/geronimo-system-1.1-SNAPSHOT.jar, file:/home/continuum/.geronimo-1.1-maven/repository/geronimo/jars/geronimo-common-1.1-SNAPSHOT.jar, file:/home/continuum/.geronimo-1.1-maven/repository/geronimo/jars/geronimo-deployment-1.1-SNAPSHOT.jar, file:/home/continuum/.geronimo-1.1-maven/repository/geronimo/jars/geronimo-j2ee-1.1-SNAPSHOT.jar, file:/home/continuum/.geronimo-1.1-maven/repository/geronimo/jars/geronimo-management-1.1-SNAPSHOT.jar, file:/home/continuum/.geronimo-1.1-maven/repository/geronimo/jars/geronimo-service-builder-1.1-SNAPSHOT.jar, file:/home/continuum/.geronimo-1.1-maven/repository/xmlbeans/jars/xbean-2.0.0.jar, file:/home/continuum/.geronimo-1.1-maven/repository/stax/jars/stax-api-1.0.jar, file:/home/continuum/.geronimo-1.1-maven/repository/xstream/jars/xstream-1.1.3.jar, file:/home/continuum/.geronimo-1.1-maven/repository/xpp3/jars/xpp3-1.1.3.3.jar]
1251 [main] DEBUG org.apache.geronimo.kernel.config.Configuration  - Started configuration geronimo/geronimo-gbean-deployer/1.1-SNAPSHOT/car
1251 [main] DEBUG org.apache.geronimo.gbean.runtime.GBeanInstanceState  - GBeanInstanceState for: geronimo/geronimo-gbean-deployer/1.1-SNAPSHOT/car?configurationName=geronimo/geronimo-gbean-deployer/1.1-SNAPSHOT/car State changed from starting to running
1251 [main] DEBUG org.apache.geronimo.kernel.config.SimpleConfigurationManager  - Loaded Configuration geronimo/geronimo-gbean-deployer/1.1-SNAPSHOT/car?configurationName=geronimo/geronimo-gbean-deployer/1.1-SNAPSHOT/car
1297 [main] DEBUG org.apache.geronimo.gbean.runtime.GBeanInstanceState  - GBeanInstanceState for: geronimo/geronimo-gbean-deployer/1.1-SNAPSHOT/car?ServiceModule=geronimo/geronimo-gbean-deployer/1.1-SNAPSHOT/car,j2eeType=Deployer,name=Deployer State changed from stopped to starting
Generated package /home/continuum/continuum-1.0.2/apps/continuum/work/68/configs/j2ee-system/target/j2ee-system-1.1-SNAPSHOT.car
car:prepare-plan:

car:package:

car:install:
    [echo] Installing...
Uploading to geronimo/cars/j2ee-system-1.1-SNAPSHOT.car: 
.................... (7K)
Uploading to geronimo/poms/j2ee-system-1.1-SNAPSHOT.pom: 
.................... (14K)

+----------------------------------------
| configurations RMI/Naming configuration
| Memory: 41M/66M
+----------------------------------------
DEPRECATED: the default goal should be specified in the <build> section of project.xml instead of maven.xml
DEPRECATED: the default goal should be specified in the <build> section of project.xml instead of maven.xml

build:end:

Attempting to download j2ee-system-1.1-SNAPSHOT.car.
Attempting to download geronimo-activation-1.1-SNAPSHOT.jar.
Attempting to download geronimo-jmxremoting-1.1-SNAPSHOT.jar.
Attempting to download activemq-gbean-management-3.2.4-SNAPSHOT.jar.
build:start:

multiproject:install-callback:
    [echo] Running car:install for RMI/Naming configuration

    Packaging configuration /home/continuum/continuum-1.0.2/apps/continuum/work/68/configs/rmi-naming/target/plan/plan.xml

Generated package /home/continuum/continuum-1.0.2/apps/continuum/work/68/configs/rmi-naming/target/rmi-naming-1.1-SNAPSHOT.car
car:prepare-plan:

car:package:

car:install:
    [echo] Installing...

+----------------------------------------
| configurations Server Configuration for the J2EE Server
| Memory: 44M/66M
+----------------------------------------
DEPRECATED: the default goal should be specified in the <build> section of project.xml instead of maven.xml
DEPRECATED: the default goal should be specified in the <build> section of project.xml instead of maven.xml

build:end:

Attempting to download rmi-naming-1.1-SNAPSHOT.car.
build:start:

multiproject:install-callback:
    [echo] Running car:install for Server Configuration for the J2EE Server

    Packaging configuration /home/continuum/continuum-1.0.2/apps/continuum/work/68/configs/j2ee-server/target/plan/plan.xml

Generated package /home/continuum/continuum-1.0.2/apps/continuum/work/68/configs/j2ee-server/target/j2ee-server-1.1-SNAPSHOT.car
car:prepare-plan:

car:package:

car:install:
    [echo] Installing...

+----------------------------------------
| configurations System Configuration for the J2EE Client
| Memory: 47M/66M
+----------------------------------------
DEPRECATED: the default goal should be specified in the <build> section of project.xml instead of maven.xml
DEPRECATED: the default goal should be specified in the <build> section of project.xml instead of maven.xml

build:end:

build:start:

multiproject:install-callback:
    [echo] Running car:install for System Configuration for the J2EE Client

    Packaging configuration /home/continuum/continuum-1.0.2/apps/continuum/work/68/configs/client-system/target/plan/plan.xml

Generated package /home/continuum/continuum-1.0.2/apps/continuum/work/68/configs/client-system/target/client-system-1.1-SNAPSHOT.car
car:prepare-plan:

car:package:

car:install:
    [echo] Installing...
Uploading to geronimo/cars/client-system-1.1-SNAPSHOT.car: 
.................... (7K)
Uploading to geronimo/poms/client-system-1.1-SNAPSHOT.pom: 
.................... (13K)

+----------------------------------------
| configurations Configuration for the J2EE Client
| Memory: 47M/66M
+----------------------------------------
DEPRECATED: the default goal should be specified in the <build> section of project.xml instead of maven.xml
DEPRECATED: the default goal should be specified in the <build> section of project.xml instead of maven.xml

build:end:

Attempting to download client-system-1.1-SNAPSHOT.car.
build:start:

multiproject:install-callback:
    [echo] Running car:install for Configuration for the J2EE Client

    Packaging configuration /home/continuum/continuum-1.0.2/apps/continuum/work/68/configs/client/target/plan/plan.xml

Generated package /home/continuum/continuum-1.0.2/apps/continuum/work/68/configs/client/target/client-1.1-SNAPSHOT.car
car:prepare-plan:

car:package:

car:install:
    [echo] Installing...

+----------------------------------------
| configurations Configuration for performing J2EE deployments
| Memory: 52M/66M
+----------------------------------------
DEPRECATED: the default goal should be specified in the <build> section of project.xml instead of maven.xml
DEPRECATED: the default goal should be specified in the <build> section of project.xml instead of maven.xml

build:end:

Attempting to download j2ee-server-1.1-SNAPSHOT.car.
Attempting to download client-1.1-SNAPSHOT.car.
build:start:

multiproject:install-callback:
    [echo] Running car:install for Configuration for performing J2EE deployments

    Packaging configuration /home/continuum/continuum-1.0.2/apps/continuum/work/68/configs/j2ee-deployer/target/plan/plan.xml

Generated package /home/continuum/continuum-1.0.2/apps/continuum/work/68/configs/j2ee-deployer/target/j2ee-deployer-1.1-SNAPSHOT.car
car:prepare-plan:

car:package:

car:install:
    [echo] Installing...

+----------------------------------------
| configurations System Database Configuration for the J2EE Server
| Memory: 43M/70M
+----------------------------------------
DEPRECATED: the default goal should be specified in the <build> section of project.xml instead of maven.xml
DEPRECATED: the default goal should be specified in the <build> section of project.xml instead of maven.xml

build:end:

Attempting to download j2ee-deployer-1.1-SNAPSHOT.car.
build:start:

multiproject:install-callback:
    [echo] Running car:install for System Database Configuration for the J2EE Server

    Packaging configuration /home/continuum/continuum-1.0.2/apps/continuum/work/68/configs/system-database/target/plan/plan.xml

Generated package /home/continuum/continuum-1.0.2/apps/continuum/work/68/configs/system-database/target/system-database-1.1-SNAPSHOT.car
car:prepare-plan:

car:package:

car:install:
    [echo] Installing...

+----------------------------------------
| configurations ActiveMQ broker configuration
| Memory: 45M/70M
+----------------------------------------
DEPRECATED: the default goal should be specified in the <build> section of project.xml instead of maven.xml
DEPRECATED: the default goal should be specified in the <build> section of project.xml instead of maven.xml

build:end:

Attempting to download system-database-1.1-SNAPSHOT.car.
Attempting to download activemq-gbean-g1_1-3.2.4-SNAPSHOT.jar.
Attempting to download activemq-gbean-management-g1_1-3.2.4-SNAPSHOT.jar.
build:start:

multiproject:install-callback:
    [echo] Running car:install for ActiveMQ broker configuration

    Packaging configuration /home/continuum/continuum-1.0.2/apps/continuum/work/68/configs/activemq-broker/target/plan/plan.xml

Generated package /home/continuum/continuum-1.0.2/apps/continuum/work/68/configs/activemq-broker/target/activemq-broker-1.1-SNAPSHOT.car
car:prepare-plan:

car:package:

car:install:
    [echo] Installing...

+----------------------------------------
| configurations Activemq configuration
| Memory: 48M/70M
+----------------------------------------
DEPRECATED: the default goal should be specified in the <build> section of project.xml instead of maven.xml
DEPRECATED: the default goal should be specified in the <build> section of project.xml instead of maven.xml

build:end:

Attempting to download activemq-broker-1.1-SNAPSHOT.car.
Attempting to download activemq-ra-3.2.4-SNAPSHOT.rar.
build:start:

multiproject:install-callback:
    [echo] Running car:install for Activemq configuration

    Packaging configuration /home/continuum/continuum-1.0.2/apps/continuum/work/68/configs/activemq/target/plan/plan.xml

Generated package /home/continuum/continuum-1.0.2/apps/continuum/work/68/configs/activemq/target/activemq-1.1-SNAPSHOT.car
car:prepare-plan:

car:package:

car:install:
    [echo] Installing...

+----------------------------------------
| configurations Axis Configuration for the J2EE Server
| Memory: 55M/70M
+----------------------------------------
DEPRECATED: the default goal should be specified in the <build> section of project.xml instead of maven.xml
DEPRECATED: the default goal should be specified in the <build> section of project.xml instead of maven.xml

build:end:

build:start:

multiproject:install-callback:
    [echo] Running car:install for Axis Configuration for the J2EE Server

    Packaging configuration /home/continuum/continuum-1.0.2/apps/continuum/work/68/configs/axis/target/plan/plan.xml

Generated package /home/continuum/continuum-1.0.2/apps/continuum/work/68/configs/axis/target/axis-1.1-SNAPSHOT.car
car:prepare-plan:

car:package:

car:install:
    [echo] Installing...

+----------------------------------------
| configurations Axis Configuration for performing J2EE deployments
| Memory: 56M/70M
+----------------------------------------
DEPRECATED: the default goal should be specified in the <build> section of project.xml instead of maven.xml
DEPRECATED: the default goal should be specified in the <build> section of project.xml instead of maven.xml

build:end:

Attempting to download axis-1.1-SNAPSHOT.car.
build:start:

multiproject:install-callback:
    [echo] Running car:install for Axis Configuration for performing J2EE deployments

    Packaging configuration /home/continuum/continuum-1.0.2/apps/continuum/work/68/configs/axis-deployer/target/plan/plan.xml

Generated package /home/continuum/continuum-1.0.2/apps/continuum/work/68/configs/axis-deployer/target/axis-deployer-1.1-SNAPSHOT.car
car:prepare-plan:

car:package:

car:install:
    [echo] Installing...

+----------------------------------------
| configurations Corba Configuration for the J2EE Client
| Memory: 59M/70M
+----------------------------------------
DEPRECATED: the default goal should be specified in the <build> section of project.xml instead of maven.xml
DEPRECATED: the default goal should be specified in the <build> section of project.xml instead of maven.xml

build:end:

build:start:

multiproject:install-callback:
    [echo] Running car:install for Corba Configuration for the J2EE Client

    Packaging configuration /home/continuum/continuum-1.0.2/apps/continuum/work/68/configs/client-corba/target/plan/plan.xml

Generated package /home/continuum/continuum-1.0.2/apps/continuum/work/68/configs/client-corba/target/client-corba-1.1-SNAPSHOT.car
car:prepare-plan:

car:package:

car:install:
    [echo] Installing...

+----------------------------------------
| configurations Configuration for application client deployments
| Memory: 61M/70M
+----------------------------------------
DEPRECATED: the default goal should be specified in the <build> section of project.xml instead of maven.xml
DEPRECATED: the default goal should be specified in the <build> section of project.xml instead of maven.xml

build:end:

Attempting to download activemq-core-3.2.1.jar.
2/978K
3/978K
5/978K
6/978K
8/978K
9/978K
11/978K
12/978K
13/978K
15/978K
16/978K
18/978K
19/978K
20/978K
22/978K
23/978K
25/978K
26/978K
27/978K
29/978K
30/978K
32/978K
33/978K
35/978K
36/978K
37/978K
39/978K
40/978K
42/978K
43/978K
44/978K
46/978K
47/978K
49/978K
50/978K
52/978K
53/978K
54/978K
56/978K
57/978K
59/978K
60/978K
61/978K
64/978K
65/978K
66/978K
68/978K
69/978K
71/978K
72/978K
73/978K
75/978K
76/978K
78/978K
79/978K
80/978K
82/978K
83/978K
85/978K
86/978K
88/978K
89/978K
90/978K
92/978K
93/978K
95/978K
96/978K
97/978K
99/978K
100/978K
102/978K
103/978K
105/978K
106/978K
107/978K
109/978K
110/978K
112/978K
113/978K
114/978K
116/978K
117/978K
119/978K
120/978K
121/978K
123/978K
124/978K
126/978K
127/978K
129/978K
130/978K
131/978K
133/978K
134/978K
136/978K
137/978K
138/978K
140/978K
141/978K
143/978K
144/978K
146/978K
147/978K
148/978K
150/978K
151/978K
153/978K
154/978K
155/978K
157/978K
158/978K
160/978K
161/978K
162/978K
164/978K
165/978K
167/978K
168/978K
170/978K
171/978K
172/978K
174/978K
175/978K
177/978K
178/978K
179/978K
181/978K
182/978K
184/978K
185/978K
187/978K
188/978K
189/978K
191/978K
192/978K
194/978K
195/978K
196/978K
198/978K
199/978K
201/978K
202/978K
203/978K
205/978K
206/978K
208/978K
209/978K
211/978K
212/978K
213/978K
215/978K
216/978K
218/978K
219/978K
220/978K
222/978K
223/978K
225/978K
226/978K
228/978K
229/978K
230/978K
232/978K
233/978K
235/978K
236/978K
237/978K
239/978K
240/978K
242/978K
243/978K
245/978K
246/978K
247/978K
249/978K
250/978K
252/978K
253/978K
254/978K
256/978K
257/978K
259/978K
260/978K
261/978K
263/978K
264/978K
266/978K
267/978K
269/978K
270/978K
271/978K
273/978K
274/978K
276/978K
277/978K
278/978K
280/978K
281/978K
283/978K
284/978K
286/978K
287/978K
288/978K
290/978K
291/978K
293/978K
294/978K
295/978K
297/978K
298/978K
300/978K
301/978K
302/978K
304/978K
305/978K
307/978K
308/978K
310/978K
311/978K
312/978K
314/978K
315/978K
317/978K
318/978K
319/978K
321/978K
322/978K
324/978K
325/978K
327/978K
328/978K
329/978K
331/978K
332/978K
334/978K
335/978K
336/978K
338/978K
339/978K
341/978K
342/978K
343/978K
345/978K
346/978K
348/978K
349/978K
351/978K
352/978K
353/978K
355/978K
356/978K
358/978K
359/978K
360/978K
362/978K
363/978K
365/978K
366/978K
368/978K
369/978K
370/978K
372/978K
373/978K
375/978K
376/978K
377/978K
379/978K
380/978K
382/978K
383/978K
384/978K
386/978K
387/978K
389/978K
390/978K
392/978K
393/978K
394/978K
396/978K
397/978K
399/978K
400/978K
401/978K
403/978K
404/978K
406/978K
407/978K
409/978K
410/978K
411/978K
413/978K
414/978K
416/978K
417/978K
418/978K
420/978K
421/978K
423/978K
424/978K
426/978K
427/978K
428/978K
430/978K
431/978K
433/978K
434/978K
435/978K
437/978K
438/978K
440/978K
441/978K
442/978K
444/978K
445/978K
447/978K
448/978K
450/978K
451/978K
452/978K
454/978K
455/978K
457/978K
458/978K
459/978K
461/978K
462/978K
464/978K
465/978K
467/978K
468/978K
469/978K
471/978K
472/978K
474/978K
475/978K
476/978K
478/978K
479/978K
481/978K
482/978K
483/978K
485/978K
486/978K
488/978K
489/978K
491/978K
492/978K
493/978K
495/978K
496/978K
498/978K
499/978K
500/978K
502/978K
503/978K
505/978K
506/978K
508/978K
509/978K
510/978K
512/978K
513/978K
515/978K
516/978K
517/978K
519/978K
520/978K
522/978K
523/978K
524/978K
526/978K
527/978K
529/978K
530/978K
532/978K
533/978K
534/978K
536/978K
537/978K
539/978K
540/978K
541/978K
543/978K
544/978K
546/978K
547/978K
549/978K
550/978K
551/978K
553/978K
554/978K
556/978K
557/978K
558/978K
560/978K
561/978K
563/978K
564/978K
565/978K
567/978K
568/978K
570/978K
571/978K
573/978K
574/978K
575/978K
577/978K
578/978K
580/978K
581/978K
582/978K
584/978K
585/978K
587/978K
588/978K
590/978K
591/978K
592/978K
594/978K
595/978K
597/978K
598/978K
599/978K
601/978K
602/978K
604/978K
605/978K
607/978K
608/978K
609/978K
611/978K
612/978K
614/978K
615/978K
616/978K
618/978K
619/978K
621/978K
622/978K
623/978K
625/978K
626/978K
628/978K
629/978K
631/978K
632/978K
633/978K
635/978K
636/978K
638/978K
639/978K
640/978K
642/978K
643/978K
645/978K
646/978K
648/978K
649/978K
650/978K
652/978K
653/978K
655/978K
656/978K
657/978K
659/978K
660/978K
662/978K
663/978K
664/978K
666/978K
667/978K
669/978K
670/978K
672/978K
673/978K
674/978K
676/978K
677/978K
679/978K
680/978K
681/978K
683/978K
684/978K
686/978K
687/978K
688/978K
690/978K
691/978K
693/978K
694/978K
696/978K
697/978K
698/978K
700/978K
701/978K
703/978K
704/978K
705/978K
707/978K
708/978K
710/978K
711/978K
713/978K
714/978K
715/978K
717/978K
718/978K
720/978K
721/978K
722/978K
724/978K
725/978K
727/978K
728/978K
729/978K
731/978K
732/978K
734/978K
735/978K
737/978K
738/978K
739/978K
741/978K
742/978K
744/978K
745/978K
746/978K
748/978K
749/978K
751/978K
752/978K
754/978K
755/978K
756/978K
758/978K
759/978K
761/978K
762/978K
763/978K
765/978K
766/978K
768/978K
769/978K
770/978K
772/978K
773/978K
775/978K
776/978K
778/978K
779/978K
780/978K
782/978K
783/978K
785/978K
786/978K
787/978K
789/978K
790/978K
792/978K
793/978K
795/978K
796/978K
797/978K
799/978K
800/978K
802/978K
803/978K
804/978K
806/978K
807/978K
809/978K
810/978K
811/978K
813/978K
814/978K
816/978K
817/978K
819/978K
820/978K
821/978K
823/978K
824/978K
826/978K
827/978K
828/978K
830/978K
831/978K
833/978K
834/978K
836/978K
837/978K
838/978K
840/978K
841/978K
843/978K
844/978K
845/978K
847/978K
848/978K
850/978K
851/978K
853/978K
854/978K
855/978K
857/978K
858/978K
860/978K
861/978K
862/978K
864/978K
865/978K
867/978K
868/978K
869/978K
871/978K
872/978K
874/978K
875/978K
877/978K
878/978K
879/978K
881/978K
882/978K
884/978K
885/978K
886/978K
888/978K
889/978K
891/978K
892/978K
894/978K
895/978K
896/978K
898/978K
899/978K
901/978K
902/978K
903/978K
905/978K
906/978K
908/978K
909/978K
910/978K
912/978K
913/978K
915/978K
916/978K
918/978K
919/978K
920/978K
922/978K
923/978K
925/978K
926/978K
927/978K
929/978K
930/978K
932/978K
933/978K
935/978K
936/978K
937/978K
939/978K
940/978K
942/978K
943/978K
944/978K
946/978K
947/978K
949/978K
950/978K
951/978K
953/978K
954/978K
956/978K
957/978K
959/978K
960/978K
961/978K
963/978K
964/978K
966/978K
967/978K
968/978K
970/978K
971/978K
973/978K
974/978K
976/978K
977/978K
978/978K
978K downloaded
build:start:

multiproject:install-callback:
    [echo] Running car:install for Configuration for application client deployments

    Packaging configuration /home/continuum/continuum-1.0.2/apps/continuum/work/68/configs/client-deployer/target/plan/plan.xml

Generated package /home/continuum/continuum-1.0.2/apps/continuum/work/68/configs/client-deployer/target/client-deployer-1.1-SNAPSHOT.car
car:prepare-plan:

car:package:

car:install:
    [echo] Installing...

+----------------------------------------
| configurations Security Configuration for the J2EE Client
| Memory: 42M/70M
+----------------------------------------
DEPRECATED: the default goal should be specified in the <build> section of project.xml instead of maven.xml
DEPRECATED: the default goal should be specified in the <build> section of project.xml instead of maven.xml

build:end:

build:start:

multiproject:install-callback:
    [echo] Running car:install for Security Configuration for the J2EE Client

    Packaging configuration /home/continuum/continuum-1.0.2/apps/continuum/work/68/configs/client-security/target/plan/plan.xml

Generated package /home/continuum/continuum-1.0.2/apps/continuum/work/68/configs/client-security/target/client-security-1.1-SNAPSHOT.car
car:prepare-plan:

car:package:

car:install:
    [echo] Installing...

+----------------------------------------
| configurations Security Configuration for the J2EE Server
| Memory: 42M/70M
+----------------------------------------
DEPRECATED: the default goal should be specified in the <build> section of project.xml instead of maven.xml
DEPRECATED: the default goal should be specified in the <build> section of project.xml instead of maven.xml

build:end:

build:start:

multiproject:install-callback:
    [echo] Running car:install for Security Configuration for the J2EE Server

    Packaging configuration /home/continuum/continuum-1.0.2/apps/continuum/work/68/configs/j2ee-security/target/plan/plan.xml

Generated package /home/continuum/continuum-1.0.2/apps/continuum/work/68/configs/j2ee-security/target/j2ee-security-1.1-SNAPSHOT.car
car:prepare-plan:

car:package:

car:install:
    [echo] Installing...

+----------------------------------------
| configurations Jetty Configuration for the J2EE Server
| Memory: 46M/70M
+----------------------------------------
DEPRECATED: the default goal should be specified in the <build> section of project.xml instead of maven.xml
DEPRECATED: the default goal should be specified in the <build> section of project.xml instead of maven.xml

build:end:

Attempting to download j2ee-security-1.1-SNAPSHOT.car.
build:start:

multiproject:install-callback:
    [echo] Running car:install for Jetty Configuration for the J2EE Server

    Packaging configuration /home/continuum/continuum-1.0.2/apps/continuum/work/68/configs/jetty/target/plan/plan.xml

Generated package /home/continuum/continuum-1.0.2/apps/continuum/work/68/configs/jetty/target/jetty-1.1-SNAPSHOT.car
car:prepare-plan:

car:package:

car:install:
    [echo] Installing...

+----------------------------------------
| configurations Jetty Deployer Configuration for the J2EE Server
| Memory: 47M/70M
+----------------------------------------
DEPRECATED: the default goal should be specified in the <build> section of project.xml instead of maven.xml
DEPRECATED: the default goal should be specified in the <build> section of project.xml instead of maven.xml

build:end:

Attempting to download jetty-1.1-SNAPSHOT.car.
build:start:

multiproject:install-callback:
    [echo] Running car:install for Jetty Deployer Configuration for the J2EE Server

    Packaging configuration /home/continuum/continuum-1.0.2/apps/continuum/work/68/configs/jetty-deployer/target/plan/plan.xml

Generated package /home/continuum/continuum-1.0.2/apps/continuum/work/68/configs/jetty-deployer/target/jetty-deployer-1.1-SNAPSHOT.car
car:prepare-plan:

car:package:

car:install:
    [echo] Installing...

+----------------------------------------
| configurations Web console deployed on jetty
| Memory: 52M/70M
+----------------------------------------
DEPRECATED: the default goal should be specified in the <build> section of project.xml instead of maven.xml
DEPRECATED: the default goal should be specified in the <build> section of project.xml instead of maven.xml

build:end:

Attempting to download jetty-deployer-1.1-SNAPSHOT.car.
Attempting to download activemq-gbean-3.2.4-SNAPSHOT.jar.
build:start:

multiproject:install-callback:
    [echo] Running car:install for Web console deployed on jetty

    Packaging configuration /home/continuum/continuum-1.0.2/apps/continuum/work/68/configs/console-jetty/target/plan/plan.xml

Generated package /home/continuum/continuum-1.0.2/apps/continuum/work/68/configs/console-jetty/target/webconsole-jetty-1.1-SNAPSHOT.car
car:prepare-plan:

car:package:

car:install:
    [echo] Installing...

+----------------------------------------
| configurations Tomcat Configuration for the J2EE Server
| Memory: 44M/76M
+----------------------------------------
DEPRECATED: the default goal should be specified in the <build> section of project.xml instead of maven.xml
DEPRECATED: the default goal should be specified in the <build> section of project.xml instead of maven.xml

build:end:

build:start:

multiproject:install-callback:
    [echo] Running car:install for Tomcat Configuration for the J2EE Server

    Packaging configuration /home/continuum/continuum-1.0.2/apps/continuum/work/68/configs/tomcat/target/plan/plan.xml

Generated package /home/continuum/continuum-1.0.2/apps/continuum/work/68/configs/tomcat/target/tomcat-1.1-SNAPSHOT.car
car:prepare-plan:

car:package:

car:install:
    [echo] Installing...

+----------------------------------------
| configurations Tomcat Deployer Configuration for the J2EE Server
| Memory: 48M/76M
+----------------------------------------
DEPRECATED: the default goal should be specified in the <build> section of project.xml instead of maven.xml
DEPRECATED: the default goal should be specified in the <build> section of project.xml instead of maven.xml

build:end:

Attempting to download tomcat-1.1-SNAPSHOT.car.
build:start:

multiproject:install-callback:
    [echo] Running car:install for Tomcat Deployer Configuration for the J2EE Server

    Packaging configuration /home/continuum/continuum-1.0.2/apps/continuum/work/68/configs/tomcat-deployer/target/plan/plan.xml

Generated package /home/continuum/continuum-1.0.2/apps/continuum/work/68/configs/tomcat-deployer/target/tomcat-deployer-1.1-SNAPSHOT.car
car:prepare-plan:

car:package:

car:install:
    [echo] Installing...

+----------------------------------------
| configurations Web console deployed on tomcat
| Memory: 52M/76M
+----------------------------------------
DEPRECATED: the default goal should be specified in the <build> section of project.xml instead of maven.xml
DEPRECATED: the default goal should be specified in the <build> section of project.xml instead of maven.xml

build:end:

Attempting to download tomcat-deployer-1.1-SNAPSHOT.car.
build:start:

multiproject:install-callback:
    [echo] Running car:install for Web console deployed on tomcat

    Packaging configuration /home/continuum/continuum-1.0.2/apps/continuum/work/68/configs/console-tomcat/target/plan/plan.xml

Generated package /home/continuum/continuum-1.0.2/apps/continuum/work/68/configs/console-tomcat/target/webconsole-tomcat-1.1-SNAPSHOT.car
car:prepare-plan:

car:package:

car:install:
    [echo] Installing...

+----------------------------------------
| configurations Daytrader using derby deployed on jetty
| Memory: 58M/76M
+----------------------------------------
DEPRECATED: the default goal should be specified in the <build> section of project.xml instead of maven.xml
DEPRECATED: the default goal should be specified in the <build> section of project.xml instead of maven.xml

build:end:

Attempting to download geronimo-daytrader-derby-db-1.1-SNAPSHOT.jar.
Attempting to download daytrader-ear-1.1-SNAPSHOT.ear.
build:start:

multiproject:install-callback:
    [echo] Running car:install for Daytrader using derby deployed on jetty

    Packaging configuration /home/continuum/continuum-1.0.2/apps/continuum/work/68/configs/daytrader-jetty/target/plan/plan.xml

Retrieving document at 'WEB-INF/wsdl/TradeServices.wsdl'.
Retrieving document at 'META-INF/wsdl/TradeServices.wsdl'.
Retrieving document at 'WEB-INF/wsdl/TradeServices.wsdl'.
Generated package /home/continuum/continuum-1.0.2/apps/continuum/work/68/configs/daytrader-jetty/target/daytrader-derby-jetty-1.1-SNAPSHOT.car
car:prepare-plan:

car:package:

car:install:
    [echo] Installing...

+----------------------------------------
| configurations Daytrader using derby deployed on tomcat
| Memory: 57M/87M
+----------------------------------------
DEPRECATED: the default goal should be specified in the <build> section of project.xml instead of maven.xml
DEPRECATED: the default goal should be specified in the <build> section of project.xml instead of maven.xml

build:end:

build:start:

multiproject:install-callback:
    [echo] Running car:install for Daytrader using derby deployed on tomcat

    Packaging configuration /home/continuum/continuum-1.0.2/apps/continuum/work/68/configs/daytrader-tomcat/target/plan/plan.xml

Retrieving document at 'WEB-INF/wsdl/TradeServices.wsdl'.
Retrieving document at 'META-INF/wsdl/TradeServices.wsdl'.
Retrieving document at 'WEB-INF/wsdl/TradeServices.wsdl'.
Generated package /home/continuum/continuum-1.0.2/apps/continuum/work/68/configs/daytrader-tomcat/target/daytrader-derby-tomcat-1.1-SNAPSHOT.car
car:prepare-plan:

car:package:

car:install:
    [echo] Installing...

+----------------------------------------
| configurations Directory Configuration
| Memory: 67M/87M
+----------------------------------------
DEPRECATED: the default goal should be specified in the <build> section of project.xml instead of maven.xml
DEPRECATED: the default goal should be specified in the <build> section of project.xml instead of maven.xml

build:end:

Attempting to download geronimo-directory-1.1-SNAPSHOT.jar.
build:start:

multiproject:install-callback:
    [echo] Running car:install for Directory Configuration

    Packaging configuration /home/continuum/continuum-1.0.2/apps/continuum/work/68/configs/directory/target/plan/plan.xml

Generated package /home/continuum/continuum-1.0.2/apps/continuum/work/68/configs/directory/target/directory-1.1-SNAPSHOT.car
car:prepare-plan:

car:package:

car:install:
    [echo] Installing...

+----------------------------------------
| configurations Hot deployer
| Memory: 69M/87M
+----------------------------------------
DEPRECATED: the default goal should be specified in the <build> section of project.xml instead of maven.xml
DEPRECATED: the default goal should be specified in the <build> section of project.xml instead of maven.xml

build:end:

Attempting to download geronimo-hot-deploy-1.1-SNAPSHOT.jar.
build:start:

multiproject:install-callback:
    [echo] Running car:install for Hot deployer

    Packaging configuration /home/continuum/continuum-1.0.2/apps/continuum/work/68/configs/hot-deployer/target/plan/plan.xml

Generated package /home/continuum/continuum-1.0.2/apps/continuum/work/68/configs/hot-deployer/target/hot-deployer-1.1-SNAPSHOT.car
car:prepare-plan:

car:package:

car:install:
    [echo] Installing...

+----------------------------------------
| configurations Corba Configuration for the J2EE Server
| Memory: 72M/87M
+----------------------------------------
DEPRECATED: the default goal should be specified in the <build> section of project.xml instead of maven.xml
DEPRECATED: the default goal should be specified in the <build> section of project.xml instead of maven.xml

build:end:

build:start:

multiproject:install-callback:
    [echo] Running car:install for Corba Configuration for the J2EE Server

    Packaging configuration /home/continuum/continuum-1.0.2/apps/continuum/work/68/configs/j2ee-corba/target/plan/plan.xml

Generated package /home/continuum/continuum-1.0.2/apps/continuum/work/68/configs/j2ee-corba/target/j2ee-corba-1.1-SNAPSHOT.car
car:prepare-plan:

car:package:

car:install:
    [echo] Installing...

+----------------------------------------
| configurations JavaMail
| Memory: 79M/87M
+----------------------------------------
DEPRECATED: the default goal should be specified in the <build> section of project.xml instead of maven.xml
DEPRECATED: the default goal should be specified in the <build> section of project.xml instead of maven.xml

build:end:

Attempting to download geronimo-mail-1.1-SNAPSHOT.jar.
Attempting to download geronimo-javamail-transport-1.1-SNAPSHOT.jar.
build:start:

multiproject:install-callback:
    [echo] Running car:install for JavaMail

    Packaging configuration /home/continuum/continuum-1.0.2/apps/continuum/work/68/configs/javamail/target/plan/plan.xml

Generated package /home/continuum/continuum-1.0.2/apps/continuum/work/68/configs/javamail/target/javamail-1.1-SNAPSHOT.car
car:prepare-plan:

car:package:

car:install:
    [echo] Installing...

+----------------------------------------
| configurations JMX Debug app for Jetty
| Memory: 46M/87M
+----------------------------------------
DEPRECATED: the default goal should be specified in the <build> section of project.xml instead of maven.xml
DEPRECATED: the default goal should be specified in the <build> section of project.xml instead of maven.xml

build:end:

build:start:

multiproject:install-callback:
    [echo] Running car:install for JMX Debug app for Jetty

    Packaging configuration /home/continuum/continuum-1.0.2/apps/continuum/work/68/configs/jmxdebug-jetty/target/plan/plan.xml

Generated package /home/continuum/continuum-1.0.2/apps/continuum/work/68/configs/jmxdebug-jetty/target/jmxdebug-jetty-1.1-SNAPSHOT.car
car:prepare-plan:

car:package:

car:install:
    [echo] Installing...

+----------------------------------------
| configurations JMX Debug app Tomcat
| Memory: 50M/87M
+----------------------------------------
DEPRECATED: the default goal should be specified in the <build> section of project.xml instead of maven.xml
DEPRECATED: the default goal should be specified in the <build> section of project.xml instead of maven.xml

build:end:

build:start:

multiproject:install-callback:
    [echo] Running car:install for JMX Debug app Tomcat

    Packaging configuration /home/continuum/continuum-1.0.2/apps/continuum/work/68/configs/jmxdebug-tomcat/target/plan/plan.xml

Generated package /home/continuum/continuum-1.0.2/apps/continuum/work/68/configs/jmxdebug-tomcat/target/jmxdebug-tomcat-1.1-SNAPSHOT.car
car:prepare-plan:

car:package:

car:install:
    [echo] Installing...

+----------------------------------------
| configurations JSP Examples for Jetty
| Memory: 53M/87M
+----------------------------------------
DEPRECATED: the default goal should be specified in the <build> section of project.xml instead of maven.xml
DEPRECATED: the default goal should be specified in the <build> section of project.xml instead of maven.xml

build:end:

build:start:

multiproject:install-callback:
    [echo] Running car:install for JSP Examples for Jetty

    Packaging configuration /home/continuum/continuum-1.0.2/apps/continuum/work/68/configs/jsp-examples-jetty/target/plan/plan.xml

Generated package /home/continuum/continuum-1.0.2/apps/continuum/work/68/configs/jsp-examples-jetty/target/jsp-examples-jetty-1.1-SNAPSHOT.car
car:prepare-plan:

car:package:

car:install:
    [echo] Installing...

+----------------------------------------
| configurations JSP Examples Tomcat
| Memory: 54M/87M
+----------------------------------------
DEPRECATED: the default goal should be specified in the <build> section of project.xml instead of maven.xml
DEPRECATED: the default goal should be specified in the <build> section of project.xml instead of maven.xml

build:end:

build:start:

multiproject:install-callback:
    [echo] Running car:install for JSP Examples Tomcat

    Packaging configuration /home/continuum/continuum-1.0.2/apps/continuum/work/68/configs/jsp-examples-tomcat/target/plan/plan.xml

Generated package /home/continuum/continuum-1.0.2/apps/continuum/work/68/configs/jsp-examples-tomcat/target/jsp-examples-tomcat-1.1-SNAPSHOT.car
car:prepare-plan:

car:package:

car:install:
    [echo] Installing...

+----------------------------------------
| configurations LDAP security realm
| Memory: 61M/87M
+----------------------------------------
DEPRECATED: the default goal should be specified in the <build> section of project.xml instead of maven.xml
DEPRECATED: the default goal should be specified in the <build> section of project.xml instead of maven.xml

build:end:

build:start:

multiproject:install-callback:
    [echo] Running car:install for LDAP security realm

    Packaging configuration /home/continuum/continuum-1.0.2/apps/continuum/work/68/configs/ldap-realm/target/plan/plan.xml

Generated package /home/continuum/continuum-1.0.2/apps/continuum/work/68/configs/ldap-realm/target/ldap-realm-1.1-SNAPSHOT.car
car:prepare-plan:

car:package:

car:install:
    [echo] Installing...

+----------------------------------------
| configurations LDAP Demo for Jetty
| Memory: 61M/87M
+----------------------------------------
DEPRECATED: the default goal should be specified in the <build> section of project.xml instead of maven.xml
DEPRECATED: the default goal should be specified in the <build> section of project.xml instead of maven.xml

build:end:

Attempting to download ldap-realm-1.1-SNAPSHOT.car.
Attempting to download geronimo-ldap-demo-1.1-SNAPSHOT.war.
build:start:

multiproject:install-callback:
    [echo] Running car:install for LDAP Demo for Jetty

    Packaging configuration /home/continuum/continuum-1.0.2/apps/continuum/work/68/configs/ldap-demo-jetty/target/plan/plan.xml

Generated package /home/continuum/continuum-1.0.2/apps/continuum/work/68/configs/ldap-demo-jetty/target/ldap-demo-jetty-1.1-SNAPSHOT.car
car:prepare-plan:

car:package:

car:install:
    [echo] Installing...

+----------------------------------------
| configurations LDAP Demo for Tomcat
| Memory: 66M/87M
+----------------------------------------
DEPRECATED: the default goal should be specified in the <build> section of project.xml instead of maven.xml
DEPRECATED: the default goal should be specified in the <build> section of project.xml instead of maven.xml

build:end:

build:start:

multiproject:install-callback:
    [echo] Running car:install for LDAP Demo for Tomcat

    Packaging configuration /home/continuum/continuum-1.0.2/apps/continuum/work/68/configs/ldap-demo-tomcat/target/plan/plan.xml

Generated package /home/continuum/continuum-1.0.2/apps/continuum/work/68/configs/ldap-demo-tomcat/target/ldap-demo-tomcat-1.1-SNAPSHOT.car
car:prepare-plan:

car:package:

car:install:
    [echo] Installing...

+----------------------------------------
| configurations Online Deployer
| Memory: 69M/87M
+----------------------------------------
DEPRECATED: the default goal should be specified in the <build> section of project.xml instead of maven.xml
DEPRECATED: the default goal should be specified in the <build> section of project.xml instead of maven.xml

build:end:

build:start:

multiproject:install-callback:
    [echo] Running car:install for Online Deployer

    Packaging configuration /home/continuum/continuum-1.0.2/apps/continuum/work/68/configs/online-deployer/target/plan/plan.xml

Generated package /home/continuum/continuum-1.0.2/apps/continuum/work/68/configs/online-deployer/target/online-deployer-1.1-SNAPSHOT.car
car:prepare-plan:

car:package:

car:install:
    [echo] Installing...
Uploading to geronimo/cars/online-deployer-1.1-SNAPSHOT.car: 
.................... (1K)
Uploading to geronimo/poms/online-deployer-1.1-SNAPSHOT.pom: 
.................... (12K)

+----------------------------------------
| configurations openejb Configuration for the J2EE Server
| Memory: 68M/87M
+----------------------------------------
DEPRECATED: the default goal should be specified in the <build> section of project.xml instead of maven.xml
DEPRECATED: the default goal should be specified in the <build> section of project.xml instead of maven.xml

build:end:

build:start:

multiproject:install-callback:
    [echo] Running car:install for openejb Configuration for the J2EE Server

    Packaging configuration /home/continuum/continuum-1.0.2/apps/continuum/work/68/configs/openejb/target/plan/plan.xml

Generated package /home/continuum/continuum-1.0.2/apps/continuum/work/68/configs/openejb/target/openejb-1.1-SNAPSHOT.car
car:prepare-plan:

car:package:

car:install:
    [echo] Installing...

+----------------------------------------
| configurations openejb Configuration for performing J2EE deployments
| Memory: 73M/87M
+----------------------------------------
DEPRECATED: the default goal should be specified in the <build> section of project.xml instead of maven.xml
DEPRECATED: the default goal should be specified in the <build> section of project.xml instead of maven.xml

build:end:

Attempting to download openejb-1.1-SNAPSHOT.car.
build:start:

multiproject:install-callback:
    [echo] Running car:install for openejb Configuration for performing J2EE deployments

    Packaging configuration /home/continuum/continuum-1.0.2/apps/continuum/work/68/configs/openejb-deployer/target/plan/plan.xml

Generated package /home/continuum/continuum-1.0.2/apps/continuum/work/68/configs/openejb-deployer/target/openejb-deployer-1.1-SNAPSHOT.car
car:prepare-plan:

car:package:

car:install:
    [echo] Installing...

+----------------------------------------
| configurations Geronimo :: Remote Deploy Jetty Application
| Memory: 76M/87M
+----------------------------------------
DEPRECATED: the default goal should be specified in the <build> section of project.xml instead of maven.xml
DEPRECATED: the default goal should be specified in the <build> section of project.xml instead of maven.xml

build:end:

build:start:

multiproject:install-callback:
    [echo] Running car:install for Geronimo :: Remote Deploy Jetty Application

    Packaging configuration /home/continuum/continuum-1.0.2/apps/continuum/work/68/configs/remote-deploy-jetty/target/plan/plan.xml

Generated package /home/continuum/continuum-1.0.2/apps/continuum/work/68/configs/remote-deploy-jetty/target/remote-deploy-jetty-1.1-SNAPSHOT.car
car:prepare-plan:

car:package:

car:install:
    [echo] Installing...

+----------------------------------------
| configurations Geronimo :: Remote Deploy Tomcat Application
| Memory: 80M/87M
+----------------------------------------
DEPRECATED: the default goal should be specified in the <build> section of project.xml instead of maven.xml
DEPRECATED: the default goal should be specified in the <build> section of project.xml instead of maven.xml

build:end:

build:start:

multiproject:install-callback:
    [echo] Running car:install for Geronimo :: Remote Deploy Tomcat Application

    Packaging configuration /home/continuum/continuum-1.0.2/apps/continuum/work/68/configs/remote-deploy-tomcat/target/plan/plan.xml

Generated package /home/continuum/continuum-1.0.2/apps/continuum/work/68/configs/remote-deploy-tomcat/target/remote-deploy-tomcat-1.1-SNAPSHOT.car
car:prepare-plan:

car:package:

car:install:
    [echo] Installing...

+----------------------------------------
| configurations Servlet Examples for Jetty
| Memory: 84M/87M
+----------------------------------------
DEPRECATED: the default goal should be specified in the <build> section of project.xml instead of maven.xml
DEPRECATED: the default goal should be specified in the <build> section of project.xml instead of maven.xml

build:end:

build:start:

multiproject:install-callback:
    [echo] Running car:install for Servlet Examples for Jetty

    Packaging configuration /home/continuum/continuum-1.0.2/apps/continuum/work/68/configs/servlets-examples-jetty/target/plan/plan.xml

Generated package /home/continuum/continuum-1.0.2/apps/continuum/work/68/configs/servlets-examples-jetty/target/servlets-examples-jetty-1.1-SNAPSHOT.car
car:prepare-plan:

car:package:

car:install:
    [echo] Installing...

+----------------------------------------
| configurations Servlet Examples Tomcat
| Memory: 50M/87M
+----------------------------------------
DEPRECATED: the default goal should be specified in the <build> section of project.xml instead of maven.xml
DEPRECATED: the default goal should be specified in the <build> section of project.xml instead of maven.xml

build:end:

build:start:

multiproject:install-callback:
    [echo] Running car:install for Servlet Examples Tomcat

    Packaging configuration /home/continuum/continuum-1.0.2/apps/continuum/work/68/configs/servlets-examples-tomcat/target/plan/plan.xml

Generated package /home/continuum/continuum-1.0.2/apps/continuum/work/68/configs/servlets-examples-tomcat/target/servlets-examples-tomcat-1.1-SNAPSHOT.car
car:prepare-plan:

car:package:

car:install:
    [echo] Installing...

+----------------------------------------
| configurations Shared Library GBean
| Memory: 54M/87M
+----------------------------------------
DEPRECATED: the default goal should be specified in the <build> section of project.xml instead of maven.xml
DEPRECATED: the default goal should be specified in the <build> section of project.xml instead of maven.xml

build:end:

build:start:

multiproject:install-callback:
    [echo] Running car:install for Shared Library GBean

    Packaging configuration /home/continuum/continuum-1.0.2/apps/continuum/work/68/configs/sharedlib/target/plan/plan.xml

Generated package /home/continuum/continuum-1.0.2/apps/continuum/work/68/configs/sharedlib/target/sharedlib-1.1-SNAPSHOT.car
car:prepare-plan:

car:package:

car:install:
    [echo] Installing...

+----------------------------------------
| configurations Shutdown
| Memory: 58M/87M
+----------------------------------------
DEPRECATED: the default goal should be specified in the <build> section of project.xml instead of maven.xml
DEPRECATED: the default goal should be specified in the <build> section of project.xml instead of maven.xml

build:end:

build:start:

multiproject:install-callback:
    [echo] Running car:install for Shutdown

    Packaging configuration /home/continuum/continuum-1.0.2/apps/continuum/work/68/configs/shutdown/target/plan/plan.xml

Generated package /home/continuum/continuum-1.0.2/apps/continuum/work/68/configs/shutdown/target/shutdown-1.1-SNAPSHOT.car
car:prepare-plan:

car:package:

car:install:
    [echo] Installing...
Uploading to geronimo/cars/shutdown-1.1-SNAPSHOT.car: 
.................... (1K)
Uploading to geronimo/poms/shutdown-1.1-SNAPSHOT.pom: 
.................... (11K)

+----------------------------------------
| configurations UDDI server Configuration for the J2EE Jetty Server
| Memory: 57M/87M
+----------------------------------------
DEPRECATED: the default goal should be specified in the <build> section of project.xml instead of maven.xml
DEPRECATED: the default goal should be specified in the <build> section of project.xml instead of maven.xml

build:end:

Attempting to download geronimo-uddi-db-1.1-SNAPSHOT.jar.
build:start:

multiproject:install-callback:
    [echo] Running car:install for UDDI server Configuration for the J2EE Jetty Server

    Packaging configuration /home/continuum/continuum-1.0.2/apps/continuum/work/68/configs/uddi-jetty/target/plan/plan.xml

Generated package /home/continuum/continuum-1.0.2/apps/continuum/work/68/configs/uddi-jetty/target/uddi-jetty-1.1-SNAPSHOT.car
car:prepare-plan:

car:package:

car:install:
    [echo] Installing...

+----------------------------------------
| configurations UDDI server Configuration for the J2EE Tomcat Server
| Memory: 65M/87M
+----------------------------------------
DEPRECATED: the default goal should be specified in the <build> section of project.xml instead of maven.xml
DEPRECATED: the default goal should be specified in the <build> section of project.xml instead of maven.xml

build:end:

build:start:

multiproject:install-callback:
    [echo] Running car:install for UDDI server Configuration for the J2EE Tomcat Server

    Packaging configuration /home/continuum/continuum-1.0.2/apps/continuum/work/68/configs/uddi-tomcat/target/plan/plan.xml

Generated package /home/continuum/continuum-1.0.2/apps/continuum/work/68/configs/uddi-tomcat/target/uddi-tomcat-1.1-SNAPSHOT.car
car:prepare-plan:

car:package:

car:install:
    [echo] Installing...

+----------------------------------------
| configurations Configuration for no j2ee app clients
| Memory: 67M/87M
+----------------------------------------
DEPRECATED: the default goal should be specified in the <build> section of project.xml instead of maven.xml
DEPRECATED: the default goal should be specified in the <build> section of project.xml instead of maven.xml

build:end:

build:start:

multiproject:install-callback:
    [echo] Running car:install for Configuration for no j2ee app clients

    Packaging configuration /home/continuum/continuum-1.0.2/apps/continuum/work/68/configs/unavailable-client-deployer/target/plan/plan.xml

Generated package /home/continuum/continuum-1.0.2/apps/continuum/work/68/configs/unavailable-client-deployer/target/unavailable-client-deployer-1.1-SNAPSHOT.car
car:prepare-plan:

car:package:

car:install:
    [echo] Installing...

+----------------------------------------
| configurations Configuration for no EJBs
| Memory: 70M/87M
+----------------------------------------
DEPRECATED: the default goal should be specified in the <build> section of project.xml instead of maven.xml
DEPRECATED: the default goal should be specified in the <build> section of project.xml instead of maven.xml

build:end:

build:start:

multiproject:install-callback:
    [echo] Running car:install for Configuration for no EJBs

    Packaging configuration /home/continuum/continuum-1.0.2/apps/continuum/work/68/configs/unavailable-ejb-deployer/target/plan/plan.xml

Generated package /home/continuum/continuum-1.0.2/apps/continuum/work/68/configs/unavailable-ejb-deployer/target/unavailable-ejb-deployer-1.1-SNAPSHOT.car
car:prepare-plan:

car:package:

car:install:
    [echo] Installing...

+----------------------------------------
| configurations Unavailable Web Services deployer
| Memory: 73M/87M
+----------------------------------------
DEPRECATED: the default goal should be specified in the <build> section of project.xml instead of maven.xml
DEPRECATED: the default goal should be specified in the <build> section of project.xml instead of maven.xml

build:end:

build:start:

multiproject:install-callback:
    [echo] Running car:install for Unavailable Web Services deployer

    Packaging configuration /home/continuum/continuum-1.0.2/apps/continuum/work/68/configs/unavailable-webservices-deployer/target/plan/plan.xml

Generated package /home/continuum/continuum-1.0.2/apps/continuum/work/68/configs/unavailable-webservices-deployer/target/unavailable-webservices-deployer-1.1-SNAPSHOT.car
car:prepare-plan:

car:package:

car:install:
    [echo] Installing...

+----------------------------------------
| configurations Welcome app for Jetty
| Memory: 76M/87M
+----------------------------------------
DEPRECATED: the default goal should be specified in the <build> section of project.xml instead of maven.xml
DEPRECATED: the default goal should be specified in the <build> section of project.xml instead of maven.xml

build:end:

build:start:

multiproject:install-callback:
    [echo] Running car:install for Welcome app for Jetty

    Packaging configuration /home/continuum/continuum-1.0.2/apps/continuum/work/68/configs/welcome-jetty/target/plan/plan.xml

Generated package /home/continuum/continuum-1.0.2/apps/continuum/work/68/configs/welcome-jetty/target/welcome-jetty-1.1-SNAPSHOT.car
car:prepare-plan:

car:package:

car:install:
    [echo] Installing...

+----------------------------------------
| configurations Welcome app Tomcat
| Memory: 79M/87M
+----------------------------------------
DEPRECATED: the default goal should be specified in the <build> section of project.xml instead of maven.xml
DEPRECATED: the default goal should be specified in the <build> section of project.xml instead of maven.xml

build:end:

build:start:

multiproject:install-callback:
    [echo] Running car:install for Welcome app Tomcat

    Packaging configuration /home/continuum/continuum-1.0.2/apps/continuum/work/68/configs/welcome-tomcat/target/plan/plan.xml

Generated package /home/continuum/continuum-1.0.2/apps/continuum/work/68/configs/welcome-tomcat/target/welcome-tomcat-1.1-SNAPSHOT.car
car:prepare-plan:

car:package:

car:install:
    [echo] Installing...


build:end:


Starting the reactor...
Our processing order:
Geronimo Assembly for an IZPack Installer
Geronimo Assembly for a J2EE Server running Jetty
Geronimo Assembly for a J2EE Server running Tomcat
Geronimo Assembly for a Web Server running Tomcat
+----------------------------------------
| assemblies Geronimo Assembly for an IZPack Installer
| Memory: 71M/87M
+----------------------------------------
DEPRECATED: the default goal should be specified in the <build> section of project.xml instead of maven.xml
DEPRECATED: the default goal should be specified in the <build> section of project.xml instead of maven.xml
new5:
Attempting to download geronimo-installer-support-1.1-SNAPSHOT.jar.
Attempting to download geronimo-izpack-plugin-1.1-SNAPSHOT.jar.
Attempting to download j2ee-corba-1.1-SNAPSHOT.car.
Attempting to download directory-1.1-SNAPSHOT.car.
Attempting to download activemq-1.1-SNAPSHOT.car.
Attempting to download hot-deployer-1.1-SNAPSHOT.car.
Attempting to download welcome-jetty-1.1-SNAPSHOT.car.
Attempting to download servlets-examples-jetty-1.1-SNAPSHOT.car.
Attempting to download jsp-examples-jetty-1.1-SNAPSHOT.car.
Attempting to download webconsole-jetty-1.1-SNAPSHOT.car.
Attempting to download remote-deploy-jetty-1.1-SNAPSHOT.car.
Error retrieving artifact from [http://cvs.apache.org/repository]: org.apache.maven.wagon.TransferFailedException: Connection timed out
Artifact /geronimo/cars/remote-deploy-jetty-1.1-SNAPSHOT.car doesn't exist in remote repository, but it exists locally.
Attempting to download jmxdebug-jetty-1.1-SNAPSHOT.car.
Attempting to download uddi-jetty-1.1-SNAPSHOT.car.
Attempting to download ldap-demo-tomcat-1.1-SNAPSHOT.car.
Attempting to download ldap-demo-jetty-1.1-SNAPSHOT.car.
Attempting to download welcome-tomcat-1.1-SNAPSHOT.car.
Attempting to download servlets-examples-tomcat-1.1-SNAPSHOT.car.
Attempting to download jsp-examples-tomcat-1.1-SNAPSHOT.car.
Attempting to download webconsole-tomcat-1.1-SNAPSHOT.car.
Attempting to download remote-deploy-tomcat-1.1-SNAPSHOT.car.
Attempting to download jmxdebug-tomcat-1.1-SNAPSHOT.car.
Attempting to download uddi-tomcat-1.1-SNAPSHOT.car.
Attempting to download daytrader-derby-jetty-1.1-SNAPSHOT.car.
Attempting to download daytrader-derby-jetty-streamer-client-1.1-SNAPSHOT.car.
Attempting to download daytrader-derby-tomcat-1.1-SNAPSHOT.car.
Attempting to download daytrader-derby-tomcat-streamer-client-1.1-SNAPSHOT.car.
Attempting to download client-security-1.1-SNAPSHOT.car.
Attempting to download client-corba-1.1-SNAPSHOT.car.
Attempting to download sharedlib-1.1-SNAPSHOT.car.
Attempting to download geronimo-scripts-1.1-SNAPSHOT.jar.
Attempting to download online-deployer-1.1-SNAPSHOT.car.
Attempting to download shutdown-1.1-SNAPSHOT.car.
build:start:

multiproject:install-callback:
    [echo] Running assemble:install for Geronimo Assembly for an IZPack Installer
assemble:install:
clean:clean:
    [delete] Deleting directory /home/continuum/continuum-1.0.2/apps/continuum/work/68/assemblies/j2ee-installer/target

clean:

assemble:assemble-prepare:
    [mkdir] Created dir: /home/continuum/continuum-1.0.2/apps/continuum/work/68/assemblies/j2ee-installer/target/geronimo-1.1-SNAPSHOT
    [copy] Copying 15 files to /home/continuum/continuum-1.0.2/apps/continuum/work/68/assemblies/j2ee-installer/target/geronimo-1.1-SNAPSHOT

assemble:assemble-to-repo:
assemble:assemble-repository:
    [mkdir] Created dir: /home/continuum/continuum-1.0.2/apps/continuum/work/68/assemblies/j2ee-installer/target/geronimo-1.1-SNAPSHOT/repository
Copying cglib/cglib-nodep/2.1_3/jar
Copying commons-cli/commons-cli/1.0/jar
Copying commons-logging/commons-logging/1.0.4/jar
Copying geronimo/geronimo-common/1.1-SNAPSHOT/jar
Copying geronimo/geronimo-deployment/1.1-SNAPSHOT/jar
Copying geronimo/geronimo-kernel/1.1-SNAPSHOT/jar
Copying geronimo/geronimo-system/1.1-SNAPSHOT/jar
Copying org.apache.geronimo.specs/geronimo-qname_1.1_spec/1.0/jar
Copying log4j/log4j/1.2.8/jar
Copying mx4j/mx4j/3.0.1/jar
Copying mx4j/mx4j-remote/3.0.1/jar
Copying xerces/xercesImpl/2.6.2/jar
Copying xerces/xmlParserAPIs/2.2.1/jar
Copying geronimo/geronimo-deploy-jsr88/1.1-SNAPSHOT/jar
Copying geronimo/geronimo-deploy-tool/1.1-SNAPSHOT/jar
Copying geronimo/geronimo-util/1.1-SNAPSHOT/jar
Copying activemq/activemq-ra/3.2.4-SNAPSHOT/rar
Copying tranql/tranql-connector/1.1/rar
Copying tranql/tranql-connector-derby-embed-local/1.1/rar
Copying tranql/tranql-connector-derby-embed-xa/1.1/rar
Copying tranql/tranql-connector-derby-client-local/1.1/rar
Copying tranql/tranql-connector-derby-client-xa/1.1/rar
Copying org.apache.derby/derbyclient/10.1.1.0/jar
Copying org.apache.derby/derbytools/10.1.1.0/jar
Copying org.apache.geronimo.specs/geronimo-activation_1.0.2_spec/1.0/jar
Copying org.apache.geronimo.specs/geronimo-corba_2.3_spec/1.1-SNAPSHOT/jar
Copying org.apache.geronimo.specs/geronimo-ejb_2.1_spec/1.0/jar
Copying org.apache.geronimo.specs/geronimo-j2ee_1.4_spec/1.1-SNAPSHOT/jar
Copying org.apache.geronimo.specs/geronimo-j2ee-connector_1.5_spec/1.0/jar
Copying org.apache.geronimo.specs/geronimo-j2ee-deployment_1.1_spec/1.0/jar
Copying org.apache.geronimo.specs/geronimo-j2ee-jacc_1.0_spec/1.0/jar
Copying org.apache.geronimo.specs/geronimo-j2ee-management_1.0_spec/1.0/jar
Copying org.apache.geronimo.specs/geronimo-javamail_1.3.1_spec/1.1-SNAPSHOT/jar
Copying org.apache.geronimo.specs/geronimo-jaxr_1.0_spec/1.0/jar
Copying org.apache.geronimo.specs/geronimo-jaxrpc_1.1_spec/1.0/jar
Copying org.apache.geronimo.specs/geronimo-jms_1.1_spec/1.0/jar
Copying org.apache.geronimo.specs/geronimo-jsp_2.0_spec/1.0/jar
Copying org.apache.geronimo.specs/geronimo-jta_1.0.1B_spec/1.0/jar
Copying org.apache.geronimo.specs/geronimo-saaj_1.1_spec/1.0/jar
Copying org.apache.geronimo.specs/geronimo-servlet_2.4_spec/1.0/jar

assemble:assemble-lib:
    [mkdir] Created dir: /home/continuum/continuum-1.0.2/apps/continuum/work/68/assemblies/j2ee-installer/target/geronimo-1.1-SNAPSHOT/lib
    [copy] Copying 15 files to /home/continuum/continuum-1.0.2/apps/continuum/work/68/assemblies/j2ee-installer/target/geronimo-1.1-SNAPSHOT/lib
    [mkdir] Created dir: /home/continuum/continuum-1.0.2/apps/continuum/work/68/assemblies/j2ee-installer/target/geronimo-1.1-SNAPSHOT/lib/endorsed
    [copy] Copying 2 files to /home/continuum/continuum-1.0.2/apps/continuum/work/68/assemblies/j2ee-installer/target/geronimo-1.1-SNAPSHOT/lib/endorsed
    [mkdir] Created dir: /home/continuum/continuum-1.0.2/apps/continuum/work/68/assemblies/j2ee-installer/target/geronimo-1.1-SNAPSHOT/lib/ext

assemble:assemble-unpack:
    [unjar] Expanding: /home/continuum/.geronimo-1.1-maven/repository/geronimo/jars/geronimo-scripts-1.1-SNAPSHOT.jar into /home/continuum/continuum-1.0.2/apps/continuum/work/68/assemblies/j2ee-installer/target/geronimo-1.1-SNAPSHOT
    [delete] Deleting directory /home/continuum/continuum-1.0.2/apps/continuum/work/68/assemblies/j2ee-installer/target/geronimo-1.1-SNAPSHOT/META-INF

assemble:assemble-configurations-to-repo:
    [mkdir] Created dir: /home/continuum/continuum-1.0.2/apps/continuum/work/68/assemblies/j2ee-installer/target/geronimo-1.1-SNAPSHOT/config-store
Copying geronimo/j2ee-system/1.1-SNAPSHOT/car
############################################################
# Installed configuration
#   id = geronimo/j2ee-system/1.1-SNAPSHOT/car
#   location = /home/continuum/continuum-1.0.2/apps/continuum/work/68/assemblies/j2ee-installer/target/geronimo-1.1-SNAPSHOT/repository/geronimo/j2ee-system/1.1-SNAPSHOT/j2ee-system-1.1-SNAPSHOT.car
############################################################
Installed configuration geronimo/j2ee-system/1.1-SNAPSHOT/car
Copying xstream/xstream/1.1.3/jar
Copying xpp3/xpp3/1.1.3.3/jar
    [copy] Copying 1 file to /home/continuum/continuum-1.0.2/apps/continuum/work/68/assemblies/j2ee-installer/target/geronimo-1.1-SNAPSHOT/bin
Copying geronimo/rmi-naming/1.1-SNAPSHOT/car
############################################################
# Installed configuration
#   id = geronimo/rmi-naming/1.1-SNAPSHOT/car
#   location = /home/continuum/continuum-1.0.2/apps/continuum/work/68/assemblies/j2ee-installer/target/geronimo-1.1-SNAPSHOT/repository/geronimo/rmi-naming/1.1-SNAPSHOT/rmi-naming-1.1-SNAPSHOT.car
############################################################
Installed configuration geronimo/rmi-naming/1.1-SNAPSHOT/car
Installed configuration geronimo/j2ee-system/1.1-SNAPSHOT/car
Copying geronimo/geronimo-activation/1.1-SNAPSHOT/jar
Copying geronimo/geronimo-management/1.1-SNAPSHOT/jar
Copying geronimo/geronimo-j2ee/1.1-SNAPSHOT/jar
Copying geronimo/geronimo-core/1.1-SNAPSHOT/jar
Copying geronimo/geronimo-naming/1.1-SNAPSHOT/jar
Copying geronimo/geronimo-transaction/1.1-SNAPSHOT/jar
Copying geronimo/geronimo-security/1.1-SNAPSHOT/jar
Copying geronimo/geronimo-webservices/1.1-SNAPSHOT/jar
Copying concurrent/concurrent/1.3.4/jar
Copying tranql/tranql/1.2.1/jar
Copying howl/howl-logger/0.1.11/jar
Copying antlr/antlr/2.7.2/jar
Copying activeio/activeio/2.0-r118/jar
Copying geronimo/j2ee-server/1.1-SNAPSHOT/car
############################################################
# Installed configuration
#   id = geronimo/j2ee-server/1.1-SNAPSHOT/car
#   location = /home/continuum/continuum-1.0.2/apps/continuum/work/68/assemblies/j2ee-installer/target/geronimo-1.1-SNAPSHOT/repository/geronimo/j2ee-server/1.1-SNAPSHOT/j2ee-server-1.1-SNAPSHOT.car
############################################################
Installed configuration geronimo/j2ee-server/1.1-SNAPSHOT/car
Installed configuration geronimo/rmi-naming/1.1-SNAPSHOT/car
Installed configuration geronimo/j2ee-system/1.1-SNAPSHOT/car
Copying geronimo/geronimo-connector/1.1-SNAPSHOT/jar
Copying geronimo/geronimo-timer/1.1-SNAPSHOT/jar
Copying geronimo/geronimo-client/1.1-SNAPSHOT/jar
Copying geronimo/geronimo-axis/1.1-SNAPSHOT/jar
Copying axis/axis/1.4-356167/jar
Copying commons-discovery/commons-discovery/0.2/jar
Copying wsdl4j/wsdl4j/1.5.2/jar
Copying openejb/openejb-core/2.1-SNAPSHOT/jar
Copying asm/asm/1.4.3/jar
Copying activemq/activemq-gbean-management/3.2.4-SNAPSHOT/jar
Copying scout/jaxr-api/0.5/jar
Copying scout/scout/0.5/jar
Copying juddi/juddi/0.9rc4/jar
Copying jdom/jdom/1.0/jar
Copying geronimo/geronimo-derby/1.1-SNAPSHOT/jar
Copying org.apache.derby/derby/10.1.1.0/jar
Copying org.apache.derby/derbynet/10.1.1.0/jar
Copying geronimo/j2ee-security/1.1-SNAPSHOT/car
############################################################
# Installed configuration
#   id = geronimo/j2ee-security/1.1-SNAPSHOT/car
#   location = /home/continuum/continuum-1.0.2/apps/continuum/work/68/assemblies/j2ee-installer/target/geronimo-1.1-SNAPSHOT/repository/geronimo/j2ee-security/1.1-SNAPSHOT/j2ee-security-1.1-SNAPSHOT.car
############################################################
Installed configuration geronimo/j2ee-security/1.1-SNAPSHOT/car
Installed configuration geronimo/rmi-naming/1.1-SNAPSHOT/car
Installed configuration geronimo/j2ee-system/1.1-SNAPSHOT/car
Copying geronimo/geronimo-jmxremoting/1.1-SNAPSHOT/jar
Copying geronimo/j2ee-corba/1.1-SNAPSHOT/car
############################################################
# Installed configuration
#   id = geronimo/j2ee-corba/1.1-SNAPSHOT/car
#   location = /home/continuum/continuum-1.0.2/apps/continuum/work/68/assemblies/j2ee-installer/target/geronimo-1.1-SNAPSHOT/repository/geronimo/j2ee-corba/1.1-SNAPSHOT/j2ee-corba-1.1-SNAPSHOT.car
############################################################
Installed configuration geronimo/j2ee-corba/1.1-SNAPSHOT/car
Installed configuration geronimo/j2ee-server/1.1-SNAPSHOT/car
Installed configuration geronimo/rmi-naming/1.1-SNAPSHOT/car
Installed configuration geronimo/j2ee-system/1.1-SNAPSHOT/car
Copying geronimo/jetty/1.1-SNAPSHOT/car
############################################################
# Installed configuration
#   id = geronimo/jetty/1.1-SNAPSHOT/car
#   location = /home/continuum/continuum-1.0.2/apps/continuum/work/68/assemblies/j2ee-installer/target/geronimo-1.1-SNAPSHOT/repository/geronimo/jetty/1.1-SNAPSHOT/jetty-1.1-SNAPSHOT.car
############################################################
Installed configuration geronimo/jetty/1.1-SNAPSHOT/car
Installed configuration geronimo/j2ee-security/1.1-SNAPSHOT/car
Installed configuration geronimo/rmi-naming/1.1-SNAPSHOT/car
Installed configuration geronimo/j2ee-system/1.1-SNAPSHOT/car
Copying geronimo/geronimo-jetty/1.1-SNAPSHOT/jar
Copying jetty/org.mortbay.jetty/5.1.10/jar
Copying tomcat/jasper-compiler/5.5.12/jar
Copying tomcat/jasper-compiler-jdt/5.5.12/jar
Copying tomcat/jasper-runtime/5.5.12/jar
Copying commons-el/commons-el/1.0/jar
Copying springframework/spring/1.2.5/jar
Copying activecluster/activecluster/1.2-20051115174934/jar
Copying wadi/wadi-core/2.0M1/jar
Copying wadi/wadi-jetty5/2.0M1/jar
Copying geronimo/tomcat/1.1-SNAPSHOT/car
############################################################
# Installed configuration
#   id = geronimo/tomcat/1.1-SNAPSHOT/car
#   location = /home/continuum/continuum-1.0.2/apps/continuum/work/68/assemblies/j2ee-installer/target/geronimo-1.1-SNAPSHOT/repository/geronimo/tomcat/1.1-SNAPSHOT/tomcat-1.1-SNAPSHOT.car
############################################################
Installed configuration geronimo/tomcat/1.1-SNAPSHOT/car
Installed configuration geronimo/rmi-naming/1.1-SNAPSHOT/car
Installed configuration geronimo/j2ee-system/1.1-SNAPSHOT/car
Copying geronimo/geronimo-tomcat/1.1-SNAPSHOT/jar
Copying tomcat/catalina/5.5.9/jar
Copying tomcat/tomcat-ajp/5.5.9/jar
Copying tomcat/catalina-cluster/5.5.9/jar
Copying tomcat/catalina-optional/5.5.9/jar
Copying tomcat/tomcat-coyote/5.5.9/jar
Copying tomcat/tomcat-http/5.5.9/jar
Copying tomcat/tomcat-util/5.5.9/jar
Copying tomcat/naming-resources/5.5.9/jar
Copying tomcat/servlets-default/5.5.9/jar
Copying tomcat/servlets-invoker/5.5.9/jar
Copying commons-beanutils/commons-beanutils/1.6.1/jar
Copying commons-collections/commons-collections/3.1/jar
Copying commons-digester/commons-digester/1.6/jar
Copying commons-modeler/commons-modeler/1.1/jar
Copying regexp/regexp/1.3/jar
Copying wadi/wadi-tomcat55/2.0M1/jar
Copying geronimo/directory/1.1-SNAPSHOT/car
############################################################
# Installed configuration
#   id = geronimo/directory/1.1-SNAPSHOT/car
#   location = /home/continuum/continuum-1.0.2/apps/continuum/work/68/assemblies/j2ee-installer/target/geronimo-1.1-SNAPSHOT/repository/geronimo/directory/1.1-SNAPSHOT/directory-1.1-SNAPSHOT.car
############################################################
Installed configuration geronimo/directory/1.1-SNAPSHOT/car
Installed configuration geronimo/j2ee-server/1.1-SNAPSHOT/car
Installed configuration geronimo/rmi-naming/1.1-SNAPSHOT/car
Installed configuration geronimo/j2ee-system/1.1-SNAPSHOT/car
Copying geronimo/geronimo-directory/1.1-SNAPSHOT/jar
Copying directory/apacheds-core/0.9.2/jar
Copying directory/apacheds-shared/0.9.2/jar
Copying directory-asn1/asn1-codec/0.3.2/jar
Copying directory-shared/apache-ldapber-provider/0.9.2/jar
Copying directory-asn1/asn1-ber/0.3.2/jar
Copying directory-asn1/asn1-der/0.3.2/jar
Copying jdbm/jdbm/0.20-dev/jar
Copying oro/oro/2.0.8/jar
Copying commons-lang/commons-lang/2.0/jar
Copying commons-io/commons-io/1.0/jar
Copying commons-primitives/commons-primitives/20041207.202534/jar
Copying directory-shared/ldap-common/0.9.2/jar
Copying directory-shared/kerberos-common/0.5/jar
Copying directory-network/mina/0.7.3/jar
Copying directory-protocols/kerberos-protocol/0.5/jar
Copying directory-protocols/ldap-protocol/0.9.2/jar
Copying org.slf4j/slf4j-simple/1.0-beta7/jar
Copying geronimo/ldap-realm/1.1-SNAPSHOT/car
############################################################
# Installed configuration
#   id = geronimo/ldap-realm/1.1-SNAPSHOT/car
#   location = /home/continuum/continuum-1.0.2/apps/continuum/work/68/assemblies/j2ee-installer/target/geronimo-1.1-SNAPSHOT/repository/geronimo/ldap-realm/1.1-SNAPSHOT/ldap-realm-1.1-SNAPSHOT.car
############################################################
Installed configuration geronimo/ldap-realm/1.1-SNAPSHOT/car
Installed configuration geronimo/j2ee-security/1.1-SNAPSHOT/car
Installed configuration geronimo/rmi-naming/1.1-SNAPSHOT/car
Installed configuration geronimo/j2ee-system/1.1-SNAPSHOT/car
Copying geronimo/system-database/1.1-SNAPSHOT/car
############################################################
# Installed configuration
#   id = geronimo/system-database/1.1-SNAPSHOT/car
#   location = /home/continuum/continuum-1.0.2/apps/continuum/work/68/assemblies/j2ee-installer/target/geronimo-1.1-SNAPSHOT/repository/geronimo/system-database/1.1-SNAPSHOT/system-database-1.1-SNAPSHOT.car
############################################################
Installed configuration geronimo/system-database/1.1-SNAPSHOT/car
Installed configuration geronimo/j2ee-server/1.1-SNAPSHOT/car
Installed configuration geronimo/rmi-naming/1.1-SNAPSHOT/car
Installed configuration geronimo/j2ee-system/1.1-SNAPSHOT/car
Copying geronimo/activemq-broker/1.1-SNAPSHOT/car
############################################################
# Installed configuration
#   id = geronimo/activemq-broker/1.1-SNAPSHOT/car
#   location = /home/continuum/continuum-1.0.2/apps/continuum/work/68/assemblies/j2ee-installer/target/geronimo-1.1-SNAPSHOT/repository/geronimo/activemq-broker/1.1-SNAPSHOT/activemq-broker-1.1-SNAPSHOT.car
############################################################
Installed configuration geronimo/activemq-broker/1.1-SNAPSHOT/car
Installed configuration geronimo/system-database/1.1-SNAPSHOT/car
Installed configuration geronimo/j2ee-server/1.1-SNAPSHOT/car
Installed configuration geronimo/rmi-naming/1.1-SNAPSHOT/car
Installed configuration geronimo/j2ee-system/1.1-SNAPSHOT/car
Copying activemq/activemq-core/3.2.4-SNAPSHOT/jar
Copying activemq/activemq-gbean-g1_1/3.2.4-SNAPSHOT/jar
Copying activemq/activemq-gbean-management-g1_1/3.2.4-SNAPSHOT/jar
Copying geronimo/activemq/1.1-SNAPSHOT/car
############################################################
# Installed configuration
#   id = geronimo/activemq/1.1-SNAPSHOT/car
#   location = /home/continuum/continuum-1.0.2/apps/continuum/work/68/assemblies/j2ee-installer/target/geronimo-1.1-SNAPSHOT/repository/geronimo/activemq/1.1-SNAPSHOT/activemq-1.1-SNAPSHOT.car
############################################################
Installed configuration geronimo/activemq/1.1-SNAPSHOT/car
Installed configuration geronimo/activemq-broker/1.1-SNAPSHOT/car
Installed configuration geronimo/system-database/1.1-SNAPSHOT/car
Installed configuration geronimo/j2ee-server/1.1-SNAPSHOT/car
Installed configuration geronimo/rmi-naming/1.1-SNAPSHOT/car
Installed configuration geronimo/j2ee-system/1.1-SNAPSHOT/car
Installed configuration geronimo/j2ee-server/1.1-SNAPSHOT/car
Installed configuration geronimo/rmi-naming/1.1-SNAPSHOT/car
Installed configuration geronimo/j2ee-system/1.1-SNAPSHOT/car
Copying geronimo/geronimo-gbean-deployer/1.1-SNAPSHOT/car
############################################################
# Installed configuration
#   id = geronimo/geronimo-gbean-deployer/1.1-SNAPSHOT/car
#   location = /home/continuum/continuum-1.0.2/apps/continuum/work/68/assemblies/j2ee-installer/target/geronimo-1.1-SNAPSHOT/repository/geronimo/geronimo-gbean-deployer/1.1-SNAPSHOT/geronimo-gbean-deployer-1.1-SNAPSHOT.car
############################################################
Installed configuration geronimo/geronimo-gbean-deployer/1.1-SNAPSHOT/car
Copying geronimo/geronimo-service-builder/1.1-SNAPSHOT/jar
Copying xmlbeans/xbean/2.0.0/jar
Copying stax/stax-api/1.0/jar
Copying geronimo/hot-deployer/1.1-SNAPSHOT/car
############################################################
# Installed configuration
#   id = geronimo/hot-deployer/1.1-SNAPSHOT/car
#   location = /home/continuum/continuum-1.0.2/apps/continuum/work/68/assemblies/j2ee-installer/target/geronimo-1.1-SNAPSHOT/repository/geronimo/hot-deployer/1.1-SNAPSHOT/hot-deployer-1.1-SNAPSHOT.car
############################################################
Installed configuration geronimo/hot-deployer/1.1-SNAPSHOT/car
Installed configuration geronimo/rmi-naming/1.1-SNAPSHOT/car
Installed configuration geronimo/j2ee-system/1.1-SNAPSHOT/car
Copying geronimo/j2ee-deployer/1.1-SNAPSHOT/car
############################################################
# Installed configuration
#   id = geronimo/j2ee-deployer/1.1-SNAPSHOT/car
#   location = /home/continuum/continuum-1.0.2/apps/continuum/work/68/assemblies/j2ee-installer/target/geronimo-1.1-SNAPSHOT/repository/geronimo/j2ee-deployer/1.1-SNAPSHOT/j2ee-deployer-1.1-SNAPSHOT.car
############################################################
Installed configuration geronimo/j2ee-deployer/1.1-SNAPSHOT/car
Installed configuration geronimo/geronimo-gbean-deployer/1.1-SNAPSHOT/car
Installed configuration geronimo/j2ee-server/1.1-SNAPSHOT/car
Installed configuration geronimo/rmi-naming/1.1-SNAPSHOT/car
Installed configuration geronimo/j2ee-system/1.1-SNAPSHOT/car
Copying geronimo/geronimo-j2ee-schema/1.1-SNAPSHOT/jar
Copying geronimo/geronimo-j2ee-builder/1.1-SNAPSHOT/jar
Copying geronimo/geronimo-client-builder/1.1-SNAPSHOT/jar
Copying geronimo/geronimo-naming-builder/1.1-SNAPSHOT/jar
Copying geronimo/geronimo-security-builder/1.1-SNAPSHOT/jar
Copying geronimo/geronimo-axis-builder/1.1-SNAPSHOT/jar
Copying geronimo/geronimo-web-builder/1.1-SNAPSHOT/jar
Copying openejb/openejb-builder/2.1-SNAPSHOT/jar
Copying openejb/openejb-pkgen-builder/2.1-SNAPSHOT/jar
Copying geronimo/geronimo-connector-builder/1.1-SNAPSHOT/jar
Copying geronimo/geronimo-hot-deploy/1.1-SNAPSHOT/jar
Configuration geronimo/j2ee-deployer/1.1-SNAPSHOT/car already present in configuration store
Copying geronimo/jetty-deployer/1.1-SNAPSHOT/car
############################################################
# Installed configuration
#   id = geronimo/jetty-deployer/1.1-SNAPSHOT/car
#   location = /home/continuum/continuum-1.0.2/apps/continuum/work/68/assemblies/j2ee-installer/target/geronimo-1.1-SNAPSHOT/repository/geronimo/jetty-deployer/1.1-SNAPSHOT/jetty-deployer-1.1-SNAPSHOT.car
############################################################
Installed configuration geronimo/jetty-deployer/1.1-SNAPSHOT/car
Installed configuration geronimo/j2ee-deployer/1.1-SNAPSHOT/car
Installed configuration geronimo/geronimo-gbean-deployer/1.1-SNAPSHOT/car
Installed configuration geronimo/j2ee-server/1.1-SNAPSHOT/car
Installed configuration geronimo/rmi-naming/1.1-SNAPSHOT/car
Installed configuration geronimo/j2ee-system/1.1-SNAPSHOT/car
Installed configuration geronimo/jetty/1.1-SNAPSHOT/car
Installed configuration geronimo/j2ee-security/1.1-SNAPSHOT/car
Installed configuration geronimo/rmi-naming/1.1-SNAPSHOT/car
Installed configuration geronimo/j2ee-system/1.1-SNAPSHOT/car
Copying geronimo/geronimo-jetty-builder/1.1-SNAPSHOT/jar
Copying geronimo/welcome-jetty/1.1-SNAPSHOT/car
############################################################
# Installed configuration
#   id = geronimo/welcome-jetty/1.1-SNAPSHOT/car
#   location = /home/continuum/continuum-1.0.2/apps/continuum/work/68/assemblies/j2ee-installer/target/geronimo-1.1-SNAPSHOT/repository/geronimo/welcome-jetty/1.1-SNAPSHOT/welcome-jetty-1.1-SNAPSHOT.car
############################################################
Installed configuration geronimo/welcome-jetty/1.1-SNAPSHOT/car
Installed configuration geronimo/j2ee-server/1.1-SNAPSHOT/car
Installed configuration geronimo/rmi-naming/1.1-SNAPSHOT/car
Installed configuration geronimo/j2ee-system/1.1-SNAPSHOT/car
Installed configuration geronimo/jetty/1.1-SNAPSHOT/car
Installed configuration geronimo/j2ee-security/1.1-SNAPSHOT/car
Installed configuration geronimo/rmi-naming/1.1-SNAPSHOT/car
Installed configuration geronimo/j2ee-system/1.1-SNAPSHOT/car
Copying geronimo/servlets-examples-jetty/1.1-SNAPSHOT/car
############################################################
# Installed configuration
#   id = geronimo/servlets-examples-jetty/1.1-SNAPSHOT/car
#   location = /home/continuum/continuum-1.0.2/apps/continuum/work/68/assemblies/j2ee-installer/target/geronimo-1.1-SNAPSHOT/repository/geronimo/servlets-examples-jetty/1.1-SNAPSHOT/servlets-examples-jetty-1.1-SNAPSHOT.car
############################################################
Installed configuration geronimo/servlets-examples-jetty/1.1-SNAPSHOT/car
Installed configuration geronimo/j2ee-server/1.1-SNAPSHOT/car
Installed configuration geronimo/rmi-naming/1.1-SNAPSHOT/car
Installed configuration geronimo/j2ee-system/1.1-SNAPSHOT/car
Installed configuration geronimo/jetty/1.1-SNAPSHOT/car
Installed configuration geronimo/j2ee-security/1.1-SNAPSHOT/car
Installed configuration geronimo/rmi-naming/1.1-SNAPSHOT/car
Installed configuration geronimo/j2ee-system/1.1-SNAPSHOT/car
Copying geronimo/jsp-examples-jetty/1.1-SNAPSHOT/car
############################################################
# Installed configuration
#   id = geronimo/jsp-examples-jetty/1.1-SNAPSHOT/car
#   location = /home/continuum/continuum-1.0.2/apps/continuum/work/68/assemblies/j2ee-installer/target/geronimo-1.1-SNAPSHOT/repository/geronimo/jsp-examples-jetty/1.1-SNAPSHOT/jsp-examples-jetty-1.1-SNAPSHOT.car
############################################################
Installed configuration geronimo/jsp-examples-jetty/1.1-SNAPSHOT/car
Installed configuration geronimo/j2ee-server/1.1-SNAPSHOT/car
Installed configuration geronimo/rmi-naming/1.1-SNAPSHOT/car
Installed configuration geronimo/j2ee-system/1.1-SNAPSHOT/car
Installed configuration geronimo/jetty/1.1-SNAPSHOT/car
Installed configuration geronimo/j2ee-security/1.1-SNAPSHOT/car
Installed configuration geronimo/rmi-naming/1.1-SNAPSHOT/car
Installed configuration geronimo/j2ee-system/1.1-SNAPSHOT/car
Copying geronimo/webconsole-jetty/1.1-SNAPSHOT/car
############################################################
# Installed configuration
#   id = geronimo/webconsole-jetty/1.1-SNAPSHOT/car
#   location = /home/continuum/continuum-1.0.2/apps/continuum/work/68/assemblies/j2ee-installer/target/geronimo-1.1-SNAPSHOT/repository/geronimo/webconsole-jetty/1.1-SNAPSHOT/webconsole-jetty-1.1-SNAPSHOT.car
############################################################
Installed configuration geronimo/webconsole-jetty/1.1-SNAPSHOT/car
Installed configuration geronimo/j2ee-server/1.1-SNAPSHOT/car
Installed configuration geronimo/rmi-naming/1.1-SNAPSHOT/car
Installed configuration geronimo/j2ee-system/1.1-SNAPSHOT/car
Installed configuration geronimo/j2ee-security/1.1-SNAPSHOT/car
Installed configuration geronimo/rmi-naming/1.1-SNAPSHOT/car
Installed configuration geronimo/j2ee-system/1.1-SNAPSHOT/car
Copying portlet-api/portlet-api/1.0/jar
Copying org.apache.pluto/pluto/1.0.1/jar
Copying geronimo/geronimo-console-core/1.1-SNAPSHOT/jar
Copying geronimo/geronimo-test-ddbean/1.1-SNAPSHOT/jar
Copying geronimo/geronimo-deploy-config/1.1-SNAPSHOT/jar
Copying activemq/activemq-gbean/3.2.4-SNAPSHOT/jar
Copying geronimo/geronimo-converter/1.1-SNAPSHOT/jar
Copying geronimo/remote-deploy-jetty/1.1-SNAPSHOT/car
############################################################
# Installed configuration
#   id = geronimo/remote-deploy-jetty/1.1-SNAPSHOT/car
#   location = /home/continuum/continuum-1.0.2/apps/continuum/work/68/assemblies/j2ee-installer/target/geronimo-1.1-SNAPSHOT/repository/geronimo/remote-deploy-jetty/1.1-SNAPSHOT/remote-deploy-jetty-1.1-SNAPSHOT.car
############################################################
Installed configuration geronimo/remote-deploy-jetty/1.1-SNAPSHOT/car
Copying geronimo/geronimo-remote-deploy-lib/1.1-SNAPSHOT/jar
Installed configuration geronimo/j2ee-server/1.1-SNAPSHOT/car
Installed configuration geronimo/rmi-naming/1.1-SNAPSHOT/car
Installed configuration geronimo/j2ee-system/1.1-SNAPSHOT/car
Installed configuration geronimo/jetty/1.1-SNAPSHOT/car
Installed configuration geronimo/j2ee-security/1.1-SNAPSHOT/car
Installed configuration geronimo/rmi-naming/1.1-SNAPSHOT/car
Installed configuration geronimo/j2ee-system/1.1-SNAPSHOT/car
Copying geronimo/jmxdebug-jetty/1.1-SNAPSHOT/car
############################################################
# Installed configuration
#   id = geronimo/jmxdebug-jetty/1.1-SNAPSHOT/car
#   location = /home/continuum/continuum-1.0.2/apps/continuum/work/68/assemblies/j2ee-installer/target/geronimo-1.1-SNAPSHOT/repository/geronimo/jmxdebug-jetty/1.1-SNAPSHOT/jmxdebug-jetty-1.1-SNAPSHOT.car
############################################################
Installed configuration geronimo/jmxdebug-jetty/1.1-SNAPSHOT/car
Installed configuration geronimo/j2ee-server/1.1-SNAPSHOT/car
Installed configuration geronimo/rmi-naming/1.1-SNAPSHOT/car
Installed configuration geronimo/j2ee-system/1.1-SNAPSHOT/car
Installed configuration geronimo/jetty/1.1-SNAPSHOT/car
Installed configuration geronimo/j2ee-security/1.1-SNAPSHOT/car
Installed configuration geronimo/rmi-naming/1.1-SNAPSHOT/car
Installed configuration geronimo/j2ee-system/1.1-SNAPSHOT/car
Copying geronimo/uddi-jetty/1.1-SNAPSHOT/car
############################################################
# Installed configuration
#   id = geronimo/uddi-jetty/1.1-SNAPSHOT/car
#   location = /home/continuum/continuum-1.0.2/apps/continuum/work/68/assemblies/j2ee-installer/target/geronimo-1.1-SNAPSHOT/repository/geronimo/uddi-jetty/1.1-SNAPSHOT/uddi-jetty-1.1-SNAPSHOT.car
############################################################
Installed configuration geronimo/uddi-jetty/1.1-SNAPSHOT/car
Installed configuration geronimo/system-database/1.1-SNAPSHOT/car
Installed configuration geronimo/j2ee-server/1.1-SNAPSHOT/car
Installed configuration geronimo/rmi-naming/1.1-SNAPSHOT/car
Installed configuration geronimo/j2ee-system/1.1-SNAPSHOT/car
Copying geronimo/geronimo-uddi-db/1.1-SNAPSHOT/jar
Installed configuration geronimo/j2ee-server/1.1-SNAPSHOT/car
Installed configuration geronimo/rmi-naming/1.1-SNAPSHOT/car
Installed configuration geronimo/j2ee-system/1.1-SNAPSHOT/car
Copying geronimo/tomcat-deployer/1.1-SNAPSHOT/car
############################################################
# Installed configuration
#   id = geronimo/tomcat-deployer/1.1-SNAPSHOT/car
#   location = /home/continuum/continuum-1.0.2/apps/continuum/work/68/assemblies/j2ee-installer/target/geronimo-1.1-SNAPSHOT/repository/geronimo/tomcat-deployer/1.1-SNAPSHOT/tomcat-deployer-1.1-SNAPSHOT.car
############################################################
Installed configuration geronimo/tomcat-deployer/1.1-SNAPSHOT/car
Installed configuration geronimo/j2ee-deployer/1.1-SNAPSHOT/car
Installed configuration geronimo/geronimo-gbean-deployer/1.1-SNAPSHOT/car
Installed configuration geronimo/j2ee-server/1.1-SNAPSHOT/car
Installed configuration geronimo/rmi-naming/1.1-SNAPSHOT/car
Installed configuration geronimo/j2ee-system/1.1-SNAPSHOT/car
Installed configuration geronimo/tomcat/1.1-SNAPSHOT/car
Installed configuration geronimo/rmi-naming/1.1-SNAPSHOT/car
Installed configuration geronimo/j2ee-system/1.1-SNAPSHOT/car
Copying geronimo/geronimo-tomcat-builder/1.1-SNAPSHOT/jar
Copying geronimo/ldap-demo-tomcat/1.1-SNAPSHOT/car
############################################################
# Installed configuration
#   id = geronimo/ldap-demo-tomcat/1.1-SNAPSHOT/car
#   location = /home/continuum/continuum-1.0.2/apps/continuum/work/68/assemblies/j2ee-installer/target/geronimo-1.1-SNAPSHOT/repository/geronimo/ldap-demo-tomcat/1.1-SNAPSHOT/ldap-demo-tomcat-1.1-SNAPSHOT.car
############################################################
Installed configuration geronimo/ldap-demo-tomcat/1.1-SNAPSHOT/car
Installed configuration geronimo/j2ee-server/1.1-SNAPSHOT/car
Installed configuration geronimo/rmi-naming/1.1-SNAPSHOT/car
Installed configuration geronimo/j2ee-system/1.1-SNAPSHOT/car
Installed configuration geronimo/tomcat/1.1-SNAPSHOT/car
Installed configuration geronimo/rmi-naming/1.1-SNAPSHOT/car
Installed configuration geronimo/j2ee-system/1.1-SNAPSHOT/car
Copying geronimo/ldap-demo-jetty/1.1-SNAPSHOT/car
############################################################
# Installed configuration
#   id = geronimo/ldap-demo-jetty/1.1-SNAPSHOT/car
#   location = /home/continuum/continuum-1.0.2/apps/continuum/work/68/assemblies/j2ee-installer/target/geronimo-1.1-SNAPSHOT/repository/geronimo/ldap-demo-jetty/1.1-SNAPSHOT/ldap-demo-jetty-1.1-SNAPSHOT.car
############################################################
Installed configuration geronimo/ldap-demo-jetty/1.1-SNAPSHOT/car
Installed configuration geronimo/ldap-realm/1.1-SNAPSHOT/car
Installed configuration geronimo/j2ee-security/1.1-SNAPSHOT/car
Installed configuration geronimo/rmi-naming/1.1-SNAPSHOT/car
Installed configuration geronimo/j2ee-system/1.1-SNAPSHOT/car
Installed configuration geronimo/j2ee-server/1.1-SNAPSHOT/car
Installed configuration geronimo/rmi-naming/1.1-SNAPSHOT/car
Installed configuration geronimo/j2ee-system/1.1-SNAPSHOT/car
Installed configuration geronimo/jetty/1.1-SNAPSHOT/car
Installed configuration geronimo/j2ee-security/1.1-SNAPSHOT/car
Installed configuration geronimo/rmi-naming/1.1-SNAPSHOT/car
Installed configuration geronimo/j2ee-system/1.1-SNAPSHOT/car
Copying geronimo/welcome-tomcat/1.1-SNAPSHOT/car
############################################################
# Installed configuration
#   id = geronimo/welcome-tomcat/1.1-SNAPSHOT/car
#   location = /home/continuum/continuum-1.0.2/apps/continuum/work/68/assemblies/j2ee-installer/target/geronimo-1.1-SNAPSHOT/repository/geronimo/welcome-tomcat/1.1-SNAPSHOT/welcome-tomcat-1.1-SNAPSHOT.car
############################################################
Installed configuration geronimo/welcome-tomcat/1.1-SNAPSHOT/car
Installed configuration geronimo/j2ee-server/1.1-SNAPSHOT/car
Installed configuration geronimo/rmi-naming/1.1-SNAPSHOT/car
Installed configuration geronimo/j2ee-system/1.1-SNAPSHOT/car
Installed configuration geronimo/tomcat/1.1-SNAPSHOT/car
Installed configuration geronimo/rmi-naming/1.1-SNAPSHOT/car
Installed configuration geronimo/j2ee-system/1.1-SNAPSHOT/car
Copying geronimo/servlets-examples-tomcat/1.1-SNAPSHOT/car
############################################################
# Installed configuration
#   id = geronimo/servlets-examples-tomcat/1.1-SNAPSHOT/car
#   location = /home/continuum/continuum-1.0.2/apps/continuum/work/68/assemblies/j2ee-installer/target/geronimo-1.1-SNAPSHOT/repository/geronimo/servlets-examples-tomcat/1.1-SNAPSHOT/servlets-examples-tomcat-1.1-SNAPSHOT.car
############################################################
Installed configuration geronimo/servlets-examples-tomcat/1.1-SNAPSHOT/car
Installed configuration geronimo/j2ee-server/1.1-SNAPSHOT/car
Installed configuration geronimo/rmi-naming/1.1-SNAPSHOT/car
Installed configuration geronimo/j2ee-system/1.1-SNAPSHOT/car
Installed configuration geronimo/tomcat/1.1-SNAPSHOT/car
Installed configuration geronimo/rmi-naming/1.1-SNAPSHOT/car
Installed configuration geronimo/j2ee-system/1.1-SNAPSHOT/car
Copying geronimo/jsp-examples-tomcat/1.1-SNAPSHOT/car
############################################################
# Installed configuration
#   id = geronimo/jsp-examples-tomcat/1.1-SNAPSHOT/car
#   location = /home/continuum/continuum-1.0.2/apps/continuum/work/68/assemblies/j2ee-installer/target/geronimo-1.1-SNAPSHOT/repository/geronimo/jsp-examples-tomcat/1.1-SNAPSHOT/jsp-examples-tomcat-1.1-SNAPSHOT.car
############################################################
Installed configuration geronimo/jsp-examples-tomcat/1.1-SNAPSHOT/car
Installed configuration geronimo/j2ee-server/1.1-SNAPSHOT/car
Installed configuration geronimo/rmi-naming/1.1-SNAPSHOT/car
Installed configuration geronimo/j2ee-system/1.1-SNAPSHOT/car
Installed configuration geronimo/tomcat/1.1-SNAPSHOT/car
Installed configuration geronimo/rmi-naming/1.1-SNAPSHOT/car
Installed configuration geronimo/j2ee-system/1.1-SNAPSHOT/car
Copying geronimo/webconsole-tomcat/1.1-SNAPSHOT/car
############################################################
# Installed configuration
#   id = geronimo/webconsole-tomcat/1.1-SNAPSHOT/car
#   location = /home/continuum/continuum-1.0.2/apps/continuum/work/68/assemblies/j2ee-installer/target/geronimo-1.1-SNAPSHOT/repository/geronimo/webconsole-tomcat/1.1-SNAPSHOT/webconsole-tomcat-1.1-SNAPSHOT.car
############################################################
Installed configuration geronimo/webconsole-tomcat/1.1-SNAPSHOT/car
Installed configuration geronimo/tomcat/1.1-SNAPSHOT/car
Installed configuration geronimo/rmi-naming/1.1-SNAPSHOT/car
Installed configuration geronimo/j2ee-system/1.1-SNAPSHOT/car
Installed configuration geronimo/j2ee-server/1.1-SNAPSHOT/car
Installed configuration geronimo/rmi-naming/1.1-SNAPSHOT/car
Installed configuration geronimo/j2ee-system/1.1-SNAPSHOT/car
Installed configuration geronimo/j2ee-security/1.1-SNAPSHOT/car
Installed configuration geronimo/rmi-naming/1.1-SNAPSHOT/car
Installed configuration geronimo/j2ee-system/1.1-SNAPSHOT/car
Copying geronimo/remote-deploy-tomcat/1.1-SNAPSHOT/car
############################################################
# Installed configuration
#   id = geronimo/remote-deploy-tomcat/1.1-SNAPSHOT/car
#   location = /home/continuum/continuum-1.0.2/apps/continuum/work/68/assemblies/j2ee-installer/target/geronimo-1.1-SNAPSHOT/repository/geronimo/remote-deploy-tomcat/1.1-SNAPSHOT/remote-deploy-tomcat-1.1-SNAPSHOT.car
############################################################
Installed configuration geronimo/remote-deploy-tomcat/1.1-SNAPSHOT/car
Installed configuration geronimo/j2ee-server/1.1-SNAPSHOT/car
Installed configuration geronimo/rmi-naming/1.1-SNAPSHOT/car
Installed configuration geronimo/j2ee-system/1.1-SNAPSHOT/car
Installed configuration geronimo/tomcat/1.1-SNAPSHOT/car
Installed configuration geronimo/rmi-naming/1.1-SNAPSHOT/car
Installed configuration geronimo/j2ee-system/1.1-SNAPSHOT/car
Copying geronimo/jmxdebug-tomcat/1.1-SNAPSHOT/car
############################################################
# Installed configuration
#   id = geronimo/jmxdebug-tomcat/1.1-SNAPSHOT/car
#   location = /home/continuum/continuum-1.0.2/apps/continuum/work/68/assemblies/j2ee-installer/target/geronimo-1.1-SNAPSHOT/repository/geronimo/jmxdebug-tomcat/1.1-SNAPSHOT/jmxdebug-tomcat-1.1-SNAPSHOT.car
############################################################
Installed configuration geronimo/jmxdebug-tomcat/1.1-SNAPSHOT/car
Installed configuration geronimo/j2ee-server/1.1-SNAPSHOT/car
Installed configuration geronimo/rmi-naming/1.1-SNAPSHOT/car
Installed configuration geronimo/j2ee-system/1.1-SNAPSHOT/car
Installed configuration geronimo/tomcat/1.1-SNAPSHOT/car
Installed configuration geronimo/rmi-naming/1.1-SNAPSHOT/car
Installed configuration geronimo/j2ee-system/1.1-SNAPSHOT/car
Copying geronimo/uddi-tomcat/1.1-SNAPSHOT/car
############################################################
# Installed configuration
#   id = geronimo/uddi-tomcat/1.1-SNAPSHOT/car
#   location = /home/continuum/continuum-1.0.2/apps/continuum/work/68/assemblies/j2ee-installer/target/geronimo-1.1-SNAPSHOT/repository/geronimo/uddi-tomcat/1.1-SNAPSHOT/uddi-tomcat-1.1-SNAPSHOT.car
############################################################
Installed configuration geronimo/uddi-tomcat/1.1-SNAPSHOT/car
Installed configuration geronimo/system-database/1.1-SNAPSHOT/car
Installed configuration geronimo/j2ee-server/1.1-SNAPSHOT/car
Installed configuration geronimo/rmi-naming/1.1-SNAPSHOT/car
Installed configuration geronimo/j2ee-system/1.1-SNAPSHOT/car
Installed configuration geronimo/j2ee-server/1.1-SNAPSHOT/car
Installed configuration geronimo/rmi-naming/1.1-SNAPSHOT/car
Installed configuration geronimo/j2ee-system/1.1-SNAPSHOT/car
Copying geronimo/daytrader-derby-jetty/1.1-SNAPSHOT/car
############################################################
# Installed configuration
#   id = geronimo/daytrader-derby-jetty/1.1-SNAPSHOT/car
#   location = /home/continuum/continuum-1.0.2/apps/continuum/work/68/assemblies/j2ee-installer/target/geronimo-1.1-SNAPSHOT/repository/geronimo/daytrader-derby-jetty/1.1-SNAPSHOT/daytrader-derby-jetty-1.1-SNAPSHOT.car
############################################################
Installed configuration geronimo/daytrader-derby-jetty/1.1-SNAPSHOT/car
Installed configuration geronimo/j2ee-server/1.1-SNAPSHOT/car
Installed configuration geronimo/rmi-naming/1.1-SNAPSHOT/car
Installed configuration geronimo/j2ee-system/1.1-SNAPSHOT/car
Copying geronimo/geronimo-daytrader-derby-db/1.1-SNAPSHOT/jar
Copying geronimo/daytrader-derby-jetty-streamer-client/1.1-SNAPSHOT/car
############################################################
# Installed configuration
#   id = geronimo/daytrader-derby-jetty-streamer-client/1.1-SNAPSHOT/car
#   location = /home/continuum/continuum-1.0.2/apps/continuum/work/68/assemblies/j2ee-installer/target/geronimo-1.1-SNAPSHOT/repository/geronimo/daytrader-derby-jetty-streamer-client/1.1-SNAPSHOT/daytrader-derby-jetty-streamer-client-1.1-SNAPSHOT.car
############################################################

BUILD FAILED
File...... /home/continuum/continuum-1.0.2/apps/continuum/work/68/maven.xml
Element... maven:reactor
Line...... 63
Column.... -1
Unable to obtain goal [multiproject:install-callback] -- /home/continuum/.geronimo-1.1-maven/cache/geronimo-assembly-plugin-1.1.0-9/plugin.jelly:224:-1: <assemble:installConfig> null
Total time   : 16 minutes 57 seconds 
Finished at  : Thursday, April 20, 2006 12:19:28 AM PDT


****************************************************************************



Mime
View raw message