geronimo-scm mailing list archives

Site index · List index
Message view « Date » · « Thread »
Top « Date » · « Thread »
From continuum <contin...@stan.gbuild.org>
Subject [continuum] BUILD FAILURE: Geronimo 1.1
Date Fri, 21 Apr 2006 13:02:26 GMT
Online report : http://ci.gbuild.org/continuum/servlet/continuum/target/ProjectBuild.vm/view/ProjectBuild/id/68/buildId/2474
Build statistics:
  State: Failed
  Previous State: Failed
  Started at: Fri, 21 Apr 2006 05:58:11 -0700
  Finished at: Fri, 21 Apr 2006 06:02:24 -0700
  Total time: 4m 13s
  Build Trigger: Forced
  Exit code: 70
  Building machine hostname: stan.gbuild.org
  Operating system : Linux(unknown)
  Java version : 1.4.2_08(Sun Microsystems Inc.)

Changes
      No files changed
  
****************************************************************************
Output:
****************************************************************************
 __  __
|  \/  |__ _Apache__ ___
| |\/| / _` \ V / -_) ' \  ~ intelligent projects ~
|_|  |_\__,_|\_/\___|_||_|  v. 1.1-beta-2

DEPRECATED: the default goal should be specified in the <build> section of project.xml instead of maven.xml
DEPRECATED: the default goal should be specified in the <build> section of project.xml instead of maven.xml
build:start:

m:checkout:
    [exec] Checked out revision 2619.
Starting the reactor...
Our processing order:

new:
new0:

Starting the reactor...
Our processing order:
new00:

Starting the reactor...
Our processing order:
Geronimo :: Activation
Geronimo :: Kernel
Geronimo :: Common
Geronimo :: Util
Geronimo :: System
Geronimo :: Deployment
Geronimo :: Deploy :: Common Config
Geronimo :: Management API
Geronimo :: Core
Geronimo :: J2EE
Geronimo :: J2EE Schema
Geronimo :: Service :: Builder
Geronimo :: Maven Dependency Plugin
Geronimo :: Naming
Geronimo :: Security
Geronimo :: Web Services
Geronimo :: Axis
Geronimo :: Test :: DDBeans
Geronimo :: Transaction
Geronimo :: Connector
Geronimo :: Security :: Builder
Geronimo :: J2EE
Geronimo :: Naming :: Builder
Geronimo :: Connector :: Builder
Geronimo :: Axis :: Builder
Geronimo :: Client
Geronimo :: Client Builder
Geronimo :: Console Web
Geronimo :: Configuration Converter
Geronimo :: Web :: Builder
Geronimo :: Deploy :: JSR-88
Geronimo :: Deploy :: CLI Tool
Geronimo :: Derby
Geronimo :: Directory
Geronimo :: Deploy :: Hot Deployer
Geronimo :: Installer Processing
Geronimo :: Installer Support
Geronimo :: JavaMail Transport
Geronimo :: Jetty
Geronimo :: Jetty :: Builder
Geronimo :: JMX Remoting
Geronimo :: Mail
Geronimo :: Scripts
Geronimo :: Timer
Geronimo :: Tomcat
Geronimo :: Tomcat :: Builder
Geronimo :: Upgrade
Geronimo :: Maven Assembly Plugin
Geronimo :: Maven Deployment Plugin
Geronimo :: IZPack Installer Build Plugin
Geronimo :: Maven Packaging Plugin
+----------------------------------------
| geronimo and geronimo-plugins Geronimo :: Activation
| Memory: 5M/10M
+----------------------------------------
DEPRECATED: the default goal should be specified in the <build> section of project.xml instead of maven.xml
new1:
Attempting to download geronimo-javamail_1.3.1_spec-1.1-SNAPSHOT.jar.
build:start:

multiproject:install-callback:
    [echo] Running jar:install for Geronimo :: Activation
java:prepare-filesystem:

java:compile:
<depend closure="false" srcdir="1.4" dump="false" destdir="/home/continuum/continuum-1.0.2/apps/continuum/work/68/modules/activation/target/classes"></depend>    [echo] Compiling to /home/continuum/continuum-1.0.2/apps/continuum/work/68/modules/activation/target/classes

java:jar-resources:

test:prepare-filesystem:

test:test-resources:

test:compile:

test:test:
    [echo] NOTICE: Skipping tests; they seem to have passed already
    [echo] No tests to run.
Running post goal: test:test

jar:jar:

jar:install:
    [echo] Installing...
Uploading to geronimo/jars/geronimo-activation-1.1-SNAPSHOT.jar: 
.................... (13K)
Uploading to geronimo/poms/geronimo-activation-1.1-SNAPSHOT.pom: 
.................... (10K)

+----------------------------------------
| geronimo and geronimo-plugins Geronimo :: Kernel
| Memory: 9M/10M
+----------------------------------------
DEPRECATED: the default goal should be specified in the <build> section of project.xml instead of maven.xml
DEPRECATED: the default goal should be specified in the <build> section of project.xml instead of maven.xml

build:end:

build:start:

multiproject:install-callback:
    [echo] Running jar:install for Geronimo :: Kernel
Tag library requested that is not present: 'xmlbeans2:maven' in plugin: 'null'
java:prepare-filesystem:

java:compile:
<depend closure="false" srcdir="1.4" dump="false" destdir="/home/continuum/continuum-1.0.2/apps/continuum/work/68/modules/kernel/target/classes"></depend>    [echo] Compiling to /home/continuum/continuum-1.0.2/apps/continuum/work/68/modules/kernel/target/classes

java:jar-resources:

test:prepare-filesystem:

test:test-resources:

test:compile:

test:test:
    [echo] NOTICE: Skipping tests; they seem to have passed already
    [echo] No tests to run.
Running post goal: test:test

jar:jar:

jar:install:
    [echo] Installing...
Uploading to geronimo/jars/geronimo-kernel-1.1-SNAPSHOT.jar: 
.................... (307K)
Uploading to geronimo/poms/geronimo-kernel-1.1-SNAPSHOT.pom: 
.................... (11K)

+----------------------------------------
| geronimo and geronimo-plugins Geronimo :: Common
| Memory: 9M/14M
+----------------------------------------
DEPRECATED: the default goal should be specified in the <build> section of project.xml instead of maven.xml

build:end:

Attempting to download geronimo-kernel-1.1-SNAPSHOT.jar.
build:start:

multiproject:install-callback:
    [echo] Running jar:install for Geronimo :: Common
java:prepare-filesystem:

java:compile:
<depend closure="false" srcdir="1.4" dump="false" destdir="/home/continuum/continuum-1.0.2/apps/continuum/work/68/modules/common/target/classes"></depend>    [echo] Compiling to /home/continuum/continuum-1.0.2/apps/continuum/work/68/modules/common/target/classes

java:jar-resources:

test:prepare-filesystem:

test:test-resources:

test:compile:

test:test:
    [echo] NOTICE: Skipping tests; they seem to have passed already
    [echo] No tests to run.
Running post goal: test:test

jar:jar:

jar:install:
    [echo] Installing...
Uploading to geronimo/jars/geronimo-common-1.1-SNAPSHOT.jar: 
.................... (36K)
Uploading to geronimo/poms/geronimo-common-1.1-SNAPSHOT.pom: 
.................... (10K)

+----------------------------------------
| geronimo and geronimo-plugins Geronimo :: Util
| Memory: 10M/14M
+----------------------------------------
DEPRECATED: the default goal should be specified in the <build> section of project.xml instead of maven.xml

build:end:

build:start:

multiproject:install-callback:
    [echo] Running jar:install for Geronimo :: Util
java:prepare-filesystem:

java:compile:
<depend closure="false" srcdir="1.4" dump="false" destdir="/home/continuum/continuum-1.0.2/apps/continuum/work/68/modules/util/target/classes"></depend>    [echo] Compiling to /home/continuum/continuum-1.0.2/apps/continuum/work/68/modules/util/target/classes

java:jar-resources:

test:prepare-filesystem:

test:test-resources:

test:compile:

test:test:
    [echo] NOTICE: Skipping tests; they seem to have passed already
    [echo] No tests to run.
Running post goal: test:test

jar:jar:

jar:install:
    [echo] Installing...
Uploading to geronimo/jars/geronimo-util-1.1-SNAPSHOT.jar: 
.................... (243K)
Uploading to geronimo/poms/geronimo-util-1.1-SNAPSHOT.pom: 
.................... (10K)

+----------------------------------------
| geronimo and geronimo-plugins Geronimo :: System
| Memory: 11M/14M
+----------------------------------------
DEPRECATED: the default goal should be specified in the <build> section of project.xml instead of maven.xml
DEPRECATED: the default goal should be specified in the <build> section of project.xml instead of maven.xml

build:end:

Attempting to download geronimo-common-1.1-SNAPSHOT.jar.
Attempting to download geronimo-util-1.1-SNAPSHOT.jar.
build:start:

multiproject:install-callback:
    [echo] Running jar:install for Geronimo :: System
java:prepare-filesystem:

java:compile:
<depend closure="false" srcdir="1.4" dump="false" destdir="/home/continuum/continuum-1.0.2/apps/continuum/work/68/modules/system/target/classes"></depend>    [echo] Compiling to /home/continuum/continuum-1.0.2/apps/continuum/work/68/modules/system/target/classes
Running post goal: java:compile

java:jar-resources:

test:prepare-filesystem:

test:test-resources:
Running post goal: test:test-resources
    [delete] Deleting directory /home/continuum/continuum-1.0.2/apps/continuum/work/68/modules/system/target/tmp
    [mkdir] Created dir: /home/continuum/continuum-1.0.2/apps/continuum/work/68/modules/system/target/tmp

test:compile:

test:test:
    [echo] NOTICE: Skipping tests; they seem to have passed already
    [echo] No tests to run.
Running post goal: test:test

jar:jar:
    [jar] Building jar: /home/continuum/continuum-1.0.2/apps/continuum/work/68/modules/system/target/geronimo-system-1.1-SNAPSHOT.jar

jar:install:
    [echo] Installing...
Uploading to geronimo/jars/geronimo-system-1.1-SNAPSHOT.jar: 
.................... (236K)
Uploading to geronimo/poms/geronimo-system-1.1-SNAPSHOT.pom: 
.................... (11K)

+----------------------------------------
| geronimo and geronimo-plugins Geronimo :: Deployment
| Memory: 12M/14M
+----------------------------------------
DEPRECATED: the default goal should be specified in the <build> section of project.xml instead of maven.xml
DEPRECATED: the default goal should be specified in the <build> section of project.xml instead of maven.xml

build:end:

Attempting to download geronimo-system-1.1-SNAPSHOT.jar.
build:start:

multiproject:install-callback:
    [echo] Running jar:install for Geronimo :: Deployment
java:prepare-filesystem:

java:compile:
<depend closure="false" srcdir="1.4" dump="false" destdir="/home/continuum/continuum-1.0.2/apps/continuum/work/68/modules/deployment/target/classes"></depend>    [echo] Compiling to /home/continuum/continuum-1.0.2/apps/continuum/work/68/modules/deployment/target/classes

java:jar-resources:

test:prepare-filesystem:

test:test-resources:

test:compile:

test:test:
    [echo] NOTICE: Skipping tests; they seem to have passed already
    [echo] No tests to run.
Running post goal: test:test

jar:jar:

jar:install:
    [echo] Installing...
Uploading to geronimo/jars/geronimo-deployment-1.1-SNAPSHOT.jar: 
.................... (52K)
Uploading to geronimo/poms/geronimo-deployment-1.1-SNAPSHOT.pom: 
.................... (11K)

+----------------------------------------
| geronimo and geronimo-plugins Geronimo :: Deploy :: Common Config
| Memory: 13M/14M
+----------------------------------------
DEPRECATED: the default goal should be specified in the <build> section of project.xml instead of maven.xml
DEPRECATED: the default goal should be specified in the <build> section of project.xml instead of maven.xml

build:end:

build:start:

multiproject:install-callback:
    [echo] Running jar:install for Geronimo :: Deploy :: Common Config
java:prepare-filesystem:

java:compile:
<depend closure="false" srcdir="1.4" dump="false" destdir="/home/continuum/continuum-1.0.2/apps/continuum/work/68/modules/deploy-config/target/classes"></depend>    [echo] Compiling to /home/continuum/continuum-1.0.2/apps/continuum/work/68/modules/deploy-config/target/classes

java:jar-resources:

test:prepare-filesystem:

test:test-resources:

test:compile:

test:test:
    [echo] NOTICE: Skipping tests; they seem to have passed already
    [echo] No tests to run.
Running post goal: test:test

jar:jar:

jar:install:
    [echo] Installing...
Uploading to geronimo/jars/geronimo-deploy-config-1.1-SNAPSHOT.jar: 
.................... (10K)
Uploading to geronimo/poms/geronimo-deploy-config-1.1-SNAPSHOT.pom: 
.................... (11K)

+----------------------------------------
| geronimo and geronimo-plugins Geronimo :: Management API
| Memory: 8M/14M
+----------------------------------------
DEPRECATED: the default goal should be specified in the <build> section of project.xml instead of maven.xml
DEPRECATED: the default goal should be specified in the <build> section of project.xml instead of maven.xml

build:end:

build:start:

multiproject:install-callback:
    [echo] Running jar:install for Geronimo :: Management API
java:prepare-filesystem:

java:compile:
<depend closure="false" srcdir="1.4" dump="false" destdir="/home/continuum/continuum-1.0.2/apps/continuum/work/68/modules/management/target/classes"></depend>    [echo] Compiling to /home/continuum/continuum-1.0.2/apps/continuum/work/68/modules/management/target/classes

java:jar-resources:

test:prepare-filesystem:

test:test-resources:

test:compile:
    [echo] No test source files to compile.

test:test:
    [echo] NOTICE: Skipping tests; they seem to have passed already
    [echo] No tests to run.
Running post goal: test:test

jar:jar:

jar:install:
    [echo] Installing...
Uploading to geronimo/jars/geronimo-management-1.1-SNAPSHOT.jar: 
.................... (39K)
Uploading to geronimo/poms/geronimo-management-1.1-SNAPSHOT.pom: 
.................... (10K)

+----------------------------------------
| geronimo and geronimo-plugins Geronimo :: Core
| Memory: 9M/14M
+----------------------------------------
DEPRECATED: the default goal should be specified in the <build> section of project.xml instead of maven.xml
DEPRECATED: the default goal should be specified in the <build> section of project.xml instead of maven.xml

build:end:

Attempting to download geronimo-management-1.1-SNAPSHOT.jar.
build:start:

multiproject:install-callback:
    [echo] Running jar:install for Geronimo :: Core
java:prepare-filesystem:

java:compile:
<depend closure="false" srcdir="1.4" dump="false" destdir="/home/continuum/continuum-1.0.2/apps/continuum/work/68/modules/core/target/classes"></depend>    [echo] Compiling to /home/continuum/continuum-1.0.2/apps/continuum/work/68/modules/core/target/classes

java:jar-resources:

test:prepare-filesystem:

test:test-resources:

test:compile:

test:test:
    [echo] NOTICE: Skipping tests; they seem to have passed already
    [echo] No tests to run.
Running post goal: test:test

jar:jar:

jar:install:
    [echo] Installing...
Uploading to geronimo/jars/geronimo-core-1.1-SNAPSHOT.jar: 
.................... (39K)
Uploading to geronimo/poms/geronimo-core-1.1-SNAPSHOT.pom: 
.................... (11K)

+----------------------------------------
| geronimo and geronimo-plugins Geronimo :: J2EE
| Memory: 10M/14M
+----------------------------------------
DEPRECATED: the default goal should be specified in the <build> section of project.xml instead of maven.xml
DEPRECATED: the default goal should be specified in the <build> section of project.xml instead of maven.xml

build:end:

Attempting to download geronimo-core-1.1-SNAPSHOT.jar.
build:start:

multiproject:install-callback:
    [echo] Running jar:install for Geronimo :: J2EE
java:prepare-filesystem:

java:compile:
<depend closure="false" srcdir="1.4" dump="false" destdir="/home/continuum/continuum-1.0.2/apps/continuum/work/68/modules/j2ee/target/classes"></depend>    [echo] Compiling to /home/continuum/continuum-1.0.2/apps/continuum/work/68/modules/j2ee/target/classes

java:jar-resources:

test:prepare-filesystem:

test:test-resources:

test:compile:

test:test:
    [echo] NOTICE: Skipping tests; they seem to have passed already
    [echo] No tests to run.
Running post goal: test:test

jar:jar:

jar:install:
    [echo] Installing...
Uploading to geronimo/jars/geronimo-j2ee-1.1-SNAPSHOT.jar: 
.................... (29K)
Uploading to geronimo/poms/geronimo-j2ee-1.1-SNAPSHOT.pom: 
.................... (12K)

+----------------------------------------
| geronimo and geronimo-plugins Geronimo :: J2EE Schema
| Memory: 11M/14M
+----------------------------------------
DEPRECATED: the default goal should be specified in the <build> section of project.xml instead of maven.xml
DEPRECATED: the default goal should be specified in the <build> section of project.xml instead of maven.xml

build:end:

build:start:

multiproject:install-callback:
    [echo] Running jar:install for Geronimo :: J2EE Schema
java:prepare-filesystem:

java:compile:
<depend closure="false" srcdir="1.4" dump="false" destdir="/home/continuum/continuum-1.0.2/apps/continuum/work/68/modules/j2ee-schema/target/classes"></depend>    [echo] Compiling to /home/continuum/continuum-1.0.2/apps/continuum/work/68/modules/j2ee-schema/target/classes

java:jar-resources:

test:prepare-filesystem:

test:test-resources:

test:compile:

test:test:
    [echo] NOTICE: Skipping tests; they seem to have passed already
    [echo] No tests to run.
Running post goal: test:test

jar:jar:

jar:install:
    [echo] Installing...
Uploading to geronimo/jars/geronimo-j2ee-schema-1.1-SNAPSHOT.jar: 
.................... (1501K)
Uploading to geronimo/poms/geronimo-j2ee-schema-1.1-SNAPSHOT.pom: 
.................... (11K)

+----------------------------------------
| geronimo and geronimo-plugins Geronimo :: Service :: Builder
| Memory: 14M/14M
+----------------------------------------
DEPRECATED: the default goal should be specified in the <build> section of project.xml instead of maven.xml
DEPRECATED: the default goal should be specified in the <build> section of project.xml instead of maven.xml

build:end:

Attempting to download geronimo-deployment-1.1-SNAPSHOT.jar.
Attempting to download geronimo-deploy-config-1.1-SNAPSHOT.jar.
Attempting to download geronimo-j2ee-1.1-SNAPSHOT.jar.
Attempting to download geronimo-j2ee-schema-1.1-SNAPSHOT.jar.
build:start:

multiproject:install-callback:
    [echo] Running jar:install for Geronimo :: Service :: Builder
java:prepare-filesystem:

java:compile:
<depend closure="false" srcdir="1.4" dump="false" destdir="/home/continuum/continuum-1.0.2/apps/continuum/work/68/modules/service-builder/target/classes"></depend>    [echo] Compiling to /home/continuum/continuum-1.0.2/apps/continuum/work/68/modules/service-builder/target/classes

java:jar-resources:

test:prepare-filesystem:

test:test-resources:

test:compile:

test:test:
    [echo] NOTICE: Skipping tests; they seem to have passed already
    [echo] No tests to run.
Running post goal: test:test

jar:jar:

jar:install:
    [echo] Installing...
Uploading to geronimo/jars/geronimo-service-builder-1.1-SNAPSHOT.jar: 
.................... (179K)
Uploading to geronimo/poms/geronimo-service-builder-1.1-SNAPSHOT.pom: 
.................... (12K)

+----------------------------------------
| geronimo and geronimo-plugins Geronimo :: Maven Dependency Plugin
| Memory: 11M/17M
+----------------------------------------
DEPRECATED: the default goal should be specified in the <build> section of project.xml instead of maven.xml

build:end:

Attempting to download geronimo-service-builder-1.1-SNAPSHOT.jar.
Artifact /geronimo/jars/geronimo-service-builder-1.1-SNAPSHOT.jar doesn't exist in remote repository, but it exists locally.
build:start:

multiproject:install-callback:
    [echo] Running plugin:repository-install for Geronimo :: Maven Dependency Plugin
plugin:plugin:
java:prepare-filesystem:

java:compile:
    [echo] Compiling to /home/continuum/continuum-1.0.2/apps/continuum/work/68/plugins/geronimo-dependency-plugin/target/classes

java:jar-resources:

test:prepare-filesystem:

test:test-resources:

test:compile:
    [echo] No test source files to compile.

test:test:
    [echo] No tests to run.

jar:jar:


plugin:repository-install:
    [echo] Installing...
Uploading to geronimo/plugins/geronimo-dependency-plugin-1.1.0-2.jar: 
.................... (9K)
Uploading to geronimo/poms/geronimo-dependency-plugin-1.1.0-2.pom: 
.................... (1K)

+----------------------------------------
| geronimo and geronimo-plugins Geronimo :: Naming
| Memory: 11M/17M
+----------------------------------------
DEPRECATED: the default goal should be specified in the <build> section of project.xml instead of maven.xml
DEPRECATED: the default goal should be specified in the <build> section of project.xml instead of maven.xml

build:end:

build:start:

multiproject:install-callback:
    [echo] Running jar:install for Geronimo :: Naming
java:prepare-filesystem:

java:compile:
<depend closure="false" srcdir="1.4" dump="false" destdir="/home/continuum/continuum-1.0.2/apps/continuum/work/68/modules/naming/target/classes"></depend>    [echo] Compiling to /home/continuum/continuum-1.0.2/apps/continuum/work/68/modules/naming/target/classes

java:jar-resources:

test:prepare-filesystem:

test:test-resources:

test:compile:

test:test:
    [echo] NOTICE: Skipping tests; they seem to have passed already
    [echo] No tests to run.
Running post goal: test:test

jar:jar:

jar:install:
    [echo] Installing...
Uploading to geronimo/jars/geronimo-naming-1.1-SNAPSHOT.jar: 
.................... (46K)
Uploading to geronimo/poms/geronimo-naming-1.1-SNAPSHOT.pom: 
.................... (10K)

+----------------------------------------
| geronimo and geronimo-plugins Geronimo :: Security
| Memory: 13M/17M
+----------------------------------------
DEPRECATED: the default goal should be specified in the <build> section of project.xml instead of maven.xml
DEPRECATED: the default goal should be specified in the <build> section of project.xml instead of maven.xml

build:end:

build:start:

multiproject:install-callback:
    [echo] Running jar:install for Geronimo :: Security
java:prepare-filesystem:

java:compile:
<depend closure="false" srcdir="1.4" dump="false" destdir="/home/continuum/continuum-1.0.2/apps/continuum/work/68/modules/security/target/classes"></depend>    [echo] Compiling to /home/continuum/continuum-1.0.2/apps/continuum/work/68/modules/security/target/classes

java:jar-resources:

test:prepare-filesystem:

test:test-resources:
Running post goal: test:test-resources
    [delete] Deleting directory /home/continuum/continuum-1.0.2/apps/continuum/work/68/modules/security/target/database
    [mkdir] Created dir: /home/continuum/continuum-1.0.2/apps/continuum/work/68/modules/security/target/database

test:compile:

test:test:
    [echo] NOTICE: Skipping tests; they seem to have passed already
    [echo] No tests to run.
Running post goal: test:test

jar:jar:

jar:install:
    [echo] Installing...
Uploading to geronimo/jars/geronimo-security-1.1-SNAPSHOT.jar: 
.................... (183K)
Uploading to geronimo/poms/geronimo-security-1.1-SNAPSHOT.pom: 
.................... (13K)

+----------------------------------------
| geronimo and geronimo-plugins Geronimo :: Web Services
| Memory: 14M/17M
+----------------------------------------
DEPRECATED: the default goal should be specified in the <build> section of project.xml instead of maven.xml

build:end:

build:start:

multiproject:install-callback:
    [echo] Running jar:install for Geronimo :: Web Services
java:prepare-filesystem:

java:compile:
<depend closure="false" srcdir="1.4" dump="false" destdir="/home/continuum/continuum-1.0.2/apps/continuum/work/68/modules/webservices/target/classes"></depend>    [echo] Compiling to /home/continuum/continuum-1.0.2/apps/continuum/work/68/modules/webservices/target/classes

java:jar-resources:

test:prepare-filesystem:

test:test-resources:

test:compile:
    [echo] No test source files to compile.

test:test:
    [echo] NOTICE: Skipping tests; they seem to have passed already
    [echo] No tests to run.
Running post goal: test:test

jar:jar:

jar:install:
    [echo] Installing...
Uploading to geronimo/jars/geronimo-webservices-1.1-SNAPSHOT.jar: 
.................... (34K)
Uploading to geronimo/poms/geronimo-webservices-1.1-SNAPSHOT.pom: 
.................... (12K)

+----------------------------------------
| geronimo and geronimo-plugins Geronimo :: Axis
| Memory: 14M/17M
+----------------------------------------
DEPRECATED: the default goal should be specified in the <build> section of project.xml instead of maven.xml
DEPRECATED: the default goal should be specified in the <build> section of project.xml instead of maven.xml

build:end:

Attempting to download geronimo-naming-1.1-SNAPSHOT.jar.
Attempting to download geronimo-security-1.1-SNAPSHOT.jar.
Attempting to download geronimo-webservices-1.1-SNAPSHOT.jar.
build:start:

multiproject:install-callback:
    [echo] Running jar:install for Geronimo :: Axis
java:prepare-filesystem:

java:compile:
<depend closure="false" srcdir="1.4" dump="false" destdir="/home/continuum/continuum-1.0.2/apps/continuum/work/68/modules/axis/target/classes"></depend>    [echo] Compiling to /home/continuum/continuum-1.0.2/apps/continuum/work/68/modules/axis/target/classes
Running post goal: java:compile
geronimo:dependency:


java:jar-resources:
Copying 1 file to /home/continuum/continuum-1.0.2/apps/continuum/work/68/modules/axis/target/classes

test:prepare-filesystem:

test:test-resources:

test:compile:

test:test:
    [echo] NOTICE: Skipping tests; they seem to have passed already
    [echo] No tests to run.
Running post goal: test:test

jar:jar:
    [jar] Building jar: /home/continuum/continuum-1.0.2/apps/continuum/work/68/modules/axis/target/geronimo-axis-1.1-SNAPSHOT.jar

jar:install:
    [echo] Installing...
Uploading to geronimo/jars/geronimo-axis-1.1-SNAPSHOT.jar: 
.................... (42K)
Uploading to geronimo/poms/geronimo-axis-1.1-SNAPSHOT.pom: 
.................... (12K)

+----------------------------------------
| geronimo and geronimo-plugins Geronimo :: Test :: DDBeans
| Memory: 11M/18M
+----------------------------------------
DEPRECATED: the default goal should be specified in the <build> section of project.xml instead of maven.xml
DEPRECATED: the default goal should be specified in the <build> section of project.xml instead of maven.xml

build:end:

build:start:

multiproject:install-callback:
    [echo] Running jar:install for Geronimo :: Test :: DDBeans
java:prepare-filesystem:

java:compile:
<depend closure="false" srcdir="1.4" dump="false" destdir="/home/continuum/continuum-1.0.2/apps/continuum/work/68/modules/test-ddbean/target/classes"></depend>    [echo] Compiling to /home/continuum/continuum-1.0.2/apps/continuum/work/68/modules/test-ddbean/target/classes

java:jar-resources:

test:prepare-filesystem:

test:test-resources:

test:compile:

test:test:
    [echo] NOTICE: Skipping tests; they seem to have passed already
    [echo] No tests to run.
Running post goal: test:test

jar:jar:

jar:install:
    [echo] Installing...
Uploading to geronimo/jars/geronimo-test-ddbean-1.1-SNAPSHOT.jar: 
.................... (17K)
Uploading to geronimo/poms/geronimo-test-ddbean-1.1-SNAPSHOT.pom: 
.................... (10K)

+----------------------------------------
| geronimo and geronimo-plugins Geronimo :: Transaction
| Memory: 11M/18M
+----------------------------------------
DEPRECATED: the default goal should be specified in the <build> section of project.xml instead of maven.xml

build:end:

build:start:

multiproject:install-callback:
    [echo] Running jar:install for Geronimo :: Transaction
java:prepare-filesystem:

java:compile:
<depend closure="false" srcdir="1.4" dump="false" destdir="/home/continuum/continuum-1.0.2/apps/continuum/work/68/modules/transaction/target/classes"></depend>    [echo] Compiling to /home/continuum/continuum-1.0.2/apps/continuum/work/68/modules/transaction/target/classes

java:jar-resources:

test:prepare-filesystem:

test:test-resources:

test:compile:

test:test:
    [echo] NOTICE: Skipping tests; they seem to have passed already
    [echo] No tests to run.
Running post goal: test:test

jar:jar:

jar:install:
    [echo] Installing...
Uploading to geronimo/jars/geronimo-transaction-1.1-SNAPSHOT.jar: 
.................... (73K)
Uploading to geronimo/poms/geronimo-transaction-1.1-SNAPSHOT.pom: 
.................... (12K)

+----------------------------------------
| geronimo and geronimo-plugins Geronimo :: Connector
| Memory: 12M/18M
+----------------------------------------
DEPRECATED: the default goal should be specified in the <build> section of project.xml instead of maven.xml
DEPRECATED: the default goal should be specified in the <build> section of project.xml instead of maven.xml

build:end:

Attempting to download geronimo-transaction-1.1-SNAPSHOT.jar.
build:start:

multiproject:install-callback:
    [echo] Running jar:install for Geronimo :: Connector
java:prepare-filesystem:

java:compile:
<depend closure="false" srcdir="1.4" dump="false" destdir="/home/continuum/continuum-1.0.2/apps/continuum/work/68/modules/connector/target/classes"></depend>    [echo] Compiling to /home/continuum/continuum-1.0.2/apps/continuum/work/68/modules/connector/target/classes

java:jar-resources:

test:prepare-filesystem:

test:test-resources:

test:compile:

test:test:
    [echo] NOTICE: Skipping tests; they seem to have passed already
    [echo] No tests to run.
Running post goal: test:test

jar:jar:

jar:install:
    [echo] Installing...
Uploading to geronimo/jars/geronimo-connector-1.1-SNAPSHOT.jar: 
.................... (130K)
Uploading to geronimo/poms/geronimo-connector-1.1-SNAPSHOT.pom: 
.................... (13K)

+----------------------------------------
| geronimo and geronimo-plugins Geronimo :: Security :: Builder
| Memory: 13M/18M
+----------------------------------------
DEPRECATED: the default goal should be specified in the <build> section of project.xml instead of maven.xml
DEPRECATED: the default goal should be specified in the <build> section of project.xml instead of maven.xml

build:end:

build:start:

multiproject:install-callback:
    [echo] Running jar:install for Geronimo :: Security :: Builder
java:prepare-filesystem:

java:compile:
<depend closure="false" srcdir="1.4" dump="false" destdir="/home/continuum/continuum-1.0.2/apps/continuum/work/68/modules/security-builder/target/classes"></depend>    [echo] Compiling to /home/continuum/continuum-1.0.2/apps/continuum/work/68/modules/security-builder/target/classes

java:jar-resources:

test:prepare-filesystem:

test:test-resources:
Running post goal: test:test-resources
    [delete] Deleting directory /home/continuum/continuum-1.0.2/apps/continuum/work/68/modules/security-builder/target/database
    [mkdir] Created dir: /home/continuum/continuum-1.0.2/apps/continuum/work/68/modules/security-builder/target/database

test:compile:
    [echo] No test source files to compile.

test:test:
    [echo] NOTICE: Skipping tests; they seem to have passed already
    [echo] No tests to run.
Running post goal: test:test

jar:jar:

jar:install:
    [echo] Installing...
Uploading to geronimo/jars/geronimo-security-builder-1.1-SNAPSHOT.jar: 
.................... (172K)
Uploading to geronimo/poms/geronimo-security-builder-1.1-SNAPSHOT.pom: 
.................... (12K)

+----------------------------------------
| geronimo and geronimo-plugins Geronimo :: J2EE
| Memory: 15M/18M
+----------------------------------------
DEPRECATED: the default goal should be specified in the <build> section of project.xml instead of maven.xml
DEPRECATED: the default goal should be specified in the <build> section of project.xml instead of maven.xml

build:end:

Attempting to download geronimo-security-builder-1.1-SNAPSHOT.jar.
build:start:

multiproject:install-callback:
    [echo] Running jar:install for Geronimo :: J2EE
java:prepare-filesystem:

java:compile:
<depend closure="false" srcdir="1.4" dump="false" destdir="/home/continuum/continuum-1.0.2/apps/continuum/work/68/modules/j2ee-builder/target/classes"></depend>    [echo] Compiling to /home/continuum/continuum-1.0.2/apps/continuum/work/68/modules/j2ee-builder/target/classes

java:jar-resources:

test:prepare-filesystem:

test:test-resources:

test:compile:
setupEar:

setupEar:

setupUnpackedEar:
setupBaseUnpackedEar:

setupBaseUnpackedEar:

setupBaseUnpackedEar:



test:test:
    [echo] NOTICE: Skipping tests; they seem to have passed already
    [echo] No tests to run.
Running post goal: test:test

jar:jar:

jar:install:
    [echo] Installing...
Uploading to geronimo/jars/geronimo-j2ee-builder-1.1-SNAPSHOT.jar: 
.................... (90K)
Uploading to geronimo/poms/geronimo-j2ee-builder-1.1-SNAPSHOT.pom: 
.................... (13K)

+----------------------------------------
| geronimo and geronimo-plugins Geronimo :: Naming :: Builder
| Memory: 16M/18M
+----------------------------------------
DEPRECATED: the default goal should be specified in the <build> section of project.xml instead of maven.xml
DEPRECATED: the default goal should be specified in the <build> section of project.xml instead of maven.xml

build:end:

Attempting to download geronimo-j2ee-builder-1.1-SNAPSHOT.jar.
build:start:

multiproject:install-callback:
    [echo] Running jar:install for Geronimo :: Naming :: Builder
java:prepare-filesystem:

java:compile:
<depend closure="false" srcdir="1.4" dump="false" destdir="/home/continuum/continuum-1.0.2/apps/continuum/work/68/modules/naming-builder/target/classes"></depend>    [echo] Compiling to /home/continuum/continuum-1.0.2/apps/continuum/work/68/modules/naming-builder/target/classes

java:jar-resources:

test:prepare-filesystem:

test:test-resources:

test:compile:

test:test:
    [echo] NOTICE: Skipping tests; they seem to have passed already
    [echo] No tests to run.
Running post goal: test:test

jar:jar:

jar:install:
    [echo] Installing...
Uploading to geronimo/jars/geronimo-naming-builder-1.1-SNAPSHOT.jar: 
.................... (160K)
Uploading to geronimo/poms/geronimo-naming-builder-1.1-SNAPSHOT.pom: 
.................... (13K)

+----------------------------------------
| geronimo and geronimo-plugins Geronimo :: Connector :: Builder
| Memory: 17M/18M
+----------------------------------------
DEPRECATED: the default goal should be specified in the <build> section of project.xml instead of maven.xml
DEPRECATED: the default goal should be specified in the <build> section of project.xml instead of maven.xml

build:end:

Attempting to download geronimo-test-ddbean-1.1-SNAPSHOT.jar.
Attempting to download geronimo-connector-1.1-SNAPSHOT.jar.
Attempting to download geronimo-naming-builder-1.1-SNAPSHOT.jar.
build:start:

multiproject:install-callback:
    [echo] Running jar:install for Geronimo :: Connector :: Builder
java:prepare-filesystem:

java:compile:
<depend closure="false" srcdir="1.4" dump="false" destdir="/home/continuum/continuum-1.0.2/apps/continuum/work/68/modules/connector-builder/target/classes"></depend>    [echo] Compiling to /home/continuum/continuum-1.0.2/apps/continuum/work/68/modules/connector-builder/target/classes

java:jar-resources:

test:prepare-filesystem:

test:test-resources:

test:compile:

test:test:
    [echo] NOTICE: Skipping tests; they seem to have passed already
    [echo] No tests to run.
Running post goal: test:test

jar:jar:

jar:install:
    [echo] Installing...
Uploading to geronimo/jars/geronimo-connector-builder-1.1-SNAPSHOT.jar: 
.................... (202K)
Uploading to geronimo/poms/geronimo-connector-builder-1.1-SNAPSHOT.pom: 
.................... (15K)

+----------------------------------------
| geronimo and geronimo-plugins Geronimo :: Axis :: Builder
| Memory: 13M/19M
+----------------------------------------
DEPRECATED: the default goal should be specified in the <build> section of project.xml instead of maven.xml
DEPRECATED: the default goal should be specified in the <build> section of project.xml instead of maven.xml

build:end:

Attempting to download geronimo-axis-1.1-SNAPSHOT.jar.
Attempting to download geronimo-connector-builder-1.1-SNAPSHOT.jar.
build:start:

multiproject:install-callback:
    [echo] Running jar:install for Geronimo :: Axis :: Builder
java:prepare-filesystem:

java:compile:
<depend closure="false" srcdir="1.4" dump="false" destdir="/home/continuum/continuum-1.0.2/apps/continuum/work/68/modules/axis-builder/target/classes"></depend>    [echo] Compiling to /home/continuum/continuum-1.0.2/apps/continuum/work/68/modules/axis-builder/target/classes

java:jar-resources:

test:prepare-filesystem:

test:test-resources:

test:compile:

test:test:
    [echo] NOTICE: Skipping tests; they seem to have passed already
    [echo] No tests to run.
Running post goal: test:test

jar:jar:

jar:install:
    [echo] Installing...
Uploading to geronimo/jars/geronimo-axis-builder-1.1-SNAPSHOT.jar: 
.................... (218K)
Uploading to geronimo/poms/geronimo-axis-builder-1.1-SNAPSHOT.pom: 
.................... (15K)

+----------------------------------------
| geronimo and geronimo-plugins Geronimo :: Client
| Memory: 14M/19M
+----------------------------------------
DEPRECATED: the default goal should be specified in the <build> section of project.xml instead of maven.xml

build:end:

build:start:

multiproject:install-callback:
    [echo] Running jar:install for Geronimo :: Client
java:prepare-filesystem:

java:compile:
<depend closure="false" srcdir="1.4" dump="false" destdir="/home/continuum/continuum-1.0.2/apps/continuum/work/68/modules/client/target/classes"></depend>    [echo] Compiling to /home/continuum/continuum-1.0.2/apps/continuum/work/68/modules/client/target/classes

java:jar-resources:

test:prepare-filesystem:

test:test-resources:

test:compile:
    [echo] No test source files to compile.

test:test:
    [echo] NOTICE: Skipping tests; they seem to have passed already
    [echo] No tests to run.
Running post goal: test:test

jar:jar:

jar:install:
    [echo] Installing...
Uploading to geronimo/jars/geronimo-client-1.1-SNAPSHOT.jar: 
.................... (14K)
Uploading to geronimo/poms/geronimo-client-1.1-SNAPSHOT.pom: 
.................... (12K)

+----------------------------------------
| geronimo and geronimo-plugins Geronimo :: Client Builder
| Memory: 15M/19M
+----------------------------------------
DEPRECATED: the default goal should be specified in the <build> section of project.xml instead of maven.xml
DEPRECATED: the default goal should be specified in the <build> section of project.xml instead of maven.xml

build:end:

Attempting to download geronimo-client-1.1-SNAPSHOT.jar.
build:start:

multiproject:install-callback:
    [echo] Running jar:install for Geronimo :: Client Builder
java:prepare-filesystem:

java:compile:
<depend closure="false" srcdir="1.4" dump="false" destdir="/home/continuum/continuum-1.0.2/apps/continuum/work/68/modules/client-builder/target/classes"></depend>    [echo] Compiling to /home/continuum/continuum-1.0.2/apps/continuum/work/68/modules/client-builder/target/classes

java:jar-resources:

test:prepare-filesystem:

test:test-resources:

test:compile:

test:test:
    [echo] NOTICE: Skipping tests; they seem to have passed already
    [echo] No tests to run.
Running post goal: test:test

jar:jar:

jar:install:
    [echo] Installing...
Uploading to geronimo/jars/geronimo-client-builder-1.1-SNAPSHOT.jar: 
.................... (46K)
Uploading to geronimo/poms/geronimo-client-builder-1.1-SNAPSHOT.pom: 
.................... (14K)

+----------------------------------------
| geronimo and geronimo-plugins Geronimo :: Console Web
| Memory: 16M/19M
+----------------------------------------
DEPRECATED: the default goal should be specified in the <build> section of project.xml instead of maven.xml
DEPRECATED: the default goal should be specified in the <build> section of project.xml instead of maven.xml

build:end:

build:start:

multiproject:install-callback:
    [echo] Running jar:install for Geronimo :: Console Web
java:prepare-filesystem:

java:compile:
<depend closure="false" srcdir="1.4" dump="false" destdir="/home/continuum/continuum-1.0.2/apps/continuum/work/68/modules/console-web/target/classes"></depend>    [echo] Compiling to /home/continuum/continuum-1.0.2/apps/continuum/work/68/modules/console-web/target/classes

java:jar-resources:

test:prepare-filesystem:

test:test-resources:

test:compile:
    [echo] No test source files to compile.

test:test:
    [echo] NOTICE: Skipping tests; they seem to have passed already
    [echo] No tests to run.
Running post goal: test:test

jar:jar:

jar:install:
    [echo] Installing...
Uploading to geronimo/jars/geronimo-console-web-1.1-SNAPSHOT.jar: 
.................... (17K)
Uploading to geronimo/poms/geronimo-console-web-1.1-SNAPSHOT.pom: 
.................... (11K)

+----------------------------------------
| geronimo and geronimo-plugins Geronimo :: Configuration Converter
| Memory: 18M/19M
+----------------------------------------
DEPRECATED: the default goal should be specified in the <build> section of project.xml instead of maven.xml
DEPRECATED: the default goal should be specified in the <build> section of project.xml instead of maven.xml

build:end:

build:start:

multiproject:install-callback:
    [echo] Running jar:install for Geronimo :: Configuration Converter
java:prepare-filesystem:

java:compile:
<depend closure="false" srcdir="1.4" dump="false" destdir="/home/continuum/continuum-1.0.2/apps/continuum/work/68/modules/converter/target/classes"></depend>    [echo] Compiling to /home/continuum/continuum-1.0.2/apps/continuum/work/68/modules/converter/target/classes

java:jar-resources:

test:prepare-filesystem:

test:test-resources:

test:compile:
    [echo] No test source files to compile.

test:test:
    [echo] NOTICE: Skipping tests; they seem to have passed already
    [echo] No tests to run.
Running post goal: test:test

jar:jar:

jar:install:
    [echo] Installing...
Uploading to geronimo/jars/geronimo-converter-1.1-SNAPSHOT.jar: 
.................... (25K)
Uploading to geronimo/poms/geronimo-converter-1.1-SNAPSHOT.pom: 
.................... (11K)

+----------------------------------------
| geronimo and geronimo-plugins Geronimo :: Web :: Builder
| Memory: 17M/19M
+----------------------------------------
DEPRECATED: the default goal should be specified in the <build> section of project.xml instead of maven.xml
DEPRECATED: the default goal should be specified in the <build> section of project.xml instead of maven.xml

build:end:

build:start:

multiproject:install-callback:
    [echo] Running jar:install for Geronimo :: Web :: Builder
java:prepare-filesystem:

java:compile:
<depend closure="false" srcdir="1.4" dump="false" destdir="/home/continuum/continuum-1.0.2/apps/continuum/work/68/modules/web-builder/target/classes"></depend>    [echo] Compiling to /home/continuum/continuum-1.0.2/apps/continuum/work/68/modules/web-builder/target/classes

java:jar-resources:

test:prepare-filesystem:

test:test-resources:

test:compile:

test:test:
    [echo] NOTICE: Skipping tests; they seem to have passed already
    [echo] No tests to run.
Running post goal: test:test

jar:jar:

jar:install:
    [echo] Installing...
Uploading to geronimo/jars/geronimo-web-builder-1.1-SNAPSHOT.jar: 
.................... (46K)
Uploading to geronimo/poms/geronimo-web-builder-1.1-SNAPSHOT.pom: 
.................... (13K)

+----------------------------------------
| geronimo and geronimo-plugins Geronimo :: Deploy :: JSR-88
| Memory: 18M/19M
+----------------------------------------
DEPRECATED: the default goal should be specified in the <build> section of project.xml instead of maven.xml
DEPRECATED: the default goal should be specified in the <build> section of project.xml instead of maven.xml

build:end:

Attempting to download geronimo-web-builder-1.1-SNAPSHOT.jar.
build:start:

multiproject:install-callback:
    [echo] Running jar:install for Geronimo :: Deploy :: JSR-88
java:prepare-filesystem:

java:compile:
<depend closure="false" srcdir="1.4" dump="false" destdir="/home/continuum/continuum-1.0.2/apps/continuum/work/68/modules/deploy-jsr88/target/classes"></depend>    [echo] Compiling to /home/continuum/continuum-1.0.2/apps/continuum/work/68/modules/deploy-jsr88/target/classes

java:jar-resources:

test:prepare-filesystem:

test:test-resources:

test:compile:

test:test:
    [echo] NOTICE: Skipping tests; they seem to have passed already
    [echo] No tests to run.
Running post goal: test:test

jar:jar:
    [echo] Generating Manifest file for JSR88-Deployer

jar:install:
    [echo] Installing...
Uploading to geronimo/jars/geronimo-deploy-jsr88-1.1-SNAPSHOT.jar: 
.................... (64K)
Uploading to geronimo/poms/geronimo-deploy-jsr88-1.1-SNAPSHOT.pom: 
.................... (13K)

+----------------------------------------
| geronimo and geronimo-plugins Geronimo :: Deploy :: CLI Tool
| Memory: 13M/19M
+----------------------------------------
DEPRECATED: the default goal should be specified in the <build> section of project.xml instead of maven.xml
DEPRECATED: the default goal should be specified in the <build> section of project.xml instead of maven.xml

build:end:

Attempting to download geronimo-deploy-jsr88-1.1-SNAPSHOT.jar.
build:start:

multiproject:install-callback:
    [echo] Running jar:install for Geronimo :: Deploy :: CLI Tool
java:prepare-filesystem:

java:compile:
<depend closure="false" srcdir="1.4" dump="false" destdir="/home/continuum/continuum-1.0.2/apps/continuum/work/68/modules/deploy-tool/target/classes"></depend>    [echo] Compiling to /home/continuum/continuum-1.0.2/apps/continuum/work/68/modules/deploy-tool/target/classes

java:jar-resources:

test:prepare-filesystem:

test:test-resources:

test:compile:

test:test:
    [echo] NOTICE: Skipping tests; they seem to have passed already
    [echo] No tests to run.
Running post goal: test:test

jar:jar:

jar:install:
    [echo] Installing...
Uploading to geronimo/jars/geronimo-deploy-tool-1.1-SNAPSHOT.jar: 
.................... (56K)
Uploading to geronimo/poms/geronimo-deploy-tool-1.1-SNAPSHOT.pom: 
.................... (12K)

+----------------------------------------
| geronimo and geronimo-plugins Geronimo :: Derby
| Memory: 13M/19M
+----------------------------------------
DEPRECATED: the default goal should be specified in the <build> section of project.xml instead of maven.xml

build:end:

build:start:

multiproject:install-callback:
    [echo] Running jar:install for Geronimo :: Derby
java:prepare-filesystem:

java:compile:
<depend closure="false" srcdir="1.4" dump="false" destdir="/home/continuum/continuum-1.0.2/apps/continuum/work/68/modules/derby/target/classes"></depend>    [echo] Compiling to /home/continuum/continuum-1.0.2/apps/continuum/work/68/modules/derby/target/classes

java:jar-resources:

test:prepare-filesystem:

test:test-resources:

test:compile:

test:test:
    [echo] NOTICE: Skipping tests; they seem to have passed already
    [echo] No tests to run.
Running post goal: test:test

jar:jar:

jar:install:
    [echo] Installing...
Uploading to geronimo/jars/geronimo-derby-1.1-SNAPSHOT.jar: 
.................... (12K)
Uploading to geronimo/poms/geronimo-derby-1.1-SNAPSHOT.pom: 
.................... (11K)

+----------------------------------------
| geronimo and geronimo-plugins Geronimo :: Directory
| Memory: 13M/19M
+----------------------------------------
DEPRECATED: the default goal should be specified in the <build> section of project.xml instead of maven.xml
DEPRECATED: the default goal should be specified in the <build> section of project.xml instead of maven.xml

build:end:

build:start:

multiproject:install-callback:
    [echo] Running jar:install for Geronimo :: Directory
java:prepare-filesystem:

java:compile:
<depend closure="false" srcdir="1.4" dump="false" destdir="/home/continuum/continuum-1.0.2/apps/continuum/work/68/modules/directory/target/classes"></depend>    [echo] Compiling to /home/continuum/continuum-1.0.2/apps/continuum/work/68/modules/directory/target/classes
Running post goal: java:compile
geronimo:dependency:


java:jar-resources:
Copying 1 file to /home/continuum/continuum-1.0.2/apps/continuum/work/68/modules/directory/target/classes

test:prepare-filesystem:

test:test-resources:

test:compile:

test:test:
    [echo] NOTICE: Skipping tests; they seem to have passed already
    [echo] No tests to run.
Running post goal: test:test

jar:jar:
    [jar] Building jar: /home/continuum/continuum-1.0.2/apps/continuum/work/68/modules/directory/target/geronimo-directory-1.1-SNAPSHOT.jar

jar:install:
    [echo] Installing...
Uploading to geronimo/jars/geronimo-directory-1.1-SNAPSHOT.jar: 
.................... (114K)
Uploading to geronimo/poms/geronimo-directory-1.1-SNAPSHOT.pom: 
.................... (16K)

+----------------------------------------
| geronimo and geronimo-plugins Geronimo :: Deploy :: Hot Deployer
| Memory: 15M/19M
+----------------------------------------
DEPRECATED: the default goal should be specified in the <build> section of project.xml instead of maven.xml
DEPRECATED: the default goal should be specified in the <build> section of project.xml instead of maven.xml

build:end:

Attempting to download geronimo-deploy-tool-1.1-SNAPSHOT.jar.
build:start:

multiproject:install-callback:
    [echo] Running jar:install for Geronimo :: Deploy :: Hot Deployer
java:prepare-filesystem:

java:compile:
<depend closure="false" srcdir="1.4" dump="false" destdir="/home/continuum/continuum-1.0.2/apps/continuum/work/68/modules/hot-deploy/target/classes"></depend>    [echo] Compiling to /home/continuum/continuum-1.0.2/apps/continuum/work/68/modules/hot-deploy/target/classes

java:jar-resources:

test:prepare-filesystem:

test:test-resources:

test:compile:
    [echo] No test source files to compile.

test:test:
    [echo] NOTICE: Skipping tests; they seem to have passed already
    [echo] No tests to run.
Running post goal: test:test

jar:jar:

jar:install:
    [echo] Installing...
Uploading to geronimo/jars/geronimo-hot-deploy-1.1-SNAPSHOT.jar: 
.................... (19K)
Uploading to geronimo/poms/geronimo-hot-deploy-1.1-SNAPSHOT.pom: 
.................... (12K)

+----------------------------------------
| geronimo and geronimo-plugins Geronimo :: Installer Processing
| Memory: 16M/19M
+----------------------------------------
DEPRECATED: the default goal should be specified in the <build> section of project.xml instead of maven.xml
DEPRECATED: the default goal should be specified in the <build> section of project.xml instead of maven.xml

build:end:

build:start:

multiproject:install-callback:
    [echo] Running jar:install for Geronimo :: Installer Processing
java:prepare-filesystem:

java:compile:
<depend closure="false" srcdir="1.4" dump="false" destdir="/home/continuum/continuum-1.0.2/apps/continuum/work/68/modules/installer-processing/target/classes"></depend>    [echo] Compiling to /home/continuum/continuum-1.0.2/apps/continuum/work/68/modules/installer-processing/target/classes
Running post goal: java:compile
geronimo:dependency:

    [echo] Maven local repo is: /home/continuum/.geronimo-1.1-maven/repository
    [echo] Maven build dir is: /home/continuum/continuum-1.0.2/apps/continuum/work/68/modules/installer-processing/target

java:jar-resources:

test:prepare-filesystem:

test:test-resources:

test:compile:
    [echo] No test source files to compile.

test:test:
    [echo] NOTICE: Skipping tests; they seem to have passed already
    [echo] No tests to run.
Running post goal: test:test

jar:jar:

jar:install:
    [echo] Installing...
Uploading to geronimo/jars/geronimo-installer-processing-1.1-SNAPSHOT.jar: 
.................... (15K)
Uploading to geronimo/poms/geronimo-installer-processing-1.1-SNAPSHOT.pom: 
.................... (10K)

+----------------------------------------
| geronimo and geronimo-plugins Geronimo :: Installer Support
| Memory: 16M/19M
+----------------------------------------
DEPRECATED: the default goal should be specified in the <build> section of project.xml instead of maven.xml
DEPRECATED: the default goal should be specified in the <build> section of project.xml instead of maven.xml

build:end:

build:start:

multiproject:install-callback:
    [echo] Running jar:install for Geronimo :: Installer Support
java:prepare-filesystem:

java:compile:
<depend closure="false" srcdir="1.4" dump="false" destdir="/home/continuum/continuum-1.0.2/apps/continuum/work/68/modules/installer-support/target/classes"></depend>    [echo] Compiling to /home/continuum/continuum-1.0.2/apps/continuum/work/68/modules/installer-support/target/classes
Running post goal: java:compile
geronimo:dependency:

    [echo] Maven local repo is: /home/continuum/.geronimo-1.1-maven/repository
    [echo] Maven build dir is: /home/continuum/continuum-1.0.2/apps/continuum/work/68/modules/installer-support/target
    [unjar] Expanding: /home/continuum/continuum-1.0.2/apps/continuum/work/68/modules/installer-support/target/standalone-compiler-custom-3.8.0.jar into /home/continuum/continuum-1.0.2/apps/continuum/work/68/modules/installer-support/target/tmp
    [echo] Built Geronimo custom IzPack installer jar
    [echo] Copying standalone-compiler-custom-3.8.0 to local repo

java:jar-resources:

test:prepare-filesystem:

test:test-resources:

test:compile:
    [echo] No test source files to compile.

test:test:
    [echo] NOTICE: Skipping tests; they seem to have passed already
    [echo] No tests to run.
Running post goal: test:test

jar:jar:

jar:install:
    [echo] Installing...
Uploading to geronimo/jars/geronimo-installer-support-1.1-SNAPSHOT.jar: 
.................... (50K)
Uploading to geronimo/poms/geronimo-installer-support-1.1-SNAPSHOT.pom: 
.................... (10K)

+----------------------------------------
| geronimo and geronimo-plugins Geronimo :: JavaMail Transport
| Memory: 15M/25M
+----------------------------------------
DEPRECATED: the default goal should be specified in the <build> section of project.xml instead of maven.xml

build:end:

build:start:

multiproject:install-callback:
    [echo] Running jar:install for Geronimo :: JavaMail Transport
java:prepare-filesystem:

java:compile:
<depend closure="false" srcdir="1.4" dump="false" destdir="/home/continuum/continuum-1.0.2/apps/continuum/work/68/modules/javamail-transport/target/classes"></depend>    [echo] Compiling to /home/continuum/continuum-1.0.2/apps/continuum/work/68/modules/javamail-transport/target/classes

java:jar-resources:

test:prepare-filesystem:

test:test-resources:

test:compile:
    [echo] No test source files to compile.

test:test:
    [echo] NOTICE: Skipping tests; they seem to have passed already
    [echo] No tests to run.
Running post goal: test:test

jar:jar:

jar:install:
    [echo] Installing...
Uploading to geronimo/jars/geronimo-javamail-transport-1.1-SNAPSHOT.jar: 
.................... (13K)
Uploading to geronimo/poms/geronimo-javamail-transport-1.1-SNAPSHOT.pom: 
.................... (10K)

+----------------------------------------
| geronimo and geronimo-plugins Geronimo :: Jetty
| Memory: 14M/25M
+----------------------------------------
DEPRECATED: the default goal should be specified in the <build> section of project.xml instead of maven.xml
DEPRECATED: the default goal should be specified in the <build> section of project.xml instead of maven.xml

build:end:

build:start:

multiproject:install-callback:
    [echo] Running jar:install for Geronimo :: Jetty
java:prepare-filesystem:

java:compile:
<depend closure="false" srcdir="1.4" dump="false" destdir="/home/continuum/continuum-1.0.2/apps/continuum/work/68/modules/jetty/target/classes"></depend>    [echo] Compiling to /home/continuum/continuum-1.0.2/apps/continuum/work/68/modules/jetty/target/classes
Running post goal: java:compile
geronimo:dependency:


java:jar-resources:
Copying 1 file to /home/continuum/continuum-1.0.2/apps/continuum/work/68/modules/jetty/target/classes

test:prepare-filesystem:

test:test-resources:

test:compile:

test:test:
    [echo] NOTICE: Skipping tests; they seem to have passed already
    [echo] No tests to run.
Running post goal: test:test

jar:jar:
    [jar] Building jar: /home/continuum/continuum-1.0.2/apps/continuum/work/68/modules/jetty/target/geronimo-jetty-1.1-SNAPSHOT.jar

jar:install:
    [echo] Installing...
Uploading to geronimo/jars/geronimo-jetty-1.1-SNAPSHOT.jar: 
.................... (81K)
Uploading to geronimo/poms/geronimo-jetty-1.1-SNAPSHOT.pom: 
.................... (16K)

+----------------------------------------
| geronimo and geronimo-plugins Geronimo :: Jetty :: Builder
| Memory: 16M/25M
+----------------------------------------
DEPRECATED: the default goal should be specified in the <build> section of project.xml instead of maven.xml
DEPRECATED: the default goal should be specified in the <build> section of project.xml instead of maven.xml

build:end:

Attempting to download geronimo-jetty-1.1-SNAPSHOT.jar.
build:start:

multiproject:install-callback:
    [echo] Running jar:install for Geronimo :: Jetty :: Builder
java:prepare-filesystem:

java:compile:
<depend closure="false" srcdir="1.4" dump="false" destdir="/home/continuum/continuum-1.0.2/apps/continuum/work/68/modules/jetty-builder/target/classes"></depend>    [echo] Compiling to /home/continuum/continuum-1.0.2/apps/continuum/work/68/modules/jetty-builder/target/classes

java:jar-resources:

test:prepare-filesystem:

test:test-resources:

test:compile:

test:test:
    [echo] NOTICE: Skipping tests; they seem to have passed already
    [echo] No tests to run.
Running post goal: test:test

jar:jar:

jar:install:
    [echo] Installing...
Uploading to geronimo/jars/geronimo-jetty-builder-1.1-SNAPSHOT.jar: 
.................... (64K)
Uploading to geronimo/poms/geronimo-jetty-builder-1.1-SNAPSHOT.pom: 
.................... (18K)

+----------------------------------------
| geronimo and geronimo-plugins Geronimo :: JMX Remoting
| Memory: 19M/25M
+----------------------------------------
DEPRECATED: the default goal should be specified in the <build> section of project.xml instead of maven.xml

build:end:

build:start:

multiproject:install-callback:
    [echo] Running jar:install for Geronimo :: JMX Remoting
java:prepare-filesystem:

java:compile:
<depend closure="false" srcdir="1.4" dump="false" destdir="/home/continuum/continuum-1.0.2/apps/continuum/work/68/modules/jmx-remoting/target/classes"></depend>    [echo] Compiling to /home/continuum/continuum-1.0.2/apps/continuum/work/68/modules/jmx-remoting/target/classes

java:jar-resources:

test:prepare-filesystem:

test:test-resources:

test:compile:

test:test:
    [echo] NOTICE: Skipping tests; they seem to have passed already
    [echo] No tests to run.
Running post goal: test:test

jar:jar:

jar:install:
    [echo] Installing...
Uploading to geronimo/jars/geronimo-jmxremoting-1.1-SNAPSHOT.jar: 
.................... (10K)
Uploading to geronimo/poms/geronimo-jmxremoting-1.1-SNAPSHOT.pom: 
.................... (11K)

+----------------------------------------
| geronimo and geronimo-plugins Geronimo :: Mail
| Memory: 18M/25M
+----------------------------------------
DEPRECATED: the default goal should be specified in the <build> section of project.xml instead of maven.xml

build:end:

build:start:

multiproject:install-callback:
    [echo] Running jar:install for Geronimo :: Mail
java:prepare-filesystem:

java:compile:
<depend closure="false" srcdir="1.4" dump="false" destdir="/home/continuum/continuum-1.0.2/apps/continuum/work/68/modules/mail/target/classes"></depend>    [echo] Compiling to /home/continuum/continuum-1.0.2/apps/continuum/work/68/modules/mail/target/classes

java:jar-resources:

test:prepare-filesystem:

test:test-resources:

test:compile:

test:test:
    [echo] NOTICE: Skipping tests; they seem to have passed already
    [echo] No tests to run.
Running post goal: test:test

jar:jar:

jar:install:
    [echo] Installing...
Uploading to geronimo/jars/geronimo-mail-1.1-SNAPSHOT.jar: 
.................... (21K)
Uploading to geronimo/poms/geronimo-mail-1.1-SNAPSHOT.pom: 
.................... (11K)

+----------------------------------------
| geronimo and geronimo-plugins Geronimo :: Scripts
| Memory: 20M/25M
+----------------------------------------
DEPRECATED: the default goal should be specified in the <build> section of project.xml instead of maven.xml

build:end:

build:start:

multiproject:install-callback:
    [echo] Running jar:install for Geronimo :: Scripts
java:prepare-filesystem:

java:compile:
    [echo] Compiling to /home/continuum/continuum-1.0.2/apps/continuum/work/68/modules/scripts/target/classes
    [echo] No java source files to compile.

java:jar-resources:

test:prepare-filesystem:

test:test-resources:

test:compile:
    [echo] No test source files to compile.

test:test:
    [echo] NOTICE: Skipping tests; they seem to have passed already
    [echo] No tests to run.
Running post goal: test:test

jar:jar:

jar:install:
    [echo] Installing...
Uploading to geronimo/jars/geronimo-scripts-1.1-SNAPSHOT.jar: 
.................... (3214K)
Uploading to geronimo/poms/geronimo-scripts-1.1-SNAPSHOT.pom: 
.................... (10K)

+----------------------------------------
| geronimo and geronimo-plugins Geronimo :: Timer
| Memory: 20M/25M
+----------------------------------------
DEPRECATED: the default goal should be specified in the <build> section of project.xml instead of maven.xml

build:end:

build:start:

multiproject:install-callback:
    [echo] Running jar:install for Geronimo :: Timer
java:prepare-filesystem:

java:compile:
<depend closure="false" srcdir="1.4" dump="false" destdir="/home/continuum/continuum-1.0.2/apps/continuum/work/68/modules/timer/target/classes"></depend>    [echo] Compiling to /home/continuum/continuum-1.0.2/apps/continuum/work/68/modules/timer/target/classes

java:jar-resources:

test:prepare-filesystem:

test:test-resources:

test:compile:

test:test:
    [echo] NOTICE: Skipping tests; they seem to have passed already
    [echo] No tests to run.
Running post goal: test:test

jar:jar:

jar:install:
    [echo] Installing...
Uploading to geronimo/jars/geronimo-timer-1.1-SNAPSHOT.jar: 
.................... (38K)
Uploading to geronimo/poms/geronimo-timer-1.1-SNAPSHOT.pom: 
.................... (12K)

+----------------------------------------
| geronimo and geronimo-plugins Geronimo :: Tomcat
| Memory: 20M/25M
+----------------------------------------
DEPRECATED: the default goal should be specified in the <build> section of project.xml instead of maven.xml
DEPRECATED: the default goal should be specified in the <build> section of project.xml instead of maven.xml

build:end:

build:start:

multiproject:install-callback:
    [echo] Running jar:install for Geronimo :: Tomcat
java:prepare-filesystem:

java:compile:
<depend closure="false" srcdir="1.4" dump="false" destdir="/home/continuum/continuum-1.0.2/apps/continuum/work/68/modules/tomcat/target/classes"></depend>    [echo] Compiling to /home/continuum/continuum-1.0.2/apps/continuum/work/68/modules/tomcat/target/classes
Running post goal: java:compile
geronimo:dependency:


java:jar-resources:
Copying 1 file to /home/continuum/continuum-1.0.2/apps/continuum/work/68/modules/tomcat/target/classes

test:prepare-filesystem:

test:test-resources:

test:compile:

test:test:
    [echo] NOTICE: Skipping tests; they seem to have passed already
    [echo] No tests to run.
Running post goal: test:test

jar:jar:
    [jar] Building jar: /home/continuum/continuum-1.0.2/apps/continuum/work/68/modules/tomcat/target/geronimo-tomcat-1.1-SNAPSHOT.jar

jar:install:
    [echo] Installing...
Uploading to geronimo/jars/geronimo-tomcat-1.1-SNAPSHOT.jar: 
.................... (130K)
Uploading to geronimo/poms/geronimo-tomcat-1.1-SNAPSHOT.pom: 
.................... (21K)

+----------------------------------------
| geronimo and geronimo-plugins Geronimo :: Tomcat :: Builder
| Memory: 23M/25M
+----------------------------------------
DEPRECATED: the default goal should be specified in the <build> section of project.xml instead of maven.xml
DEPRECATED: the default goal should be specified in the <build> section of project.xml instead of maven.xml

build:end:

Attempting to download geronimo-tomcat-1.1-SNAPSHOT.jar.
Attempting to download geronimo-axis-builder-1.1-SNAPSHOT.jar.
build:start:

multiproject:install-callback:
    [echo] Running jar:install for Geronimo :: Tomcat :: Builder
java:prepare-filesystem:

java:compile:
<depend closure="false" srcdir="1.4" dump="false" destdir="/home/continuum/continuum-1.0.2/apps/continuum/work/68/modules/tomcat-builder/target/classes"></depend>    [echo] Compiling to /home/continuum/continuum-1.0.2/apps/continuum/work/68/modules/tomcat-builder/target/classes

java:jar-resources:

test:prepare-filesystem:

test:test-resources:

test:compile:

test:test:
    [echo] NOTICE: Skipping tests; they seem to have passed already
    [echo] No tests to run.
Running post goal: test:test

jar:jar:

jar:install:
    [echo] Installing...
Uploading to geronimo/jars/geronimo-tomcat-builder-1.1-SNAPSHOT.jar: 
.................... (65K)
Uploading to geronimo/poms/geronimo-tomcat-builder-1.1-SNAPSHOT.pom: 
.................... (20K)

+----------------------------------------
| geronimo and geronimo-plugins Geronimo :: Upgrade
| Memory: 16M/27M
+----------------------------------------
DEPRECATED: the default goal should be specified in the <build> section of project.xml instead of maven.xml

build:end:

Attempting to download geronimo-client-builder-1.1-SNAPSHOT.jar.
Attempting to download geronimo-jetty-builder-1.1-SNAPSHOT.jar.
Attempting to download geronimo-tomcat-builder-1.1-SNAPSHOT.jar.
Attempting to download openejb-builder-2.1-SNAPSHOT.jar.
build:start:

multiproject:install-callback:
    [echo] Running jar:install for Geronimo :: Upgrade
java:prepare-filesystem:

java:compile:
<depend closure="false" srcdir="1.4" dump="false" destdir="/home/continuum/continuum-1.0.2/apps/continuum/work/68/modules/upgrade/target/classes"></depend>    [echo] Compiling to /home/continuum/continuum-1.0.2/apps/continuum/work/68/modules/upgrade/target/classes

java:jar-resources:

test:prepare-filesystem:

test:test-resources:

test:compile:

test:test:
    [echo] NOTICE: Skipping tests; they seem to have passed already
    [echo] No tests to run.
Running post goal: test:test

jar:jar:

jar:install:
    [echo] Installing...
Uploading to geronimo/jars/geronimo-upgrade-1.1-SNAPSHOT.jar: 
.................... (9K)
Uploading to geronimo/poms/geronimo-upgrade-1.1-SNAPSHOT.pom: 
.................... (11K)

+----------------------------------------
| geronimo and geronimo-plugins Geronimo :: Maven Assembly Plugin
| Memory: 17M/27M
+----------------------------------------
DEPRECATED: the default goal should be specified in the <build> section of project.xml instead of maven.xml

build:end:

build:start:

multiproject:install-callback:
    [echo] Running plugin:repository-install for Geronimo :: Maven Assembly Plugin
plugin:plugin:
java:prepare-filesystem:

java:compile:
    [echo] Compiling to /home/continuum/continuum-1.0.2/apps/continuum/work/68/plugins/geronimo-assembly-plugin/target/classes

java:jar-resources:

test:prepare-filesystem:

test:test-resources:

test:compile:
    [echo] No test source files to compile.

test:test:
    [echo] No tests to run.

jar:jar:


plugin:repository-install:
    [echo] Installing...
Uploading to geronimo/plugins/geronimo-assembly-plugin-1.1.0-10.jar: 
.................... (17K)
Uploading to geronimo/poms/geronimo-assembly-plugin-1.1.0-10.pom: 
.................... (1K)

+----------------------------------------
| geronimo and geronimo-plugins Geronimo :: Maven Deployment Plugin
| Memory: 16M/27M
+----------------------------------------
DEPRECATED: the default goal should be specified in the <build> section of project.xml instead of maven.xml

build:end:

build:start:

multiproject:install-callback:
    [echo] Running plugin:repository-install for Geronimo :: Maven Deployment Plugin
plugin:plugin:
java:prepare-filesystem:

java:compile:
    [echo] Compiling to /home/continuum/continuum-1.0.2/apps/continuum/work/68/plugins/geronimo-deployment-plugin/target/classes

java:jar-resources:

test:prepare-filesystem:

test:test-resources:

test:compile:
    [echo] No test source files to compile.

test:test:
    [echo] No tests to run.

jar:jar:


plugin:repository-install:
    [echo] Installing...
Uploading to geronimo/plugins/geronimo-deployment-plugin-1.1.0-2.jar: 
.................... (31K)
Uploading to geronimo/poms/geronimo-deployment-plugin-1.1.0-2.pom: 
.................... (3K)

+----------------------------------------
| geronimo and geronimo-plugins Geronimo :: IZPack Installer Build Plugin
| Memory: 17M/27M
+----------------------------------------
DEPRECATED: the default goal should be specified in the <build> section of project.xml instead of maven.xml

build:end:

build:start:

multiproject:install-callback:
    [echo] Running plugin:repository-install for Geronimo :: IZPack Installer Build Plugin
plugin:plugin:
java:prepare-filesystem:

java:compile:
    [echo] Compiling to /home/continuum/continuum-1.0.2/apps/continuum/work/68/plugins/geronimo-izpack-plugin/target/classes
    [echo] No java source files to compile.

java:jar-resources:

test:prepare-filesystem:

test:test-resources:

test:compile:
    [echo] No test source files to compile.

test:test:
    [echo] No tests to run.

jar:jar:


plugin:repository-install:
    [echo] Installing...
Uploading to geronimo/plugins/geronimo-izpack-plugin-1.1-SNAPSHOT.jar: 
.................... (7K)
Uploading to geronimo/poms/geronimo-izpack-plugin-1.1-SNAPSHOT.pom: 
.................... (1K)

+----------------------------------------
| geronimo and geronimo-plugins Geronimo :: Maven Packaging Plugin
| Memory: 17M/27M
+----------------------------------------
DEPRECATED: the default goal should be specified in the <build> section of project.xml instead of maven.xml

build:end:

build:start:

multiproject:install-callback:
    [echo] Running plugin:repository-install for Geronimo :: Maven Packaging Plugin
plugin:plugin:
java:prepare-filesystem:

java:compile:
    [echo] Compiling to /home/continuum/continuum-1.0.2/apps/continuum/work/68/plugins/geronimo-packaging-plugin/target/classes

java:jar-resources:

test:prepare-filesystem:

test:test-resources:

test:compile:

test:test:
    [junit] Running org.apache.geronimo.plugin.packaging.PlanProcessorTest
    [junit] Tests run: 1, Failures: 0, Errors: 0, Time elapsed: 1.34 sec

jar:jar:


plugin:repository-install:
    [echo] Installing...
Uploading to geronimo/plugins/geronimo-packaging-plugin-1.1.0-5.jar: 
.................... (29K)
Uploading to geronimo/poms/geronimo-packaging-plugin-1.1.0-5.pom: 
.................... (4K)


build:end:


Starting the reactor...
Our processing order:
OpenEJB :: Core
OpenEJB :: PK Generation :: Builder
OpenEJB :: Builder
+----------------------------------------
| openejb OpenEJB :: Core
| Memory: 17M/27M
+----------------------------------------
DEPRECATED: the default goal should be specified in the <build> section of project.xml instead of maven.xml
DEPRECATED: the default goal should be specified in the <build> section of project.xml instead of maven.xml
new2:
Attempting to download geronimo-timer-1.1-SNAPSHOT.jar.
Attempting to download geronimo-corba_2.3_spec-1.1-SNAPSHOT.jar.
build:start:

multiproject:install-callback:
    [echo] Running jar:install for OpenEJB :: Core
java:prepare-filesystem:

java:compile:
<depend closure="false" srcdir="1.4" dump="false" destdir="/home/continuum/continuum-1.0.2/apps/continuum/work/68/openejb/modules/core/target/classes"></depend>    [echo] Compiling to /home/continuum/continuum-1.0.2/apps/continuum/work/68/openejb/modules/core/target/classes
Running post goal: java:compile
geronimo:dependency:


java:jar-resources:

test:prepare-filesystem:

test:test-resources:

test:compile:

test:test:
    [echo] NOTICE: Skipping tests; they seem to have passed already
    [echo] No tests to run.
Running post goal: test:test

jar:jar:

jar:install:
    [echo] Installing...
Uploading to openejb/jars/openejb-core-2.1-SNAPSHOT.jar: 
.................... (1186K)
Uploading to openejb/poms/openejb-core-2.1-SNAPSHOT.pom: 
.................... (13K)

+----------------------------------------
| openejb OpenEJB :: PK Generation :: Builder
| Memory: 20M/27M
+----------------------------------------
DEPRECATED: the default goal should be specified in the <build> section of project.xml instead of maven.xml
DEPRECATED: the default goal should be specified in the <build> section of project.xml instead of maven.xml

build:end:

Attempting to download openejb-core-2.1-SNAPSHOT.jar.
build:start:

multiproject:install-callback:
    [echo] Running jar:install for OpenEJB :: PK Generation :: Builder
java:prepare-filesystem:

java:compile:
<depend closure="false" srcdir="1.4" dump="false" destdir="/home/continuum/continuum-1.0.2/apps/continuum/work/68/openejb/modules/pkgen-builder/target/classes"></depend>    [echo] Compiling to /home/continuum/continuum-1.0.2/apps/continuum/work/68/openejb/modules/pkgen-builder/target/classes

java:jar-resources:

test:prepare-filesystem:

test:test-resources:

test:compile:
    [echo] No test source files to compile.

test:test:
    [echo] NOTICE: Skipping tests; they seem to have passed already
    [echo] No tests to run.
Running post goal: test:test

jar:jar:

jar:install:
    [echo] Installing...
Uploading to openejb/jars/openejb-pkgen-builder-2.1-SNAPSHOT.jar: 
.................... (52K)
Uploading to openejb/poms/openejb-pkgen-builder-2.1-SNAPSHOT.pom: 
.................... (6K)

+----------------------------------------
| openejb OpenEJB :: Builder
| Memory: 19M/27M
+----------------------------------------
DEPRECATED: the default goal should be specified in the <build> section of project.xml instead of maven.xml
DEPRECATED: the default goal should be specified in the <build> section of project.xml instead of maven.xml

build:end:

Attempting to download openejb-pkgen-builder-2.1-SNAPSHOT.jar.
build:start:

multiproject:install-callback:
    [echo] Running jar:install for OpenEJB :: Builder
java:prepare-filesystem:

java:compile:
<depend closure="false" srcdir="1.4" dump="false" destdir="/home/continuum/continuum-1.0.2/apps/continuum/work/68/openejb/modules/openejb-builder/target/classes"></depend>    [echo] Compiling to /home/continuum/continuum-1.0.2/apps/continuum/work/68/openejb/modules/openejb-builder/target/classes

java:jar-resources:

test:prepare-filesystem:

test:test-resources:

test:compile:

test:test:
    [echo] NOTICE: Skipping tests; they seem to have passed already
    [echo] No tests to run.
Running post goal: test:test

jar:jar:

jar:install:
    [echo] Installing...
Uploading to openejb/jars/openejb-builder-2.1-SNAPSHOT.jar: 
.................... (605K)
Uploading to openejb/poms/openejb-builder-2.1-SNAPSHOT.pom: 
.................... (16K)


build:end:


Starting the reactor...
Our processing order:
Geronimo :: Console :: Common Code
Geronimo :: Console :: Portal Framework
Geronimo :: Console :: Standard Portlets
Geronimo :: Console :: Application EAR
DayTrader :: Core
DayTrader :: Derby Database
DayTrader :: WS Application Client
DayTrader :: EJBs
DayTrader :: Web Application
DayTrader :: Quote Streamer
DayTrader :: Enterprise Application
Geronimo :: Demo Webapp
Geronimo :: JMX Debug Webapp
Geronimo :: LDAP Demo Application
Geronimo :: The Magic G Ball Sample Application
Geronimo :: Remote Deploy GBean
Geronimo :: Remote Deploy Application
Geronimo :: UDDI-Server database
Geronimo :: UDDI-Server
Geronimo :: Welcome Application
+----------------------------------------
| applications Geronimo :: Console :: Common Code
| Memory: 25M/27M
+----------------------------------------
DEPRECATED: the default goal should be specified in the <build> section of project.xml instead of maven.xml
DEPRECATED: the default goal should be specified in the <build> section of project.xml instead of maven.xml
new3:
build:start:

multiproject:install-callback:
    [echo] Running jar:install for Geronimo :: Console :: Common Code
java:prepare-filesystem:

java:compile:
<depend closure="false" srcdir="1.4" dump="false" destdir="/home/continuum/continuum-1.0.2/apps/continuum/work/68/applications/console-core/target/classes"></depend>    [echo] Compiling to /home/continuum/continuum-1.0.2/apps/continuum/work/68/applications/console-core/target/classes
Running post goal: java:compile

java:jar-resources:

test:prepare-filesystem:

test:test-resources:

test:compile:
    [echo] No test source files to compile.

test:test:
    [echo] NOTICE: Skipping tests; they seem to have passed already
    [echo] No tests to run.
Running post goal: test:test

jar:jar:
    [jar] Building jar: /home/continuum/continuum-1.0.2/apps/continuum/work/68/applications/console-core/target/geronimo-console-core-1.1-SNAPSHOT.jar

jar:install:
    [echo] Installing...
Uploading to geronimo/jars/geronimo-console-core-1.1-SNAPSHOT.jar: 
.................... (40K)
Uploading to geronimo/poms/geronimo-console-core-1.1-SNAPSHOT.pom: 
.................... (13K)

+----------------------------------------
| applications Geronimo :: Console :: Portal Framework
| Memory: 25M/27M
+----------------------------------------
DEPRECATED: the default goal should be specified in the <build> section of project.xml instead of maven.xml
DEPRECATED: the default goal should be specified in the <build> section of project.xml instead of maven.xml

build:end:

Attempting to download geronimo-j2ee_1.4_spec-1.1-SNAPSHOT.jar.
build:start:

multiproject:install-callback:
    [echo] Running war:install for Geronimo :: Console :: Portal Framework
Tag library requested that is not present: 'caller' in plugin: 'maven-war-plugin-1.6.1'
Could not load class: org.apache.geronimo.deployment.mavenplugin.MergeWebXML exception: java.lang.ClassNotFoundException: org.apache.geronimo.deployment.mavenplugin.MergeWebXML
java.lang.ClassNotFoundException: org.apache.geronimo.deployment.mavenplugin.MergeWebXML
	at java.net.URLClassLoader$1.run(URLClassLoader.java:199)
	at java.security.AccessController.doPrivileged(Native Method)
	at java.net.URLClassLoader.findClass(URLClassLoader.java:187)
	at java.lang.ClassLoader.loadClass(ClassLoader.java:289)
	at java.lang.ClassLoader.loadClass(ClassLoader.java:235)
	at org.apache.commons.jelly.util.ClassLoaderUtils.loadClass(ClassLoaderUtils.java:124)
	at org.apache.commons.jelly.tags.define.BeanTag.doTag(BeanTag.java:92)
	at org.apache.commons.jelly.impl.TagScript.run(TagScript.java:247)
	at org.apache.commons.jelly.impl.ScriptBlock.run(ScriptBlock.java:95)
	at org.apache.commons.jelly.TagSupport.invokeBody(TagSupport.java:186)
	at org.apache.commons.jelly.tags.define.TaglibTag.doTag(TaglibTag.java:64)
	at org.apache.commons.jelly.impl.TagScript.run(TagScript.java:247)
	at org.apache.commons.jelly.impl.ScriptBlock.run(ScriptBlock.java:95)
	at org.apache.commons.jelly.TagSupport.invokeBody(TagSupport.java:186)
	at org.apache.maven.werkz.jelly.ProjectTag.doTag(ProjectTag.java:128)
	at org.apache.commons.jelly.impl.TagScript.run(TagScript.java:247)
	at org.apache.maven.plugin.PluginManager.runScript(PluginManager.java:1169)
	at org.apache.maven.plugin.PluginManager.initialiseHousingPluginContext(PluginManager.java:792)
	at org.apache.maven.plugin.PluginManager.prepAttainGoal(PluginManager.java:747)
	at org.apache.maven.jelly.tags.werkz.MavenAttainGoalTag.doTag(MavenAttainGoalTag.java:108)
	at org.apache.commons.jelly.impl.TagScript.run(TagScript.java:247)
	at org.apache.commons.jelly.impl.ScriptBlock.run(ScriptBlock.java:95)
	at org.apache.maven.jelly.tags.werkz.MavenGoalTag.runBodyTag(MavenGoalTag.java:78)
	at org.apache.maven.jelly.tags.werkz.MavenGoalTag$MavenGoalAction.performAction(MavenGoalTag.java:109)
	at org.apache.maven.werkz.Goal.fire(Goal.java:656)
	at org.apache.maven.werkz.Goal.attain(Goal.java:592)
	at org.apache.maven.plugin.PluginManager.attainGoals(PluginManager.java:693)
	at org.apache.maven.MavenSession.attainGoals(MavenSession.java:263)
	at org.apache.maven.jelly.tags.maven.ReactorTag.doTag(ReactorTag.java:368)
	at org.apache.commons.jelly.impl.TagScript.run(TagScript.java:247)
	at org.apache.commons.jelly.impl.ScriptBlock.run(ScriptBlock.java:95)
	at org.apache.maven.jelly.tags.werkz.MavenGoalTag.runBodyTag(MavenGoalTag.java:78)
	at org.apache.maven.jelly.tags.werkz.MavenGoalTag$MavenGoalAction.performAction(MavenGoalTag.java:109)
	at org.apache.maven.werkz.Goal.fire(Goal.java:656)
	at org.apache.maven.werkz.Goal.attain(Goal.java:592)
	at org.apache.maven.werkz.WerkzProject.attainGoal(WerkzProject.java:210)
	at org.apache.maven.jelly.tags.werkz.MavenAttainGoalTag.doTag(MavenAttainGoalTag.java:114)
	at org.apache.commons.jelly.impl.TagScript.run(TagScript.java:247)
	at org.apache.commons.jelly.impl.ScriptBlock.run(ScriptBlock.java:95)
	at org.apache.maven.jelly.tags.werkz.MavenGoalTag.runBodyTag(MavenGoalTag.java:78)
	at org.apache.maven.jelly.tags.werkz.MavenGoalTag$MavenGoalAction.performAction(MavenGoalTag.java:109)
	at org.apache.maven.werkz.Goal.fire(Goal.java:656)
	at org.apache.maven.werkz.Goal.attain(Goal.java:592)
	at org.apache.maven.plugin.PluginManager.attainGoals(PluginManager.java:693)
	at org.apache.maven.MavenSession.attainGoals(MavenSession.java:263)
	at org.apache.maven.cli.App.doMain(App.java:511)
	at org.apache.maven.cli.App.main(App.java:1258)
	at sun.reflect.NativeMethodAccessorImpl.invoke0(Native Method)
	at sun.reflect.NativeMethodAccessorImpl.invoke(NativeMethodAccessorImpl.java:39)
	at sun.reflect.DelegatingMethodAccessorImpl.invoke(DelegatingMethodAccessorImpl.java:25)
	at java.lang.reflect.Method.invoke(Method.java:324)
	at com.werken.forehead.Forehead.run(Forehead.java:551)
	at com.werken.forehead.Forehead.main(Forehead.java:581)

BUILD FAILED
File...... /home/continuum/continuum-1.0.2/apps/continuum/work/68/maven.xml
Element... maven:reactor
Line...... 53
Column.... -1
Unable to obtain goal [multiproject:install-callback] -- /home/continuum/.geronimo-1.1-maven/cache/maven-multiproject-plugin-1.4.1/plugin.jelly:256:-1: <attainGoal> /home/continuum/.geronimo-1.1-maven/cache/geronimo-deployment-plugin-1.1.0-2/plugin.jelly:58:-1: <define:jellybean> Could not find class: org.apache.geronimo.deployment.mavenplugin.MergeWebXML using ClassLoader: null
Total time   : 4 minutes 12 seconds 
Finished at  : Friday, April 21, 2006 6:02:24 AM PDT


****************************************************************************



Mime
View raw message