geronimo-scm mailing list archives

Site index · List index
Message view « Date » · « Thread »
Top « Date » · « Thread »
From continuum <contin...@stan.gbuild.org>
Subject [continuum] BUILD FAILURE: Geronimo 1.1
Date Sat, 22 Apr 2006 05:26:46 GMT
Online report : http://ci.gbuild.org/continuum/servlet/continuum/target/ProjectBuild.vm/view/ProjectBuild/id/68/buildId/2497
Build statistics:
  State: Failed
  Previous State: Ok
  Started at: Fri, 21 Apr 2006 22:18:40 -0700
  Finished at: Fri, 21 Apr 2006 22:26:44 -0700
  Total time: 8m 3s
  Build Trigger: Schedule
  Exit code: 70
  Building machine hostname: stan.gbuild.org
  Operating system : Linux(unknown)
  Java version : 1.4.2_08(Sun Microsystems Inc.)

Changes
                            configs/welcome-tomcat/maven.xml
            configs/welcome-tomcat/project.xml
            configs/welcome-tomcat/src/conf/geronimo-plugin.xml
            configs/welcome-jetty/maven.xml
            configs/welcome-jetty/src/conf/geronimo-plugin.xml
        
****************************************************************************
Output:
****************************************************************************
 __  __
|  \/  |__ _Apache__ ___
| |\/| / _` \ V / -_) ' \  ~ intelligent projects ~
|_|  |_\__,_|\_/\___|_||_|  v. 1.1-beta-2

DEPRECATED: the default goal should be specified in the <build> section of project.xml instead of maven.xml
DEPRECATED: the default goal should be specified in the <build> section of project.xml instead of maven.xml
build:start:

m:checkout:
    [exec] Checked out revision 2620.
Starting the reactor...
Our processing order:

new:
new0:

Starting the reactor...
Our processing order:
new00:

Starting the reactor...
Our processing order:
Geronimo :: Activation
Geronimo :: Kernel
Geronimo :: Common
Geronimo :: Util
Geronimo :: System
Geronimo :: Deployment
Geronimo :: Deploy :: Common Config
Geronimo :: Management API
Geronimo :: Core
Geronimo :: J2EE
Geronimo :: J2EE Schema
Geronimo :: Service :: Builder
Geronimo :: Maven Dependency Plugin
Geronimo :: Naming
Geronimo :: Security
Geronimo :: Web Services
Geronimo :: Axis
Geronimo :: Test :: DDBeans
Geronimo :: Transaction
Geronimo :: Connector
Geronimo :: Security :: Builder
Geronimo :: J2EE
Geronimo :: Naming :: Builder
Geronimo :: Connector :: Builder
Geronimo :: Axis :: Builder
Geronimo :: Client
Geronimo :: Client Builder
Geronimo :: Console Web
Geronimo :: Configuration Converter
Geronimo :: Web :: Builder
Geronimo :: Deploy :: JSR-88
Geronimo :: Deploy :: CLI Tool
Geronimo :: Derby
Geronimo :: Directory
Geronimo :: Deploy :: Hot Deployer
Geronimo :: Installer Processing
Geronimo :: Installer Support
Geronimo :: JavaMail Transport
Geronimo :: Jetty
Geronimo :: Jetty :: Builder
Geronimo :: JMX Remoting
Geronimo :: Mail
Geronimo :: Scripts
Geronimo :: Timer
Geronimo :: Tomcat
Geronimo :: Tomcat :: Builder
Geronimo :: Upgrade
Geronimo :: Maven Assembly Plugin
Geronimo :: Maven Deployment Plugin
Geronimo :: IZPack Installer Build Plugin
Geronimo :: Maven Packaging Plugin
+----------------------------------------
| geronimo and geronimo-plugins Geronimo :: Activation
| Memory: 5M/10M
+----------------------------------------
DEPRECATED: the default goal should be specified in the <build> section of project.xml instead of maven.xml
new1:
Attempting to download geronimo-javamail_1.3.1_spec-1.1-SNAPSHOT.jar.
build:start:

multiproject:install-callback:
    [echo] Running jar:install for Geronimo :: Activation
java:prepare-filesystem:

java:compile:
<depend closure="false" srcdir="1.4" dump="false" destdir="/home/continuum/continuum-1.0.2/apps/continuum/work/68/modules/activation/target/classes"></depend>    [echo] Compiling to /home/continuum/continuum-1.0.2/apps/continuum/work/68/modules/activation/target/classes

java:jar-resources:

test:prepare-filesystem:

test:test-resources:

test:compile:

test:test:
    [echo] NOTICE: Skipping tests; they seem to have passed already
    [echo] No tests to run.
Running post goal: test:test

jar:jar:

jar:install:
    [echo] Installing...
Uploading to geronimo/jars/geronimo-activation-1.1-SNAPSHOT.jar: 
.................... (13K)
Uploading to geronimo/poms/geronimo-activation-1.1-SNAPSHOT.pom: 
.................... (10K)

+----------------------------------------
| geronimo and geronimo-plugins Geronimo :: Kernel
| Memory: 9M/10M
+----------------------------------------
DEPRECATED: the default goal should be specified in the <build> section of project.xml instead of maven.xml
DEPRECATED: the default goal should be specified in the <build> section of project.xml instead of maven.xml

build:end:

build:start:

multiproject:install-callback:
    [echo] Running jar:install for Geronimo :: Kernel
Tag library requested that is not present: 'xmlbeans2:maven' in plugin: 'null'
java:prepare-filesystem:

java:compile:
<depend closure="false" srcdir="1.4" dump="false" destdir="/home/continuum/continuum-1.0.2/apps/continuum/work/68/modules/kernel/target/classes"></depend>    [echo] Compiling to /home/continuum/continuum-1.0.2/apps/continuum/work/68/modules/kernel/target/classes

java:jar-resources:

test:prepare-filesystem:

test:test-resources:

test:compile:

test:test:
    [echo] NOTICE: Skipping tests; they seem to have passed already
    [echo] No tests to run.
Running post goal: test:test

jar:jar:

jar:install:
    [echo] Installing...
Uploading to geronimo/jars/geronimo-kernel-1.1-SNAPSHOT.jar: 
.................... (307K)
Uploading to geronimo/poms/geronimo-kernel-1.1-SNAPSHOT.pom: 
.................... (11K)

+----------------------------------------
| geronimo and geronimo-plugins Geronimo :: Common
| Memory: 8M/14M
+----------------------------------------
DEPRECATED: the default goal should be specified in the <build> section of project.xml instead of maven.xml

build:end:

Attempting to download geronimo-kernel-1.1-SNAPSHOT.jar.
build:start:

multiproject:install-callback:
    [echo] Running jar:install for Geronimo :: Common
java:prepare-filesystem:

java:compile:
<depend closure="false" srcdir="1.4" dump="false" destdir="/home/continuum/continuum-1.0.2/apps/continuum/work/68/modules/common/target/classes"></depend>    [echo] Compiling to /home/continuum/continuum-1.0.2/apps/continuum/work/68/modules/common/target/classes

java:jar-resources:

test:prepare-filesystem:

test:test-resources:

test:compile:

test:test:
    [echo] NOTICE: Skipping tests; they seem to have passed already
    [echo] No tests to run.
Running post goal: test:test

jar:jar:

jar:install:
    [echo] Installing...
Uploading to geronimo/jars/geronimo-common-1.1-SNAPSHOT.jar: 
.................... (36K)
Uploading to geronimo/poms/geronimo-common-1.1-SNAPSHOT.pom: 
.................... (10K)

+----------------------------------------
| geronimo and geronimo-plugins Geronimo :: Util
| Memory: 10M/14M
+----------------------------------------
DEPRECATED: the default goal should be specified in the <build> section of project.xml instead of maven.xml

build:end:

build:start:

multiproject:install-callback:
    [echo] Running jar:install for Geronimo :: Util
java:prepare-filesystem:

java:compile:
<depend closure="false" srcdir="1.4" dump="false" destdir="/home/continuum/continuum-1.0.2/apps/continuum/work/68/modules/util/target/classes"></depend>    [echo] Compiling to /home/continuum/continuum-1.0.2/apps/continuum/work/68/modules/util/target/classes

java:jar-resources:

test:prepare-filesystem:

test:test-resources:

test:compile:

test:test:
    [echo] NOTICE: Skipping tests; they seem to have passed already
    [echo] No tests to run.
Running post goal: test:test

jar:jar:

jar:install:
    [echo] Installing...
Uploading to geronimo/jars/geronimo-util-1.1-SNAPSHOT.jar: 
.................... (243K)
Uploading to geronimo/poms/geronimo-util-1.1-SNAPSHOT.pom: 
.................... (10K)

+----------------------------------------
| geronimo and geronimo-plugins Geronimo :: System
| Memory: 11M/14M
+----------------------------------------
DEPRECATED: the default goal should be specified in the <build> section of project.xml instead of maven.xml
DEPRECATED: the default goal should be specified in the <build> section of project.xml instead of maven.xml

build:end:

Attempting to download geronimo-common-1.1-SNAPSHOT.jar.
Attempting to download geronimo-util-1.1-SNAPSHOT.jar.
build:start:

multiproject:install-callback:
    [echo] Running jar:install for Geronimo :: System
java:prepare-filesystem:

java:compile:
<depend closure="false" srcdir="1.4" dump="false" destdir="/home/continuum/continuum-1.0.2/apps/continuum/work/68/modules/system/target/classes"></depend>    [echo] Compiling to /home/continuum/continuum-1.0.2/apps/continuum/work/68/modules/system/target/classes
Running post goal: java:compile

java:jar-resources:

test:prepare-filesystem:

test:test-resources:
Running post goal: test:test-resources
    [delete] Deleting directory /home/continuum/continuum-1.0.2/apps/continuum/work/68/modules/system/target/tmp
    [mkdir] Created dir: /home/continuum/continuum-1.0.2/apps/continuum/work/68/modules/system/target/tmp

test:compile:

test:test:
    [echo] NOTICE: Skipping tests; they seem to have passed already
    [echo] No tests to run.
Running post goal: test:test

jar:jar:
    [jar] Building jar: /home/continuum/continuum-1.0.2/apps/continuum/work/68/modules/system/target/geronimo-system-1.1-SNAPSHOT.jar

jar:install:
    [echo] Installing...
Uploading to geronimo/jars/geronimo-system-1.1-SNAPSHOT.jar: 
.................... (237K)
Uploading to geronimo/poms/geronimo-system-1.1-SNAPSHOT.pom: 
.................... (11K)

+----------------------------------------
| geronimo and geronimo-plugins Geronimo :: Deployment
| Memory: 12M/14M
+----------------------------------------
DEPRECATED: the default goal should be specified in the <build> section of project.xml instead of maven.xml
DEPRECATED: the default goal should be specified in the <build> section of project.xml instead of maven.xml

build:end:

Attempting to download geronimo-system-1.1-SNAPSHOT.jar.
build:start:

multiproject:install-callback:
    [echo] Running jar:install for Geronimo :: Deployment
java:prepare-filesystem:

java:compile:
<depend closure="false" srcdir="1.4" dump="false" destdir="/home/continuum/continuum-1.0.2/apps/continuum/work/68/modules/deployment/target/classes"></depend>    [echo] Compiling to /home/continuum/continuum-1.0.2/apps/continuum/work/68/modules/deployment/target/classes

java:jar-resources:

test:prepare-filesystem:

test:test-resources:

test:compile:

test:test:
    [echo] NOTICE: Skipping tests; they seem to have passed already
    [echo] No tests to run.
Running post goal: test:test

jar:jar:

jar:install:
    [echo] Installing...
Uploading to geronimo/jars/geronimo-deployment-1.1-SNAPSHOT.jar: 
.................... (52K)
Uploading to geronimo/poms/geronimo-deployment-1.1-SNAPSHOT.pom: 
.................... (11K)

+----------------------------------------
| geronimo and geronimo-plugins Geronimo :: Deploy :: Common Config
| Memory: 9M/15M
+----------------------------------------
DEPRECATED: the default goal should be specified in the <build> section of project.xml instead of maven.xml
DEPRECATED: the default goal should be specified in the <build> section of project.xml instead of maven.xml

build:end:

build:start:

multiproject:install-callback:
    [echo] Running jar:install for Geronimo :: Deploy :: Common Config
java:prepare-filesystem:

java:compile:
<depend closure="false" srcdir="1.4" dump="false" destdir="/home/continuum/continuum-1.0.2/apps/continuum/work/68/modules/deploy-config/target/classes"></depend>    [echo] Compiling to /home/continuum/continuum-1.0.2/apps/continuum/work/68/modules/deploy-config/target/classes

java:jar-resources:

test:prepare-filesystem:

test:test-resources:

test:compile:

test:test:
    [echo] NOTICE: Skipping tests; they seem to have passed already
    [echo] No tests to run.
Running post goal: test:test

jar:jar:

jar:install:
    [echo] Installing...
Uploading to geronimo/jars/geronimo-deploy-config-1.1-SNAPSHOT.jar: 
.................... (10K)
Uploading to geronimo/poms/geronimo-deploy-config-1.1-SNAPSHOT.pom: 
.................... (11K)

+----------------------------------------
| geronimo and geronimo-plugins Geronimo :: Management API
| Memory: 10M/15M
+----------------------------------------
DEPRECATED: the default goal should be specified in the <build> section of project.xml instead of maven.xml
DEPRECATED: the default goal should be specified in the <build> section of project.xml instead of maven.xml

build:end:

build:start:

multiproject:install-callback:
    [echo] Running jar:install for Geronimo :: Management API
java:prepare-filesystem:

java:compile:
<depend closure="false" srcdir="1.4" dump="false" destdir="/home/continuum/continuum-1.0.2/apps/continuum/work/68/modules/management/target/classes"></depend>    [echo] Compiling to /home/continuum/continuum-1.0.2/apps/continuum/work/68/modules/management/target/classes

java:jar-resources:

test:prepare-filesystem:

test:test-resources:

test:compile:
    [echo] No test source files to compile.

test:test:
    [echo] NOTICE: Skipping tests; they seem to have passed already
    [echo] No tests to run.
Running post goal: test:test

jar:jar:

jar:install:
    [echo] Installing...
Uploading to geronimo/jars/geronimo-management-1.1-SNAPSHOT.jar: 
.................... (39K)
Uploading to geronimo/poms/geronimo-management-1.1-SNAPSHOT.pom: 
.................... (10K)

+----------------------------------------
| geronimo and geronimo-plugins Geronimo :: Core
| Memory: 11M/15M
+----------------------------------------
DEPRECATED: the default goal should be specified in the <build> section of project.xml instead of maven.xml
DEPRECATED: the default goal should be specified in the <build> section of project.xml instead of maven.xml

build:end:

Attempting to download geronimo-management-1.1-SNAPSHOT.jar.
build:start:

multiproject:install-callback:
    [echo] Running jar:install for Geronimo :: Core
java:prepare-filesystem:

java:compile:
<depend closure="false" srcdir="1.4" dump="false" destdir="/home/continuum/continuum-1.0.2/apps/continuum/work/68/modules/core/target/classes"></depend>    [echo] Compiling to /home/continuum/continuum-1.0.2/apps/continuum/work/68/modules/core/target/classes

java:jar-resources:

test:prepare-filesystem:

test:test-resources:

test:compile:

test:test:
    [echo] NOTICE: Skipping tests; they seem to have passed already
    [echo] No tests to run.
Running post goal: test:test

jar:jar:

jar:install:
    [echo] Installing...
Uploading to geronimo/jars/geronimo-core-1.1-SNAPSHOT.jar: 
.................... (39K)
Uploading to geronimo/poms/geronimo-core-1.1-SNAPSHOT.pom: 
.................... (11K)

+----------------------------------------
| geronimo and geronimo-plugins Geronimo :: J2EE
| Memory: 12M/15M
+----------------------------------------
DEPRECATED: the default goal should be specified in the <build> section of project.xml instead of maven.xml
DEPRECATED: the default goal should be specified in the <build> section of project.xml instead of maven.xml

build:end:

Attempting to download geronimo-core-1.1-SNAPSHOT.jar.
build:start:

multiproject:install-callback:
    [echo] Running jar:install for Geronimo :: J2EE
java:prepare-filesystem:

java:compile:
<depend closure="false" srcdir="1.4" dump="false" destdir="/home/continuum/continuum-1.0.2/apps/continuum/work/68/modules/j2ee/target/classes"></depend>    [echo] Compiling to /home/continuum/continuum-1.0.2/apps/continuum/work/68/modules/j2ee/target/classes

java:jar-resources:

test:prepare-filesystem:

test:test-resources:

test:compile:

test:test:
    [echo] NOTICE: Skipping tests; they seem to have passed already
    [echo] No tests to run.
Running post goal: test:test

jar:jar:

jar:install:
    [echo] Installing...
Uploading to geronimo/jars/geronimo-j2ee-1.1-SNAPSHOT.jar: 
.................... (29K)
Uploading to geronimo/poms/geronimo-j2ee-1.1-SNAPSHOT.pom: 
.................... (12K)

+----------------------------------------
| geronimo and geronimo-plugins Geronimo :: J2EE Schema
| Memory: 13M/15M
+----------------------------------------
DEPRECATED: the default goal should be specified in the <build> section of project.xml instead of maven.xml
DEPRECATED: the default goal should be specified in the <build> section of project.xml instead of maven.xml

build:end:

build:start:

multiproject:install-callback:
    [echo] Running jar:install for Geronimo :: J2EE Schema
java:prepare-filesystem:

java:compile:
<depend closure="false" srcdir="1.4" dump="false" destdir="/home/continuum/continuum-1.0.2/apps/continuum/work/68/modules/j2ee-schema/target/classes"></depend>    [echo] Compiling to /home/continuum/continuum-1.0.2/apps/continuum/work/68/modules/j2ee-schema/target/classes

java:jar-resources:

test:prepare-filesystem:

test:test-resources:

test:compile:

test:test:
    [echo] NOTICE: Skipping tests; they seem to have passed already
    [echo] No tests to run.
Running post goal: test:test

jar:jar:

jar:install:
    [echo] Installing...
Uploading to geronimo/jars/geronimo-j2ee-schema-1.1-SNAPSHOT.jar: 
.................... (1501K)
Uploading to geronimo/poms/geronimo-j2ee-schema-1.1-SNAPSHOT.pom: 
.................... (11K)

+----------------------------------------
| geronimo and geronimo-plugins Geronimo :: Service :: Builder
| Memory: 11M/16M
+----------------------------------------
DEPRECATED: the default goal should be specified in the <build> section of project.xml instead of maven.xml
DEPRECATED: the default goal should be specified in the <build> section of project.xml instead of maven.xml

build:end:

Attempting to download geronimo-deployment-1.1-SNAPSHOT.jar.
Attempting to download geronimo-deploy-config-1.1-SNAPSHOT.jar.
Attempting to download geronimo-j2ee-1.1-SNAPSHOT.jar.
Attempting to download geronimo-j2ee-schema-1.1-SNAPSHOT.jar.
build:start:

multiproject:install-callback:
    [echo] Running jar:install for Geronimo :: Service :: Builder
java:prepare-filesystem:

java:compile:
<depend closure="false" srcdir="1.4" dump="false" destdir="/home/continuum/continuum-1.0.2/apps/continuum/work/68/modules/service-builder/target/classes"></depend>    [echo] Compiling to /home/continuum/continuum-1.0.2/apps/continuum/work/68/modules/service-builder/target/classes

java:jar-resources:

test:prepare-filesystem:

test:test-resources:

test:compile:

test:test:
    [echo] NOTICE: Skipping tests; they seem to have passed already
    [echo] No tests to run.
Running post goal: test:test

jar:jar:

jar:install:
    [echo] Installing...
Uploading to geronimo/jars/geronimo-service-builder-1.1-SNAPSHOT.jar: 
.................... (179K)
Uploading to geronimo/poms/geronimo-service-builder-1.1-SNAPSHOT.pom: 
.................... (12K)

+----------------------------------------
| geronimo and geronimo-plugins Geronimo :: Maven Dependency Plugin
| Memory: 12M/16M
+----------------------------------------
DEPRECATED: the default goal should be specified in the <build> section of project.xml instead of maven.xml

build:end:

Attempting to download geronimo-service-builder-1.1-SNAPSHOT.jar.
Artifact /geronimo/jars/geronimo-service-builder-1.1-SNAPSHOT.jar doesn't exist in remote repository, but it exists locally.
build:start:

multiproject:install-callback:
    [echo] Running plugin:repository-install for Geronimo :: Maven Dependency Plugin
plugin:plugin:
java:prepare-filesystem:

java:compile:
    [echo] Compiling to /home/continuum/continuum-1.0.2/apps/continuum/work/68/plugins/geronimo-dependency-plugin/target/classes

java:jar-resources:

test:prepare-filesystem:

test:test-resources:

test:compile:
    [echo] No test source files to compile.

test:test:
    [echo] No tests to run.

jar:jar:


plugin:repository-install:
    [echo] Installing...
Uploading to geronimo/plugins/geronimo-dependency-plugin-1.1.0-2.jar: 
.................... (9K)
Uploading to geronimo/poms/geronimo-dependency-plugin-1.1.0-2.pom: 
.................... (1K)

+----------------------------------------
| geronimo and geronimo-plugins Geronimo :: Naming
| Memory: 12M/16M
+----------------------------------------
DEPRECATED: the default goal should be specified in the <build> section of project.xml instead of maven.xml
DEPRECATED: the default goal should be specified in the <build> section of project.xml instead of maven.xml

build:end:

build:start:

multiproject:install-callback:
    [echo] Running jar:install for Geronimo :: Naming
java:prepare-filesystem:

java:compile:
<depend closure="false" srcdir="1.4" dump="false" destdir="/home/continuum/continuum-1.0.2/apps/continuum/work/68/modules/naming/target/classes"></depend>    [echo] Compiling to /home/continuum/continuum-1.0.2/apps/continuum/work/68/modules/naming/target/classes

java:jar-resources:

test:prepare-filesystem:

test:test-resources:

test:compile:

test:test:
    [echo] NOTICE: Skipping tests; they seem to have passed already
    [echo] No tests to run.
Running post goal: test:test

jar:jar:

jar:install:
    [echo] Installing...
Uploading to geronimo/jars/geronimo-naming-1.1-SNAPSHOT.jar: 
.................... (46K)
Uploading to geronimo/poms/geronimo-naming-1.1-SNAPSHOT.pom: 
.................... (10K)

+----------------------------------------
| geronimo and geronimo-plugins Geronimo :: Security
| Memory: 12M/16M
+----------------------------------------
DEPRECATED: the default goal should be specified in the <build> section of project.xml instead of maven.xml
DEPRECATED: the default goal should be specified in the <build> section of project.xml instead of maven.xml

build:end:

build:start:

multiproject:install-callback:
    [echo] Running jar:install for Geronimo :: Security
java:prepare-filesystem:

java:compile:
<depend closure="false" srcdir="1.4" dump="false" destdir="/home/continuum/continuum-1.0.2/apps/continuum/work/68/modules/security/target/classes"></depend>    [echo] Compiling to /home/continuum/continuum-1.0.2/apps/continuum/work/68/modules/security/target/classes

java:jar-resources:

test:prepare-filesystem:

test:test-resources:
Running post goal: test:test-resources
    [delete] Deleting directory /home/continuum/continuum-1.0.2/apps/continuum/work/68/modules/security/target/database
    [mkdir] Created dir: /home/continuum/continuum-1.0.2/apps/continuum/work/68/modules/security/target/database

test:compile:

test:test:
    [echo] NOTICE: Skipping tests; they seem to have passed already
    [echo] No tests to run.
Running post goal: test:test

jar:jar:

jar:install:
    [echo] Installing...
Uploading to geronimo/jars/geronimo-security-1.1-SNAPSHOT.jar: 
.................... (183K)
Uploading to geronimo/poms/geronimo-security-1.1-SNAPSHOT.pom: 
.................... (13K)

+----------------------------------------
| geronimo and geronimo-plugins Geronimo :: Web Services
| Memory: 15M/16M
+----------------------------------------
DEPRECATED: the default goal should be specified in the <build> section of project.xml instead of maven.xml

build:end:

build:start:

multiproject:install-callback:
    [echo] Running jar:install for Geronimo :: Web Services
java:prepare-filesystem:

java:compile:
<depend closure="false" srcdir="1.4" dump="false" destdir="/home/continuum/continuum-1.0.2/apps/continuum/work/68/modules/webservices/target/classes"></depend>    [echo] Compiling to /home/continuum/continuum-1.0.2/apps/continuum/work/68/modules/webservices/target/classes

java:jar-resources:

test:prepare-filesystem:

test:test-resources:

test:compile:
    [echo] No test source files to compile.

test:test:
    [echo] NOTICE: Skipping tests; they seem to have passed already
    [echo] No tests to run.
Running post goal: test:test

jar:jar:

jar:install:
    [echo] Installing...
Uploading to geronimo/jars/geronimo-webservices-1.1-SNAPSHOT.jar: 
.................... (34K)
Uploading to geronimo/poms/geronimo-webservices-1.1-SNAPSHOT.pom: 
.................... (12K)

+----------------------------------------
| geronimo and geronimo-plugins Geronimo :: Axis
| Memory: 16M/16M
+----------------------------------------
DEPRECATED: the default goal should be specified in the <build> section of project.xml instead of maven.xml
DEPRECATED: the default goal should be specified in the <build> section of project.xml instead of maven.xml

build:end:

Attempting to download geronimo-naming-1.1-SNAPSHOT.jar.
Attempting to download geronimo-security-1.1-SNAPSHOT.jar.
Attempting to download geronimo-webservices-1.1-SNAPSHOT.jar.
build:start:

multiproject:install-callback:
    [echo] Running jar:install for Geronimo :: Axis
java:prepare-filesystem:

java:compile:
<depend closure="false" srcdir="1.4" dump="false" destdir="/home/continuum/continuum-1.0.2/apps/continuum/work/68/modules/axis/target/classes"></depend>    [echo] Compiling to /home/continuum/continuum-1.0.2/apps/continuum/work/68/modules/axis/target/classes
Running post goal: java:compile
geronimo:dependency:


java:jar-resources:
Copying 1 file to /home/continuum/continuum-1.0.2/apps/continuum/work/68/modules/axis/target/classes

test:prepare-filesystem:

test:test-resources:

test:compile:

test:test:
    [echo] NOTICE: Skipping tests; they seem to have passed already
    [echo] No tests to run.
Running post goal: test:test

jar:jar:
    [jar] Building jar: /home/continuum/continuum-1.0.2/apps/continuum/work/68/modules/axis/target/geronimo-axis-1.1-SNAPSHOT.jar

jar:install:
    [echo] Installing...
Uploading to geronimo/jars/geronimo-axis-1.1-SNAPSHOT.jar: 
.................... (42K)
Uploading to geronimo/poms/geronimo-axis-1.1-SNAPSHOT.pom: 
.................... (12K)

+----------------------------------------
| geronimo and geronimo-plugins Geronimo :: Test :: DDBeans
| Memory: 11M/18M
+----------------------------------------
DEPRECATED: the default goal should be specified in the <build> section of project.xml instead of maven.xml
DEPRECATED: the default goal should be specified in the <build> section of project.xml instead of maven.xml

build:end:

build:start:

multiproject:install-callback:
    [echo] Running jar:install for Geronimo :: Test :: DDBeans
java:prepare-filesystem:

java:compile:
<depend closure="false" srcdir="1.4" dump="false" destdir="/home/continuum/continuum-1.0.2/apps/continuum/work/68/modules/test-ddbean/target/classes"></depend>    [echo] Compiling to /home/continuum/continuum-1.0.2/apps/continuum/work/68/modules/test-ddbean/target/classes

java:jar-resources:

test:prepare-filesystem:

test:test-resources:

test:compile:

test:test:
    [echo] NOTICE: Skipping tests; they seem to have passed already
    [echo] No tests to run.
Running post goal: test:test

jar:jar:

jar:install:
    [echo] Installing...
Uploading to geronimo/jars/geronimo-test-ddbean-1.1-SNAPSHOT.jar: 
.................... (17K)
Uploading to geronimo/poms/geronimo-test-ddbean-1.1-SNAPSHOT.pom: 
.................... (10K)

+----------------------------------------
| geronimo and geronimo-plugins Geronimo :: Transaction
| Memory: 12M/18M
+----------------------------------------
DEPRECATED: the default goal should be specified in the <build> section of project.xml instead of maven.xml

build:end:

build:start:

multiproject:install-callback:
    [echo] Running jar:install for Geronimo :: Transaction
java:prepare-filesystem:

java:compile:
<depend closure="false" srcdir="1.4" dump="false" destdir="/home/continuum/continuum-1.0.2/apps/continuum/work/68/modules/transaction/target/classes"></depend>    [echo] Compiling to /home/continuum/continuum-1.0.2/apps/continuum/work/68/modules/transaction/target/classes

java:jar-resources:

test:prepare-filesystem:

test:test-resources:

test:compile:

test:test:
    [echo] NOTICE: Skipping tests; they seem to have passed already
    [echo] No tests to run.
Running post goal: test:test

jar:jar:

jar:install:
    [echo] Installing...
Uploading to geronimo/jars/geronimo-transaction-1.1-SNAPSHOT.jar: 
.................... (73K)
Uploading to geronimo/poms/geronimo-transaction-1.1-SNAPSHOT.pom: 
.................... (12K)

+----------------------------------------
| geronimo and geronimo-plugins Geronimo :: Connector
| Memory: 13M/18M
+----------------------------------------
DEPRECATED: the default goal should be specified in the <build> section of project.xml instead of maven.xml
DEPRECATED: the default goal should be specified in the <build> section of project.xml instead of maven.xml

build:end:

Attempting to download geronimo-transaction-1.1-SNAPSHOT.jar.
build:start:

multiproject:install-callback:
    [echo] Running jar:install for Geronimo :: Connector
java:prepare-filesystem:

java:compile:
<depend closure="false" srcdir="1.4" dump="false" destdir="/home/continuum/continuum-1.0.2/apps/continuum/work/68/modules/connector/target/classes"></depend>    [echo] Compiling to /home/continuum/continuum-1.0.2/apps/continuum/work/68/modules/connector/target/classes

java:jar-resources:

test:prepare-filesystem:

test:test-resources:

test:compile:

test:test:
    [echo] NOTICE: Skipping tests; they seem to have passed already
    [echo] No tests to run.
Running post goal: test:test

jar:jar:

jar:install:
    [echo] Installing...
Uploading to geronimo/jars/geronimo-connector-1.1-SNAPSHOT.jar: 
.................... (130K)
Uploading to geronimo/poms/geronimo-connector-1.1-SNAPSHOT.pom: 
.................... (13K)

+----------------------------------------
| geronimo and geronimo-plugins Geronimo :: Security :: Builder
| Memory: 15M/18M
+----------------------------------------
DEPRECATED: the default goal should be specified in the <build> section of project.xml instead of maven.xml
DEPRECATED: the default goal should be specified in the <build> section of project.xml instead of maven.xml

build:end:

build:start:

multiproject:install-callback:
    [echo] Running jar:install for Geronimo :: Security :: Builder
java:prepare-filesystem:

java:compile:
<depend closure="false" srcdir="1.4" dump="false" destdir="/home/continuum/continuum-1.0.2/apps/continuum/work/68/modules/security-builder/target/classes"></depend>    [echo] Compiling to /home/continuum/continuum-1.0.2/apps/continuum/work/68/modules/security-builder/target/classes

java:jar-resources:

test:prepare-filesystem:

test:test-resources:
Running post goal: test:test-resources
    [delete] Deleting directory /home/continuum/continuum-1.0.2/apps/continuum/work/68/modules/security-builder/target/database
    [mkdir] Created dir: /home/continuum/continuum-1.0.2/apps/continuum/work/68/modules/security-builder/target/database

test:compile:
    [echo] No test source files to compile.

test:test:
    [echo] NOTICE: Skipping tests; they seem to have passed already
    [echo] No tests to run.
Running post goal: test:test

jar:jar:

jar:install:
    [echo] Installing...
Uploading to geronimo/jars/geronimo-security-builder-1.1-SNAPSHOT.jar: 
.................... (172K)
Uploading to geronimo/poms/geronimo-security-builder-1.1-SNAPSHOT.pom: 
.................... (12K)

+----------------------------------------
| geronimo and geronimo-plugins Geronimo :: J2EE
| Memory: 16M/18M
+----------------------------------------
DEPRECATED: the default goal should be specified in the <build> section of project.xml instead of maven.xml
DEPRECATED: the default goal should be specified in the <build> section of project.xml instead of maven.xml

build:end:

Attempting to download geronimo-security-builder-1.1-SNAPSHOT.jar.
build:start:

multiproject:install-callback:
    [echo] Running jar:install for Geronimo :: J2EE
java:prepare-filesystem:

java:compile:
<depend closure="false" srcdir="1.4" dump="false" destdir="/home/continuum/continuum-1.0.2/apps/continuum/work/68/modules/j2ee-builder/target/classes"></depend>    [echo] Compiling to /home/continuum/continuum-1.0.2/apps/continuum/work/68/modules/j2ee-builder/target/classes

java:jar-resources:

test:prepare-filesystem:

test:test-resources:

test:compile:
setupEar:

setupEar:

setupUnpackedEar:
setupBaseUnpackedEar:

setupBaseUnpackedEar:

setupBaseUnpackedEar:



test:test:
    [echo] NOTICE: Skipping tests; they seem to have passed already
    [echo] No tests to run.
Running post goal: test:test

jar:jar:

jar:install:
    [echo] Installing...
Uploading to geronimo/jars/geronimo-j2ee-builder-1.1-SNAPSHOT.jar: 
.................... (90K)
Uploading to geronimo/poms/geronimo-j2ee-builder-1.1-SNAPSHOT.pom: 
.................... (13K)

+----------------------------------------
| geronimo and geronimo-plugins Geronimo :: Naming :: Builder
| Memory: 11M/19M
+----------------------------------------
DEPRECATED: the default goal should be specified in the <build> section of project.xml instead of maven.xml
DEPRECATED: the default goal should be specified in the <build> section of project.xml instead of maven.xml

build:end:

Attempting to download geronimo-j2ee-builder-1.1-SNAPSHOT.jar.
build:start:

multiproject:install-callback:
    [echo] Running jar:install for Geronimo :: Naming :: Builder
java:prepare-filesystem:

java:compile:
<depend closure="false" srcdir="1.4" dump="false" destdir="/home/continuum/continuum-1.0.2/apps/continuum/work/68/modules/naming-builder/target/classes"></depend>    [echo] Compiling to /home/continuum/continuum-1.0.2/apps/continuum/work/68/modules/naming-builder/target/classes

java:jar-resources:

test:prepare-filesystem:

test:test-resources:

test:compile:

test:test:
    [echo] NOTICE: Skipping tests; they seem to have passed already
    [echo] No tests to run.
Running post goal: test:test

jar:jar:

jar:install:
    [echo] Installing...
Uploading to geronimo/jars/geronimo-naming-builder-1.1-SNAPSHOT.jar: 
.................... (160K)
Uploading to geronimo/poms/geronimo-naming-builder-1.1-SNAPSHOT.pom: 
.................... (13K)

+----------------------------------------
| geronimo and geronimo-plugins Geronimo :: Connector :: Builder
| Memory: 13M/19M
+----------------------------------------
DEPRECATED: the default goal should be specified in the <build> section of project.xml instead of maven.xml
DEPRECATED: the default goal should be specified in the <build> section of project.xml instead of maven.xml

build:end:

Attempting to download geronimo-test-ddbean-1.1-SNAPSHOT.jar.
Attempting to download geronimo-connector-1.1-SNAPSHOT.jar.
Attempting to download geronimo-naming-builder-1.1-SNAPSHOT.jar.
build:start:

multiproject:install-callback:
    [echo] Running jar:install for Geronimo :: Connector :: Builder
java:prepare-filesystem:

java:compile:
<depend closure="false" srcdir="1.4" dump="false" destdir="/home/continuum/continuum-1.0.2/apps/continuum/work/68/modules/connector-builder/target/classes"></depend>    [echo] Compiling to /home/continuum/continuum-1.0.2/apps/continuum/work/68/modules/connector-builder/target/classes

java:jar-resources:

test:prepare-filesystem:

test:test-resources:

test:compile:

test:test:
    [echo] NOTICE: Skipping tests; they seem to have passed already
    [echo] No tests to run.
Running post goal: test:test

jar:jar:

jar:install:
    [echo] Installing...
Uploading to geronimo/jars/geronimo-connector-builder-1.1-SNAPSHOT.jar: 
.................... (202K)
Uploading to geronimo/poms/geronimo-connector-builder-1.1-SNAPSHOT.pom: 
.................... (15K)

+----------------------------------------
| geronimo and geronimo-plugins Geronimo :: Axis :: Builder
| Memory: 14M/19M
+----------------------------------------
DEPRECATED: the default goal should be specified in the <build> section of project.xml instead of maven.xml
DEPRECATED: the default goal should be specified in the <build> section of project.xml instead of maven.xml

build:end:

Attempting to download geronimo-axis-1.1-SNAPSHOT.jar.
Attempting to download geronimo-connector-builder-1.1-SNAPSHOT.jar.
build:start:

multiproject:install-callback:
    [echo] Running jar:install for Geronimo :: Axis :: Builder
java:prepare-filesystem:

java:compile:
<depend closure="false" srcdir="1.4" dump="false" destdir="/home/continuum/continuum-1.0.2/apps/continuum/work/68/modules/axis-builder/target/classes"></depend>    [echo] Compiling to /home/continuum/continuum-1.0.2/apps/continuum/work/68/modules/axis-builder/target/classes

java:jar-resources:

test:prepare-filesystem:

test:test-resources:

test:compile:

test:test:
    [echo] NOTICE: Skipping tests; they seem to have passed already
    [echo] No tests to run.
Running post goal: test:test

jar:jar:

jar:install:
    [echo] Installing...
Uploading to geronimo/jars/geronimo-axis-builder-1.1-SNAPSHOT.jar: 
.................... (218K)
Uploading to geronimo/poms/geronimo-axis-builder-1.1-SNAPSHOT.pom: 
.................... (15K)

+----------------------------------------
| geronimo and geronimo-plugins Geronimo :: Client
| Memory: 17M/19M
+----------------------------------------
DEPRECATED: the default goal should be specified in the <build> section of project.xml instead of maven.xml

build:end:

build:start:

multiproject:install-callback:
    [echo] Running jar:install for Geronimo :: Client
java:prepare-filesystem:

java:compile:
<depend closure="false" srcdir="1.4" dump="false" destdir="/home/continuum/continuum-1.0.2/apps/continuum/work/68/modules/client/target/classes"></depend>    [echo] Compiling to /home/continuum/continuum-1.0.2/apps/continuum/work/68/modules/client/target/classes

java:jar-resources:

test:prepare-filesystem:

test:test-resources:

test:compile:
    [echo] No test source files to compile.

test:test:
    [echo] NOTICE: Skipping tests; they seem to have passed already
    [echo] No tests to run.
Running post goal: test:test

jar:jar:

jar:install:
    [echo] Installing...
Uploading to geronimo/jars/geronimo-client-1.1-SNAPSHOT.jar: 
.................... (14K)
Uploading to geronimo/poms/geronimo-client-1.1-SNAPSHOT.pom: 
.................... (12K)

+----------------------------------------
| geronimo and geronimo-plugins Geronimo :: Client Builder
| Memory: 17M/19M
+----------------------------------------
DEPRECATED: the default goal should be specified in the <build> section of project.xml instead of maven.xml
DEPRECATED: the default goal should be specified in the <build> section of project.xml instead of maven.xml

build:end:

Attempting to download geronimo-client-1.1-SNAPSHOT.jar.
build:start:

multiproject:install-callback:
    [echo] Running jar:install for Geronimo :: Client Builder
java:prepare-filesystem:

java:compile:
<depend closure="false" srcdir="1.4" dump="false" destdir="/home/continuum/continuum-1.0.2/apps/continuum/work/68/modules/client-builder/target/classes"></depend>    [echo] Compiling to /home/continuum/continuum-1.0.2/apps/continuum/work/68/modules/client-builder/target/classes

java:jar-resources:

test:prepare-filesystem:

test:test-resources:

test:compile:

test:test:
    [echo] NOTICE: Skipping tests; they seem to have passed already
    [echo] No tests to run.
Running post goal: test:test

jar:jar:

jar:install:
    [echo] Installing...
Uploading to geronimo/jars/geronimo-client-builder-1.1-SNAPSHOT.jar: 
.................... (46K)
Uploading to geronimo/poms/geronimo-client-builder-1.1-SNAPSHOT.pom: 
.................... (14K)

+----------------------------------------
| geronimo and geronimo-plugins Geronimo :: Console Web
| Memory: 13M/21M
+----------------------------------------
DEPRECATED: the default goal should be specified in the <build> section of project.xml instead of maven.xml
DEPRECATED: the default goal should be specified in the <build> section of project.xml instead of maven.xml

build:end:

build:start:

multiproject:install-callback:
    [echo] Running jar:install for Geronimo :: Console Web
java:prepare-filesystem:

java:compile:
<depend closure="false" srcdir="1.4" dump="false" destdir="/home/continuum/continuum-1.0.2/apps/continuum/work/68/modules/console-web/target/classes"></depend>    [echo] Compiling to /home/continuum/continuum-1.0.2/apps/continuum/work/68/modules/console-web/target/classes

java:jar-resources:

test:prepare-filesystem:

test:test-resources:

test:compile:
    [echo] No test source files to compile.

test:test:
    [echo] NOTICE: Skipping tests; they seem to have passed already
    [echo] No tests to run.
Running post goal: test:test

jar:jar:

jar:install:
    [echo] Installing...
Uploading to geronimo/jars/geronimo-console-web-1.1-SNAPSHOT.jar: 
.................... (17K)
Uploading to geronimo/poms/geronimo-console-web-1.1-SNAPSHOT.pom: 
.................... (11K)

+----------------------------------------
| geronimo and geronimo-plugins Geronimo :: Configuration Converter
| Memory: 13M/21M
+----------------------------------------
DEPRECATED: the default goal should be specified in the <build> section of project.xml instead of maven.xml
DEPRECATED: the default goal should be specified in the <build> section of project.xml instead of maven.xml

build:end:

build:start:

multiproject:install-callback:
    [echo] Running jar:install for Geronimo :: Configuration Converter
java:prepare-filesystem:

java:compile:
<depend closure="false" srcdir="1.4" dump="false" destdir="/home/continuum/continuum-1.0.2/apps/continuum/work/68/modules/converter/target/classes"></depend>    [echo] Compiling to /home/continuum/continuum-1.0.2/apps/continuum/work/68/modules/converter/target/classes

java:jar-resources:

test:prepare-filesystem:

test:test-resources:

test:compile:
    [echo] No test source files to compile.

test:test:
    [echo] NOTICE: Skipping tests; they seem to have passed already
    [echo] No tests to run.
Running post goal: test:test

jar:jar:

jar:install:
    [echo] Installing...
Uploading to geronimo/jars/geronimo-converter-1.1-SNAPSHOT.jar: 
.................... (25K)
Uploading to geronimo/poms/geronimo-converter-1.1-SNAPSHOT.pom: 
.................... (11K)

+----------------------------------------
| geronimo and geronimo-plugins Geronimo :: Web :: Builder
| Memory: 13M/21M
+----------------------------------------
DEPRECATED: the default goal should be specified in the <build> section of project.xml instead of maven.xml
DEPRECATED: the default goal should be specified in the <build> section of project.xml instead of maven.xml

build:end:

build:start:

multiproject:install-callback:
    [echo] Running jar:install for Geronimo :: Web :: Builder
java:prepare-filesystem:

java:compile:
<depend closure="false" srcdir="1.4" dump="false" destdir="/home/continuum/continuum-1.0.2/apps/continuum/work/68/modules/web-builder/target/classes"></depend>    [echo] Compiling to /home/continuum/continuum-1.0.2/apps/continuum/work/68/modules/web-builder/target/classes

java:jar-resources:

test:prepare-filesystem:

test:test-resources:

test:compile:

test:test:
    [echo] NOTICE: Skipping tests; they seem to have passed already
    [echo] No tests to run.
Running post goal: test:test

jar:jar:

jar:install:
    [echo] Installing...
Uploading to geronimo/jars/geronimo-web-builder-1.1-SNAPSHOT.jar: 
.................... (46K)
Uploading to geronimo/poms/geronimo-web-builder-1.1-SNAPSHOT.pom: 
.................... (13K)

+----------------------------------------
| geronimo and geronimo-plugins Geronimo :: Deploy :: JSR-88
| Memory: 15M/21M
+----------------------------------------
DEPRECATED: the default goal should be specified in the <build> section of project.xml instead of maven.xml
DEPRECATED: the default goal should be specified in the <build> section of project.xml instead of maven.xml

build:end:

Attempting to download geronimo-web-builder-1.1-SNAPSHOT.jar.
build:start:

multiproject:install-callback:
    [echo] Running jar:install for Geronimo :: Deploy :: JSR-88
java:prepare-filesystem:

java:compile:
<depend closure="false" srcdir="1.4" dump="false" destdir="/home/continuum/continuum-1.0.2/apps/continuum/work/68/modules/deploy-jsr88/target/classes"></depend>    [echo] Compiling to /home/continuum/continuum-1.0.2/apps/continuum/work/68/modules/deploy-jsr88/target/classes

java:jar-resources:

test:prepare-filesystem:

test:test-resources:

test:compile:

test:test:
    [echo] NOTICE: Skipping tests; they seem to have passed already
    [echo] No tests to run.
Running post goal: test:test

jar:jar:
    [echo] Generating Manifest file for JSR88-Deployer

jar:install:
    [echo] Installing...
Uploading to geronimo/jars/geronimo-deploy-jsr88-1.1-SNAPSHOT.jar: 
.................... (64K)
Uploading to geronimo/poms/geronimo-deploy-jsr88-1.1-SNAPSHOT.pom: 
.................... (13K)

+----------------------------------------
| geronimo and geronimo-plugins Geronimo :: Deploy :: CLI Tool
| Memory: 17M/21M
+----------------------------------------
DEPRECATED: the default goal should be specified in the <build> section of project.xml instead of maven.xml
DEPRECATED: the default goal should be specified in the <build> section of project.xml instead of maven.xml

build:end:

Attempting to download geronimo-deploy-jsr88-1.1-SNAPSHOT.jar.
build:start:

multiproject:install-callback:
    [echo] Running jar:install for Geronimo :: Deploy :: CLI Tool
java:prepare-filesystem:

java:compile:
<depend closure="false" srcdir="1.4" dump="false" destdir="/home/continuum/continuum-1.0.2/apps/continuum/work/68/modules/deploy-tool/target/classes"></depend>    [echo] Compiling to /home/continuum/continuum-1.0.2/apps/continuum/work/68/modules/deploy-tool/target/classes

java:jar-resources:

test:prepare-filesystem:

test:test-resources:

test:compile:

test:test:
    [echo] NOTICE: Skipping tests; they seem to have passed already
    [echo] No tests to run.
Running post goal: test:test

jar:jar:

jar:install:
    [echo] Installing...
Uploading to geronimo/jars/geronimo-deploy-tool-1.1-SNAPSHOT.jar: 
.................... (56K)
Uploading to geronimo/poms/geronimo-deploy-tool-1.1-SNAPSHOT.pom: 
.................... (12K)

+----------------------------------------
| geronimo and geronimo-plugins Geronimo :: Derby
| Memory: 19M/21M
+----------------------------------------
DEPRECATED: the default goal should be specified in the <build> section of project.xml instead of maven.xml

build:end:

build:start:

multiproject:install-callback:
    [echo] Running jar:install for Geronimo :: Derby
java:prepare-filesystem:

java:compile:
<depend closure="false" srcdir="1.4" dump="false" destdir="/home/continuum/continuum-1.0.2/apps/continuum/work/68/modules/derby/target/classes"></depend>    [echo] Compiling to /home/continuum/continuum-1.0.2/apps/continuum/work/68/modules/derby/target/classes

java:jar-resources:

test:prepare-filesystem:

test:test-resources:

test:compile:

test:test:
    [echo] NOTICE: Skipping tests; they seem to have passed already
    [echo] No tests to run.
Running post goal: test:test

jar:jar:

jar:install:
    [echo] Installing...
Uploading to geronimo/jars/geronimo-derby-1.1-SNAPSHOT.jar: 
.................... (12K)
Uploading to geronimo/poms/geronimo-derby-1.1-SNAPSHOT.pom: 
.................... (11K)

+----------------------------------------
| geronimo and geronimo-plugins Geronimo :: Directory
| Memory: 20M/21M
+----------------------------------------
DEPRECATED: the default goal should be specified in the <build> section of project.xml instead of maven.xml
DEPRECATED: the default goal should be specified in the <build> section of project.xml instead of maven.xml

build:end:

build:start:

multiproject:install-callback:
    [echo] Running jar:install for Geronimo :: Directory
java:prepare-filesystem:

java:compile:
<depend closure="false" srcdir="1.4" dump="false" destdir="/home/continuum/continuum-1.0.2/apps/continuum/work/68/modules/directory/target/classes"></depend>    [echo] Compiling to /home/continuum/continuum-1.0.2/apps/continuum/work/68/modules/directory/target/classes
Running post goal: java:compile
geronimo:dependency:


java:jar-resources:
Copying 1 file to /home/continuum/continuum-1.0.2/apps/continuum/work/68/modules/directory/target/classes

test:prepare-filesystem:

test:test-resources:

test:compile:

test:test:
    [echo] NOTICE: Skipping tests; they seem to have passed already
    [echo] No tests to run.
Running post goal: test:test

jar:jar:
    [jar] Building jar: /home/continuum/continuum-1.0.2/apps/continuum/work/68/modules/directory/target/geronimo-directory-1.1-SNAPSHOT.jar

jar:install:
    [echo] Installing...
Uploading to geronimo/jars/geronimo-directory-1.1-SNAPSHOT.jar: 
.................... (114K)
Uploading to geronimo/poms/geronimo-directory-1.1-SNAPSHOT.pom: 
.................... (16K)

+----------------------------------------
| geronimo and geronimo-plugins Geronimo :: Deploy :: Hot Deployer
| Memory: 14M/25M
+----------------------------------------
DEPRECATED: the default goal should be specified in the <build> section of project.xml instead of maven.xml
DEPRECATED: the default goal should be specified in the <build> section of project.xml instead of maven.xml

build:end:

Attempting to download geronimo-deploy-tool-1.1-SNAPSHOT.jar.
build:start:

multiproject:install-callback:
    [echo] Running jar:install for Geronimo :: Deploy :: Hot Deployer
java:prepare-filesystem:

java:compile:
<depend closure="false" srcdir="1.4" dump="false" destdir="/home/continuum/continuum-1.0.2/apps/continuum/work/68/modules/hot-deploy/target/classes"></depend>    [echo] Compiling to /home/continuum/continuum-1.0.2/apps/continuum/work/68/modules/hot-deploy/target/classes

java:jar-resources:

test:prepare-filesystem:

test:test-resources:

test:compile:
    [echo] No test source files to compile.

test:test:
    [echo] NOTICE: Skipping tests; they seem to have passed already
    [echo] No tests to run.
Running post goal: test:test

jar:jar:

jar:install:
    [echo] Installing...
Uploading to geronimo/jars/geronimo-hot-deploy-1.1-SNAPSHOT.jar: 
.................... (19K)
Uploading to geronimo/poms/geronimo-hot-deploy-1.1-SNAPSHOT.pom: 
.................... (12K)

+----------------------------------------
| geronimo and geronimo-plugins Geronimo :: Installer Processing
| Memory: 14M/25M
+----------------------------------------
DEPRECATED: the default goal should be specified in the <build> section of project.xml instead of maven.xml
DEPRECATED: the default goal should be specified in the <build> section of project.xml instead of maven.xml

build:end:

build:start:

multiproject:install-callback:
    [echo] Running jar:install for Geronimo :: Installer Processing
java:prepare-filesystem:

java:compile:
<depend closure="false" srcdir="1.4" dump="false" destdir="/home/continuum/continuum-1.0.2/apps/continuum/work/68/modules/installer-processing/target/classes"></depend>    [echo] Compiling to /home/continuum/continuum-1.0.2/apps/continuum/work/68/modules/installer-processing/target/classes
Running post goal: java:compile
geronimo:dependency:

    [echo] Maven local repo is: /home/continuum/.geronimo-1.1-maven/repository
    [echo] Maven build dir is: /home/continuum/continuum-1.0.2/apps/continuum/work/68/modules/installer-processing/target

java:jar-resources:

test:prepare-filesystem:

test:test-resources:

test:compile:
    [echo] No test source files to compile.

test:test:
    [echo] NOTICE: Skipping tests; they seem to have passed already
    [echo] No tests to run.
Running post goal: test:test

jar:jar:

jar:install:
    [echo] Installing...
Uploading to geronimo/jars/geronimo-installer-processing-1.1-SNAPSHOT.jar: 
.................... (15K)
Uploading to geronimo/poms/geronimo-installer-processing-1.1-SNAPSHOT.pom: 
.................... (10K)

+----------------------------------------
| geronimo and geronimo-plugins Geronimo :: Installer Support
| Memory: 15M/25M
+----------------------------------------
DEPRECATED: the default goal should be specified in the <build> section of project.xml instead of maven.xml
DEPRECATED: the default goal should be specified in the <build> section of project.xml instead of maven.xml

build:end:

build:start:

multiproject:install-callback:
    [echo] Running jar:install for Geronimo :: Installer Support
java:prepare-filesystem:

java:compile:
<depend closure="false" srcdir="1.4" dump="false" destdir="/home/continuum/continuum-1.0.2/apps/continuum/work/68/modules/installer-support/target/classes"></depend>    [echo] Compiling to /home/continuum/continuum-1.0.2/apps/continuum/work/68/modules/installer-support/target/classes
Running post goal: java:compile
geronimo:dependency:

    [echo] Maven local repo is: /home/continuum/.geronimo-1.1-maven/repository
    [echo] Maven build dir is: /home/continuum/continuum-1.0.2/apps/continuum/work/68/modules/installer-support/target
    [unjar] Expanding: /home/continuum/continuum-1.0.2/apps/continuum/work/68/modules/installer-support/target/standalone-compiler-custom-3.8.0.jar into /home/continuum/continuum-1.0.2/apps/continuum/work/68/modules/installer-support/target/tmp
    [echo] Built Geronimo custom IzPack installer jar
    [echo] Copying standalone-compiler-custom-3.8.0 to local repo

java:jar-resources:

test:prepare-filesystem:

test:test-resources:

test:compile:
    [echo] No test source files to compile.

test:test:
    [echo] NOTICE: Skipping tests; they seem to have passed already
    [echo] No tests to run.
Running post goal: test:test

jar:jar:

jar:install:
    [echo] Installing...
Uploading to geronimo/jars/geronimo-installer-support-1.1-SNAPSHOT.jar: 
.................... (50K)
Uploading to geronimo/poms/geronimo-installer-support-1.1-SNAPSHOT.pom: 
.................... (10K)

+----------------------------------------
| geronimo and geronimo-plugins Geronimo :: JavaMail Transport
| Memory: 17M/25M
+----------------------------------------
DEPRECATED: the default goal should be specified in the <build> section of project.xml instead of maven.xml

build:end:

build:start:

multiproject:install-callback:
    [echo] Running jar:install for Geronimo :: JavaMail Transport
java:prepare-filesystem:

java:compile:
<depend closure="false" srcdir="1.4" dump="false" destdir="/home/continuum/continuum-1.0.2/apps/continuum/work/68/modules/javamail-transport/target/classes"></depend>    [echo] Compiling to /home/continuum/continuum-1.0.2/apps/continuum/work/68/modules/javamail-transport/target/classes

java:jar-resources:

test:prepare-filesystem:

test:test-resources:

test:compile:
    [echo] No test source files to compile.

test:test:
    [echo] NOTICE: Skipping tests; they seem to have passed already
    [echo] No tests to run.
Running post goal: test:test

jar:jar:

jar:install:
    [echo] Installing...
Uploading to geronimo/jars/geronimo-javamail-transport-1.1-SNAPSHOT.jar: 
.................... (13K)
Uploading to geronimo/poms/geronimo-javamail-transport-1.1-SNAPSHOT.pom: 
.................... (10K)

+----------------------------------------
| geronimo and geronimo-plugins Geronimo :: Jetty
| Memory: 17M/25M
+----------------------------------------
DEPRECATED: the default goal should be specified in the <build> section of project.xml instead of maven.xml
DEPRECATED: the default goal should be specified in the <build> section of project.xml instead of maven.xml

build:end:

build:start:

multiproject:install-callback:
    [echo] Running jar:install for Geronimo :: Jetty
java:prepare-filesystem:

java:compile:
<depend closure="false" srcdir="1.4" dump="false" destdir="/home/continuum/continuum-1.0.2/apps/continuum/work/68/modules/jetty/target/classes"></depend>    [echo] Compiling to /home/continuum/continuum-1.0.2/apps/continuum/work/68/modules/jetty/target/classes
Running post goal: java:compile
geronimo:dependency:


java:jar-resources:
Copying 1 file to /home/continuum/continuum-1.0.2/apps/continuum/work/68/modules/jetty/target/classes

test:prepare-filesystem:

test:test-resources:

test:compile:

test:test:
    [echo] NOTICE: Skipping tests; they seem to have passed already
    [echo] No tests to run.
Running post goal: test:test

jar:jar:
    [jar] Building jar: /home/continuum/continuum-1.0.2/apps/continuum/work/68/modules/jetty/target/geronimo-jetty-1.1-SNAPSHOT.jar

jar:install:
    [echo] Installing...
Uploading to geronimo/jars/geronimo-jetty-1.1-SNAPSHOT.jar: 
.................... (81K)
Uploading to geronimo/poms/geronimo-jetty-1.1-SNAPSHOT.pom: 
.................... (16K)

+----------------------------------------
| geronimo and geronimo-plugins Geronimo :: Jetty :: Builder
| Memory: 18M/25M
+----------------------------------------
DEPRECATED: the default goal should be specified in the <build> section of project.xml instead of maven.xml
DEPRECATED: the default goal should be specified in the <build> section of project.xml instead of maven.xml

build:end:

Attempting to download geronimo-jetty-1.1-SNAPSHOT.jar.
build:start:

multiproject:install-callback:
    [echo] Running jar:install for Geronimo :: Jetty :: Builder
java:prepare-filesystem:

java:compile:
<depend closure="false" srcdir="1.4" dump="false" destdir="/home/continuum/continuum-1.0.2/apps/continuum/work/68/modules/jetty-builder/target/classes"></depend>    [echo] Compiling to /home/continuum/continuum-1.0.2/apps/continuum/work/68/modules/jetty-builder/target/classes

java:jar-resources:

test:prepare-filesystem:

test:test-resources:

test:compile:

test:test:
    [echo] NOTICE: Skipping tests; they seem to have passed already
    [echo] No tests to run.
Running post goal: test:test

jar:jar:

jar:install:
    [echo] Installing...
Uploading to geronimo/jars/geronimo-jetty-builder-1.1-SNAPSHOT.jar: 
.................... (64K)
Uploading to geronimo/poms/geronimo-jetty-builder-1.1-SNAPSHOT.pom: 
.................... (18K)

+----------------------------------------
| geronimo and geronimo-plugins Geronimo :: JMX Remoting
| Memory: 22M/25M
+----------------------------------------
DEPRECATED: the default goal should be specified in the <build> section of project.xml instead of maven.xml

build:end:

build:start:

multiproject:install-callback:
    [echo] Running jar:install for Geronimo :: JMX Remoting
java:prepare-filesystem:

java:compile:
<depend closure="false" srcdir="1.4" dump="false" destdir="/home/continuum/continuum-1.0.2/apps/continuum/work/68/modules/jmx-remoting/target/classes"></depend>    [echo] Compiling to /home/continuum/continuum-1.0.2/apps/continuum/work/68/modules/jmx-remoting/target/classes

java:jar-resources:

test:prepare-filesystem:

test:test-resources:

test:compile:

test:test:
    [echo] NOTICE: Skipping tests; they seem to have passed already
    [echo] No tests to run.
Running post goal: test:test

jar:jar:

jar:install:
    [echo] Installing...
Uploading to geronimo/jars/geronimo-jmxremoting-1.1-SNAPSHOT.jar: 
.................... (10K)
Uploading to geronimo/poms/geronimo-jmxremoting-1.1-SNAPSHOT.pom: 
.................... (11K)

+----------------------------------------
| geronimo and geronimo-plugins Geronimo :: Mail
| Memory: 21M/25M
+----------------------------------------
DEPRECATED: the default goal should be specified in the <build> section of project.xml instead of maven.xml

build:end:

build:start:

multiproject:install-callback:
    [echo] Running jar:install for Geronimo :: Mail
java:prepare-filesystem:

java:compile:
<depend closure="false" srcdir="1.4" dump="false" destdir="/home/continuum/continuum-1.0.2/apps/continuum/work/68/modules/mail/target/classes"></depend>    [echo] Compiling to /home/continuum/continuum-1.0.2/apps/continuum/work/68/modules/mail/target/classes

java:jar-resources:

test:prepare-filesystem:

test:test-resources:

test:compile:

test:test:
    [echo] NOTICE: Skipping tests; they seem to have passed already
    [echo] No tests to run.
Running post goal: test:test

jar:jar:

jar:install:
    [echo] Installing...
Uploading to geronimo/jars/geronimo-mail-1.1-SNAPSHOT.jar: 
.................... (21K)
Uploading to geronimo/poms/geronimo-mail-1.1-SNAPSHOT.pom: 
.................... (11K)

+----------------------------------------
| geronimo and geronimo-plugins Geronimo :: Scripts
| Memory: 22M/25M
+----------------------------------------
DEPRECATED: the default goal should be specified in the <build> section of project.xml instead of maven.xml

build:end:

build:start:

multiproject:install-callback:
    [echo] Running jar:install for Geronimo :: Scripts
java:prepare-filesystem:

java:compile:
    [echo] Compiling to /home/continuum/continuum-1.0.2/apps/continuum/work/68/modules/scripts/target/classes
    [echo] No java source files to compile.

java:jar-resources:

test:prepare-filesystem:

test:test-resources:

test:compile:
    [echo] No test source files to compile.

test:test:
    [echo] NOTICE: Skipping tests; they seem to have passed already
    [echo] No tests to run.
Running post goal: test:test

jar:jar:

jar:install:
    [echo] Installing...
Uploading to geronimo/jars/geronimo-scripts-1.1-SNAPSHOT.jar: 
.................... (3214K)
Uploading to geronimo/poms/geronimo-scripts-1.1-SNAPSHOT.pom: 
.................... (10K)

+----------------------------------------
| geronimo and geronimo-plugins Geronimo :: Timer
| Memory: 22M/25M
+----------------------------------------
DEPRECATED: the default goal should be specified in the <build> section of project.xml instead of maven.xml

build:end:

build:start:

multiproject:install-callback:
    [echo] Running jar:install for Geronimo :: Timer
java:prepare-filesystem:

java:compile:
<depend closure="false" srcdir="1.4" dump="false" destdir="/home/continuum/continuum-1.0.2/apps/continuum/work/68/modules/timer/target/classes"></depend>    [echo] Compiling to /home/continuum/continuum-1.0.2/apps/continuum/work/68/modules/timer/target/classes

java:jar-resources:

test:prepare-filesystem:

test:test-resources:

test:compile:

test:test:
    [echo] NOTICE: Skipping tests; they seem to have passed already
    [echo] No tests to run.
Running post goal: test:test

jar:jar:

jar:install:
    [echo] Installing...
Uploading to geronimo/jars/geronimo-timer-1.1-SNAPSHOT.jar: 
.................... (38K)
Uploading to geronimo/poms/geronimo-timer-1.1-SNAPSHOT.pom: 
.................... (12K)

+----------------------------------------
| geronimo and geronimo-plugins Geronimo :: Tomcat
| Memory: 23M/25M
+----------------------------------------
DEPRECATED: the default goal should be specified in the <build> section of project.xml instead of maven.xml
DEPRECATED: the default goal should be specified in the <build> section of project.xml instead of maven.xml

build:end:

build:start:

multiproject:install-callback:
    [echo] Running jar:install for Geronimo :: Tomcat
java:prepare-filesystem:

java:compile:
<depend closure="false" srcdir="1.4" dump="false" destdir="/home/continuum/continuum-1.0.2/apps/continuum/work/68/modules/tomcat/target/classes"></depend>    [echo] Compiling to /home/continuum/continuum-1.0.2/apps/continuum/work/68/modules/tomcat/target/classes
Running post goal: java:compile
geronimo:dependency:


java:jar-resources:
Copying 1 file to /home/continuum/continuum-1.0.2/apps/continuum/work/68/modules/tomcat/target/classes

test:prepare-filesystem:

test:test-resources:

test:compile:

test:test:
    [echo] NOTICE: Skipping tests; they seem to have passed already
    [echo] No tests to run.
Running post goal: test:test

jar:jar:
    [jar] Building jar: /home/continuum/continuum-1.0.2/apps/continuum/work/68/modules/tomcat/target/geronimo-tomcat-1.1-SNAPSHOT.jar

jar:install:
    [echo] Installing...
Uploading to geronimo/jars/geronimo-tomcat-1.1-SNAPSHOT.jar: 
.................... (130K)
Uploading to geronimo/poms/geronimo-tomcat-1.1-SNAPSHOT.pom: 
.................... (21K)

+----------------------------------------
| geronimo and geronimo-plugins Geronimo :: Tomcat :: Builder
| Memory: 16M/26M
+----------------------------------------
DEPRECATED: the default goal should be specified in the <build> section of project.xml instead of maven.xml
DEPRECATED: the default goal should be specified in the <build> section of project.xml instead of maven.xml

build:end:

Attempting to download geronimo-tomcat-1.1-SNAPSHOT.jar.
Attempting to download geronimo-axis-builder-1.1-SNAPSHOT.jar.
build:start:

multiproject:install-callback:
    [echo] Running jar:install for Geronimo :: Tomcat :: Builder
java:prepare-filesystem:

java:compile:
<depend closure="false" srcdir="1.4" dump="false" destdir="/home/continuum/continuum-1.0.2/apps/continuum/work/68/modules/tomcat-builder/target/classes"></depend>    [echo] Compiling to /home/continuum/continuum-1.0.2/apps/continuum/work/68/modules/tomcat-builder/target/classes

java:jar-resources:

test:prepare-filesystem:

test:test-resources:

test:compile:

test:test:
    [echo] NOTICE: Skipping tests; they seem to have passed already
    [echo] No tests to run.
Running post goal: test:test

jar:jar:

jar:install:
    [echo] Installing...
Uploading to geronimo/jars/geronimo-tomcat-builder-1.1-SNAPSHOT.jar: 
.................... (65K)
Uploading to geronimo/poms/geronimo-tomcat-builder-1.1-SNAPSHOT.pom: 
.................... (20K)

+----------------------------------------
| geronimo and geronimo-plugins Geronimo :: Upgrade
| Memory: 18M/26M
+----------------------------------------
DEPRECATED: the default goal should be specified in the <build> section of project.xml instead of maven.xml

build:end:

Attempting to download geronimo-client-builder-1.1-SNAPSHOT.jar.
Attempting to download geronimo-jetty-builder-1.1-SNAPSHOT.jar.
Attempting to download geronimo-tomcat-builder-1.1-SNAPSHOT.jar.
Attempting to download openejb-builder-2.1-SNAPSHOT.jar.
build:start:

multiproject:install-callback:
    [echo] Running jar:install for Geronimo :: Upgrade
java:prepare-filesystem:

java:compile:
<depend closure="false" srcdir="1.4" dump="false" destdir="/home/continuum/continuum-1.0.2/apps/continuum/work/68/modules/upgrade/target/classes"></depend>    [echo] Compiling to /home/continuum/continuum-1.0.2/apps/continuum/work/68/modules/upgrade/target/classes

java:jar-resources:

test:prepare-filesystem:

test:test-resources:

test:compile:

test:test:
    [echo] NOTICE: Skipping tests; they seem to have passed already
    [echo] No tests to run.
Running post goal: test:test

jar:jar:

jar:install:
    [echo] Installing...
Uploading to geronimo/jars/geronimo-upgrade-1.1-SNAPSHOT.jar: 
.................... (9K)
Uploading to geronimo/poms/geronimo-upgrade-1.1-SNAPSHOT.pom: 
.................... (11K)

+----------------------------------------
| geronimo and geronimo-plugins Geronimo :: Maven Assembly Plugin
| Memory: 18M/26M
+----------------------------------------
DEPRECATED: the default goal should be specified in the <build> section of project.xml instead of maven.xml

build:end:

build:start:

multiproject:install-callback:
    [echo] Running plugin:repository-install for Geronimo :: Maven Assembly Plugin
plugin:plugin:
java:prepare-filesystem:

java:compile:
    [echo] Compiling to /home/continuum/continuum-1.0.2/apps/continuum/work/68/plugins/geronimo-assembly-plugin/target/classes

java:jar-resources:

test:prepare-filesystem:

test:test-resources:

test:compile:
    [echo] No test source files to compile.

test:test:
    [echo] No tests to run.

jar:jar:


plugin:repository-install:
    [echo] Installing...
Uploading to geronimo/plugins/geronimo-assembly-plugin-1.1.0-10.jar: 
.................... (17K)
Uploading to geronimo/poms/geronimo-assembly-plugin-1.1.0-10.pom: 
.................... (1K)

+----------------------------------------
| geronimo and geronimo-plugins Geronimo :: Maven Deployment Plugin
| Memory: 19M/26M
+----------------------------------------
DEPRECATED: the default goal should be specified in the <build> section of project.xml instead of maven.xml

build:end:

build:start:

multiproject:install-callback:
    [echo] Running plugin:repository-install for Geronimo :: Maven Deployment Plugin
plugin:plugin:
java:prepare-filesystem:

java:compile:
    [echo] Compiling to /home/continuum/continuum-1.0.2/apps/continuum/work/68/plugins/geronimo-deployment-plugin/target/classes

java:jar-resources:

test:prepare-filesystem:

test:test-resources:

test:compile:
    [echo] No test source files to compile.

test:test:
    [echo] No tests to run.

jar:jar:


plugin:repository-install:
    [echo] Installing...
Uploading to geronimo/plugins/geronimo-deployment-plugin-1.1.0-2.jar: 
.................... (33K)
Uploading to geronimo/poms/geronimo-deployment-plugin-1.1.0-2.pom: 
.................... (3K)

+----------------------------------------
| geronimo and geronimo-plugins Geronimo :: IZPack Installer Build Plugin
| Memory: 19M/26M
+----------------------------------------
DEPRECATED: the default goal should be specified in the <build> section of project.xml instead of maven.xml

build:end:

build:start:

multiproject:install-callback:
    [echo] Running plugin:repository-install for Geronimo :: IZPack Installer Build Plugin
plugin:plugin:
java:prepare-filesystem:

java:compile:
    [echo] Compiling to /home/continuum/continuum-1.0.2/apps/continuum/work/68/plugins/geronimo-izpack-plugin/target/classes
    [echo] No java source files to compile.

java:jar-resources:

test:prepare-filesystem:

test:test-resources:

test:compile:
    [echo] No test source files to compile.

test:test:
    [echo] No tests to run.

jar:jar:


plugin:repository-install:
    [echo] Installing...
Uploading to geronimo/plugins/geronimo-izpack-plugin-1.1-SNAPSHOT.jar: 
.................... (7K)
Uploading to geronimo/poms/geronimo-izpack-plugin-1.1-SNAPSHOT.pom: 
.................... (1K)

+----------------------------------------
| geronimo and geronimo-plugins Geronimo :: Maven Packaging Plugin
| Memory: 19M/26M
+----------------------------------------
DEPRECATED: the default goal should be specified in the <build> section of project.xml instead of maven.xml

build:end:

build:start:

multiproject:install-callback:
    [echo] Running plugin:repository-install for Geronimo :: Maven Packaging Plugin
plugin:plugin:
java:prepare-filesystem:

java:compile:
    [echo] Compiling to /home/continuum/continuum-1.0.2/apps/continuum/work/68/plugins/geronimo-packaging-plugin/target/classes

java:jar-resources:

test:prepare-filesystem:

test:test-resources:

test:compile:

test:test:
    [junit] Running org.apache.geronimo.plugin.packaging.PlanProcessorTest
    [junit] Tests run: 1, Failures: 0, Errors: 0, Time elapsed: 1.479 sec

jar:jar:


plugin:repository-install:
    [echo] Installing...
Uploading to geronimo/plugins/geronimo-packaging-plugin-1.1.0-5.jar: 
.................... (32K)
Uploading to geronimo/poms/geronimo-packaging-plugin-1.1.0-5.pom: 
.................... (4K)


build:end:


Starting the reactor...
Our processing order:
OpenEJB :: Core
OpenEJB :: PK Generation :: Builder
OpenEJB :: Builder
+----------------------------------------
| openejb OpenEJB :: Core
| Memory: 15M/26M
+----------------------------------------
DEPRECATED: the default goal should be specified in the <build> section of project.xml instead of maven.xml
DEPRECATED: the default goal should be specified in the <build> section of project.xml instead of maven.xml
new2:
Attempting to download geronimo-timer-1.1-SNAPSHOT.jar.
build:start:

multiproject:install-callback:
    [echo] Running jar:install for OpenEJB :: Core
java:prepare-filesystem:

java:compile:
<depend closure="false" srcdir="1.4" dump="false" destdir="/home/continuum/continuum-1.0.2/apps/continuum/work/68/openejb/modules/core/target/classes"></depend>    [echo] Compiling to /home/continuum/continuum-1.0.2/apps/continuum/work/68/openejb/modules/core/target/classes
Running post goal: java:compile
geronimo:dependency:


java:jar-resources:

test:prepare-filesystem:

test:test-resources:

test:compile:

test:test:
    [echo] NOTICE: Skipping tests; they seem to have passed already
    [echo] No tests to run.
Running post goal: test:test

jar:jar:

jar:install:
    [echo] Installing...
Uploading to openejb/jars/openejb-core-2.1-SNAPSHOT.jar: 
.................... (1186K)
Uploading to openejb/poms/openejb-core-2.1-SNAPSHOT.pom: 
.................... (13K)

+----------------------------------------
| openejb OpenEJB :: PK Generation :: Builder
| Memory: 19M/26M
+----------------------------------------
DEPRECATED: the default goal should be specified in the <build> section of project.xml instead of maven.xml
DEPRECATED: the default goal should be specified in the <build> section of project.xml instead of maven.xml

build:end:

Attempting to download openejb-core-2.1-SNAPSHOT.jar.
build:start:

multiproject:install-callback:
    [echo] Running jar:install for OpenEJB :: PK Generation :: Builder
java:prepare-filesystem:

java:compile:
<depend closure="false" srcdir="1.4" dump="false" destdir="/home/continuum/continuum-1.0.2/apps/continuum/work/68/openejb/modules/pkgen-builder/target/classes"></depend>    [echo] Compiling to /home/continuum/continuum-1.0.2/apps/continuum/work/68/openejb/modules/pkgen-builder/target/classes

java:jar-resources:

test:prepare-filesystem:

test:test-resources:

test:compile:
    [echo] No test source files to compile.

test:test:
    [echo] NOTICE: Skipping tests; they seem to have passed already
    [echo] No tests to run.
Running post goal: test:test

jar:jar:

jar:install:
    [echo] Installing...
Uploading to openejb/jars/openejb-pkgen-builder-2.1-SNAPSHOT.jar: 
.................... (52K)
Uploading to openejb/poms/openejb-pkgen-builder-2.1-SNAPSHOT.pom: 
.................... (6K)

+----------------------------------------
| openejb OpenEJB :: Builder
| Memory: 18M/26M
+----------------------------------------
DEPRECATED: the default goal should be specified in the <build> section of project.xml instead of maven.xml
DEPRECATED: the default goal should be specified in the <build> section of project.xml instead of maven.xml

build:end:

Attempting to download openejb-pkgen-builder-2.1-SNAPSHOT.jar.
build:start:

multiproject:install-callback:
    [echo] Running jar:install for OpenEJB :: Builder
java:prepare-filesystem:

java:compile:
<depend closure="false" srcdir="1.4" dump="false" destdir="/home/continuum/continuum-1.0.2/apps/continuum/work/68/openejb/modules/openejb-builder/target/classes"></depend>    [echo] Compiling to /home/continuum/continuum-1.0.2/apps/continuum/work/68/openejb/modules/openejb-builder/target/classes

java:jar-resources:

test:prepare-filesystem:

test:test-resources:

test:compile:

test:test:
    [echo] NOTICE: Skipping tests; they seem to have passed already
    [echo] No tests to run.
Running post goal: test:test

jar:jar:

jar:install:
    [echo] Installing...
Uploading to openejb/jars/openejb-builder-2.1-SNAPSHOT.jar: 
.................... (605K)
Uploading to openejb/poms/openejb-builder-2.1-SNAPSHOT.pom: 
.................... (15K)


build:end:


Starting the reactor...
Our processing order:
Geronimo :: Console :: Common Code
Geronimo :: Console :: Portal Framework
Geronimo :: Console :: Standard Portlets
Geronimo :: Console :: Application EAR
DayTrader :: Core
DayTrader :: Derby Database
DayTrader :: WS Application Client
DayTrader :: EJBs
DayTrader :: Web Application
DayTrader :: Quote Streamer
DayTrader :: Enterprise Application
Geronimo :: Demo Webapp
Geronimo :: JMX Debug Webapp
Geronimo :: LDAP Demo Application
Geronimo :: The Magic G Ball Sample Application
Geronimo :: Remote Deploy GBean
Geronimo :: Remote Deploy Application
Geronimo :: UDDI-Server database
Geronimo :: UDDI-Server
Geronimo :: Welcome Application
+----------------------------------------
| applications Geronimo :: Console :: Common Code
| Memory: 23M/26M
+----------------------------------------
DEPRECATED: the default goal should be specified in the <build> section of project.xml instead of maven.xml
DEPRECATED: the default goal should be specified in the <build> section of project.xml instead of maven.xml
new3:
build:start:

multiproject:install-callback:
    [echo] Running jar:install for Geronimo :: Console :: Common Code
java:prepare-filesystem:

java:compile:
<depend closure="false" srcdir="1.4" dump="false" destdir="/home/continuum/continuum-1.0.2/apps/continuum/work/68/applications/console-core/target/classes"></depend>    [echo] Compiling to /home/continuum/continuum-1.0.2/apps/continuum/work/68/applications/console-core/target/classes
Running post goal: java:compile

java:jar-resources:

test:prepare-filesystem:

test:test-resources:

test:compile:
    [echo] No test source files to compile.

test:test:
    [echo] NOTICE: Skipping tests; they seem to have passed already
    [echo] No tests to run.
Running post goal: test:test

jar:jar:
    [jar] Building jar: /home/continuum/continuum-1.0.2/apps/continuum/work/68/applications/console-core/target/geronimo-console-core-1.1-SNAPSHOT.jar

jar:install:
    [echo] Installing...
Uploading to geronimo/jars/geronimo-console-core-1.1-SNAPSHOT.jar: 
.................... (40K)
Uploading to geronimo/poms/geronimo-console-core-1.1-SNAPSHOT.pom: 
.................... (13K)

+----------------------------------------
| applications Geronimo :: Console :: Portal Framework
| Memory: 23M/26M
+----------------------------------------
DEPRECATED: the default goal should be specified in the <build> section of project.xml instead of maven.xml
DEPRECATED: the default goal should be specified in the <build> section of project.xml instead of maven.xml

build:end:

Attempting to download geronimo-j2ee_1.4_spec-1.1-SNAPSHOT.jar.
build:start:

multiproject:install-callback:
    [echo] Running war:install for Geronimo :: Console :: Portal Framework
Tag library requested that is not present: 'caller' in plugin: 'maven-war-plugin-1.6.1'
war:init:

war:war-resources:
    [copy] Copying 1 file to /home/continuum/continuum-1.0.2/apps/continuum/work/68/applications/console-framework/target/geronimo-console-framework
    [copy] Copying 1 file to /home/continuum/continuum-1.0.2/apps/continuum/work/68/applications/console-framework/target/geronimo-console-framework/WEB-INF

java:prepare-filesystem:

java:compile:
<depend closure="false" srcdir="1.4" dump="false" destdir="/home/continuum/continuum-1.0.2/apps/continuum/work/68/applications/console-framework/target/classes"></depend>    [echo] Compiling to /home/continuum/continuum-1.0.2/apps/continuum/work/68/applications/console-framework/target/classes

java:jar-resources:

test:prepare-filesystem:

test:test-resources:

test:compile:
    [echo] No test source files to compile.

test:test:
    [echo] NOTICE: Skipping tests; they seem to have passed already
    [echo] No tests to run.
Running post goal: test:test

war:webapp:
    [echo] Assembling webapp geronimo-console-framework
    [copy] Copying 1 file to /home/continuum/continuum-1.0.2/apps/continuum/work/68/applications/console-framework/target/geronimo-console-framework/WEB-INF/classes
Running post goal: war:webapp
preCompile:
    [echo] Pre-compiling JSPs from /home/continuum/continuum-1.0.2/apps/continuum/work/68/applications/console-framework/src/webapp to /home/continuum/continuum-1.0.2/apps/continuum/work/68/applications/console-framework/target/geronimo-console-framework/WEB-INF/work.
    [echo] Compiling generated Java files in /home/continuum/continuum-1.0.2/apps/continuum/work/68/applications/console-framework/target/geronimo-console-framework/WEB-INF/work.
    [javac] Compiling 15 source files to /home/continuum/continuum-1.0.2/apps/continuum/work/68/applications/console-framework/target/geronimo-console-framework/WEB-INF/work

Running post goal: war:webapp
    [echo] Use classes.jar ? true
    [move] Moving 17 files to /home/continuum/continuum-1.0.2/apps/continuum/work/68/applications/console-framework/target/temp
    [jar] Building jar: /home/continuum/continuum-1.0.2/apps/continuum/work/68/applications/console-framework/target/geronimo-console-framework/WEB-INF/lib/classes.jar
    [delete] Deleted 5 directories from /home/continuum/continuum-1.0.2/apps/continuum/work/68/applications/console-framework/target/geronimo-console-framework/WEB-INF/classes
    [delete] Deleting 15 files from /home/continuum/continuum-1.0.2/apps/continuum/work/68/applications/console-framework/target/geronimo-console-framework/WEB-INF/work
    [delete] Deleted 6 directories from /home/continuum/continuum-1.0.2/apps/continuum/work/68/applications/console-framework/target/geronimo-console-framework/WEB-INF/work
    [delete] Deleting 17 files from /home/continuum/continuum-1.0.2/apps/continuum/work/68/applications/console-framework/target/temp
    [delete] Deleted 9 directories from /home/continuum/continuum-1.0.2/apps/continuum/work/68/applications/console-framework/target/temp

war:war:
    [echo] Building WAR geronimo-console-framework
    [jar] Building jar: /home/continuum/continuum-1.0.2/apps/continuum/work/68/applications/console-framework/target/geronimo-console-framework-1.1-SNAPSHOT.war

war:install:
    [echo] Installing...
Uploading to geronimo/wars/geronimo-console-framework-1.1-SNAPSHOT.war: 
.................... (2493K)
Uploading to geronimo/poms/geronimo-console-framework-1.1-SNAPSHOT.pom: 
.................... (12K)

+----------------------------------------
| applications Geronimo :: Console :: Standard Portlets
| Memory: 20M/28M
+----------------------------------------
DEPRECATED: the default goal should be specified in the <build> section of project.xml instead of maven.xml
DEPRECATED: the default goal should be specified in the <build> section of project.xml instead of maven.xml

build:end:

Attempting to download geronimo-derby-1.1-SNAPSHOT.jar.
Attempting to download geronimo-converter-1.1-SNAPSHOT.jar.
Attempting to download activemq-core-3.2.4-SNAPSHOT.jar.
Attempting to download geronimo-console-core-1.1-SNAPSHOT.jar.
build:start:

multiproject:install-callback:
    [echo] Running war:install for Geronimo :: Console :: Standard Portlets
Tag library requested that is not present: 'caller' in plugin: 'maven-war-plugin-1.6.1'
war:init:

war:war-resources:
    [copy] Copying 1 file to /home/continuum/continuum-1.0.2/apps/continuum/work/68/applications/console-standard/target/geronimo-console-standard
    [copy] Copying 1 file to /home/continuum/continuum-1.0.2/apps/continuum/work/68/applications/console-standard/target/geronimo-console-standard/WEB-INF

java:prepare-filesystem:

java:compile:
<depend closure="false" srcdir="1.4" dump="false" destdir="/home/continuum/continuum-1.0.2/apps/continuum/work/68/applications/console-standard/target/classes"></depend>    [echo] Compiling to /home/continuum/continuum-1.0.2/apps/continuum/work/68/applications/console-standard/target/classes

java:jar-resources:

test:prepare-filesystem:

test:test-resources:

test:compile:

test:test:
    [echo] NOTICE: Skipping tests; they seem to have passed already
    [echo] No tests to run.
Running post goal: test:test

war:webapp:
    [echo] Assembling webapp geronimo-console-standard
    [copy] Copying 172 files to /home/continuum/continuum-1.0.2/apps/continuum/work/68/applications/console-standard/target/geronimo-console-standard/WEB-INF/classes
Running post goal: war:webapp
preCompile:
    [echo] Pre-compiling JSPs from /home/continuum/continuum-1.0.2/apps/continuum/work/68/applications/console-standard/src/webapp to /home/continuum/continuum-1.0.2/apps/continuum/work/68/applications/console-standard/target/geronimo-console-standard/WEB-INF/work.
    [echo] Compiling generated Java files in /home/continuum/continuum-1.0.2/apps/continuum/work/68/applications/console-standard/target/geronimo-console-standard/WEB-INF/work.
    [javac] Compiling 155 source files to /home/continuum/continuum-1.0.2/apps/continuum/work/68/applications/console-standard/target/geronimo-console-standard/WEB-INF/work

substitute:

Running post goal: war:webapp
    [echo] Use classes.jar ? true
    [move] Moving 329 files to /home/continuum/continuum-1.0.2/apps/continuum/work/68/applications/console-standard/target/temp
    [jar] Building jar: /home/continuum/continuum-1.0.2/apps/continuum/work/68/applications/console-standard/target/geronimo-console-standard/WEB-INF/lib/classes.jar
    [delete] Deleted 34 directories from /home/continuum/continuum-1.0.2/apps/continuum/work/68/applications/console-standard/target/geronimo-console-standard/WEB-INF/classes
    [delete] Deleting 155 files from /home/continuum/continuum-1.0.2/apps/continuum/work/68/applications/console-standard/target/geronimo-console-standard/WEB-INF/work
    [delete] Deleted 39 directories from /home/continuum/continuum-1.0.2/apps/continuum/work/68/applications/console-standard/target/geronimo-console-standard/WEB-INF/work
    [delete] Deleting 329 files from /home/continuum/continuum-1.0.2/apps/continuum/work/68/applications/console-standard/target/temp
    [delete] Deleted 71 directories from /home/continuum/continuum-1.0.2/apps/continuum/work/68/applications/console-standard/target/temp

war:war:
    [echo] Building WAR geronimo-console-standard
    [jar] Building jar: /home/continuum/continuum-1.0.2/apps/continuum/work/68/applications/console-standard/target/geronimo-console-standard-1.1-SNAPSHOT.war

war:install:
    [echo] Installing...
Uploading to geronimo/wars/geronimo-console-standard-1.1-SNAPSHOT.war: 
.................... (3961K)
Uploading to geronimo/poms/geronimo-console-standard-1.1-SNAPSHOT.pom: 
.................... (17K)

+----------------------------------------
| applications Geronimo :: Console :: Application EAR
| Memory: 48M/67M
+----------------------------------------
DEPRECATED: the default goal should be specified in the <build> section of project.xml instead of maven.xml
DEPRECATED: the default goal should be specified in the <build> section of project.xml instead of maven.xml

build:end:

Attempting to download geronimo-console-framework-1.1-SNAPSHOT.war.
Attempting to download geronimo-console-standard-1.1-SNAPSHOT.war.
build:start:

multiproject:install-callback:
    [echo] Running ear:install for Geronimo :: Console :: Application EAR
ear:init:

ear:ear:
ear:generate-ear-descriptor:
    [echo] Generating /home/continuum/continuum-1.0.2/apps/continuum/work/68/applications/console-ear/target/application.xml

    [echo] Building EAR geronimo-console-1.1-SNAPSHOT.ear with appxml "/home/continuum/continuum-1.0.2/apps/continuum/work/68/applications/console-ear/target/application.xml"
    [echo] Dependency geronimo-console-framework-1.1-SNAPSHOT.war will be bundled as framework.war
    [copy] Copying 1 file to /home/continuum/continuum-1.0.2/apps/continuum/work/68/applications/console-ear/target/tmpEarDeps
    [echo] Dependency geronimo-console-standard-1.1-SNAPSHOT.war will be bundled as standard.war
    [copy] Copying 1 file to /home/continuum/continuum-1.0.2/apps/continuum/work/68/applications/console-ear/target/tmpEarDeps
    [ear] Building ear: /home/continuum/continuum-1.0.2/apps/continuum/work/68/applications/console-ear/target/geronimo-console-1.1-SNAPSHOT.ear
    [delete] Deleting directory /home/continuum/continuum-1.0.2/apps/continuum/work/68/applications/console-ear/target/tmpEarDeps

ear:install:
    [echo] Installing...
Uploading to geronimo/ears/geronimo-console-1.1-SNAPSHOT.ear: 
.................... (6427K)
Uploading to geronimo/poms/geronimo-console-1.1-SNAPSHOT.pom: 
.................... (12K)

+----------------------------------------
| applications DayTrader :: Core
| Memory: 47M/67M
+----------------------------------------
DEPRECATED: the default goal should be specified in the <build> section of project.xml instead of maven.xml
DEPRECATED: the default goal should be specified in the <build> section of project.xml instead of maven.xml

build:end:

build:start:

multiproject:install-callback:
    [echo] Running jar:install for DayTrader :: Core
java:prepare-filesystem:

java:compile:
<depend closure="false" srcdir="1.4" dump="false" destdir="/home/continuum/continuum-1.0.2/apps/continuum/work/68/applications/daytrader/core/target/classes"></depend>    [echo] Compiling to /home/continuum/continuum-1.0.2/apps/continuum/work/68/applications/daytrader/core/target/classes

java:jar-resources:

test:prepare-filesystem:

test:test-resources:

test:compile:

test:test:
    [echo] NOTICE: Skipping tests; they seem to have passed already
    [echo] No tests to run.
Running post goal: test:test

jar:jar:

jar:install:
    [echo] Installing...
Uploading to geronimo/jars/daytrader-core-1.1-SNAPSHOT.jar: 
.................... (1K)
Uploading to geronimo/poms/daytrader-core-1.1-SNAPSHOT.pom: 
.................... (10K)

+----------------------------------------
| applications DayTrader :: Derby Database
| Memory: 48M/67M
+----------------------------------------
DEPRECATED: the default goal should be specified in the <build> section of project.xml instead of maven.xml
DEPRECATED: the default goal should be specified in the <build> section of project.xml instead of maven.xml

build:end:

build:start:

multiproject:install-callback:
    [echo] Running jar:install for DayTrader :: Derby Database
java:prepare-filesystem:
init-database:
    [delete] Deleting directory /home/continuum/continuum-1.0.2/apps/continuum/work/68/applications/daytrader/derby/target/resources/META-INF/geronimo-daytrader-derby-db/var/derby
    [mkdir] Created dir: /home/continuum/continuum-1.0.2/apps/continuum/work/68/applications/daytrader/derby/target/resources/META-INF/geronimo-daytrader-derby-db/var/derby
    [sql] Executing file: /home/continuum/continuum-1.0.2/apps/continuum/work/68/applications/daytrader/derby/src/sql/daytrader.sql
    [sql] 18 of 18 SQL statements executed successfully


java:compile:
    [echo] Compiling to /home/continuum/continuum-1.0.2/apps/continuum/work/68/applications/daytrader/derby/target/classes
    [echo] No java source files to compile.

java:jar-resources:
Copying 71 files to /home/continuum/continuum-1.0.2/apps/continuum/work/68/applications/daytrader/derby/target/classes

test:prepare-filesystem:

test:test-resources:

test:compile:
    [echo] No test source files to compile.

test:test:
    [echo] NOTICE: Skipping tests; they seem to have passed already
    [echo] No tests to run.
Running post goal: test:test

jar:jar:
    [jar] Building jar: /home/continuum/continuum-1.0.2/apps/continuum/work/68/applications/daytrader/derby/target/geronimo-daytrader-derby-db-1.1-SNAPSHOT.jar

jar:install:
    [echo] Installing...
Uploading to geronimo/jars/geronimo-daytrader-derby-db-1.1-SNAPSHOT.jar: 
.................... (67K)
Uploading to geronimo/poms/geronimo-daytrader-derby-db-1.1-SNAPSHOT.pom: 
.................... (10K)

+----------------------------------------
| applications DayTrader :: WS Application Client
| Memory: 18M/67M
+----------------------------------------
DEPRECATED: the default goal should be specified in the <build> section of project.xml instead of maven.xml
DEPRECATED: the default goal should be specified in the <build> section of project.xml instead of maven.xml

build:end:

build:start:

multiproject:install-callback:
    [echo] Running jar:install for DayTrader :: WS Application Client
java:prepare-filesystem:

java:compile:
<depend closure="false" srcdir="1.4" dump="false" destdir="/home/continuum/continuum-1.0.2/apps/continuum/work/68/applications/daytrader/wsappclient/target/classes"></depend>    [echo] Compiling to /home/continuum/continuum-1.0.2/apps/continuum/work/68/applications/daytrader/wsappclient/target/classes

java:jar-resources:

test:prepare-filesystem:

test:test-resources:

test:compile:

test:test:
    [echo] NOTICE: Skipping tests; they seem to have passed already
    [echo] No tests to run.
Running post goal: test:test

jar:jar:
    [echo] Generating Manifest file for Streamer Application
    [echo] And this is found in /client/META-INF

jar:install:
    [echo] Installing...
Uploading to geronimo/jars/daytrader-wsappclient-1.1-SNAPSHOT.jar: 
.................... (40K)
Uploading to geronimo/poms/daytrader-wsappclient-1.1-SNAPSHOT.pom: 
.................... (10K)

+----------------------------------------
| applications DayTrader :: EJBs
| Memory: 21M/67M
+----------------------------------------
DEPRECATED: the default goal should be specified in the <build> section of project.xml instead of maven.xml
DEPRECATED: the default goal should be specified in the <build> section of project.xml instead of maven.xml

build:end:

Attempting to download daytrader-core-1.1-SNAPSHOT.jar.
Attempting to download daytrader-wsappclient-1.1-SNAPSHOT.jar.
build:start:

multiproject:install-callback:
    [echo] Running ejb:install for DayTrader :: EJBs
ejb:init:
java:prepare-filesystem:

java:compile:
<depend closure="false" srcdir="1.4" dump="false" destdir="/home/continuum/continuum-1.0.2/apps/continuum/work/68/applications/daytrader/ejb/target/classes"></depend>    [echo] Compiling to /home/continuum/continuum-1.0.2/apps/continuum/work/68/applications/daytrader/ejb/target/classes

java:jar-resources:

test:prepare-filesystem:

test:test-resources:

test:compile:

test:test:
    [echo] NOTICE: Skipping tests; they seem to have passed already
    [echo] No tests to run.
Running post goal: test:test


ejb:ejb:
ejb:ejb-jar-internal:
    [echo] Building ejb daytrader-ejb-1.1-SNAPSHOT
    [echo] Bundling: jar - commons-logging:commons-logging


ejb:install:
    [echo] Installing...
Uploading to geronimo/ejbs/daytrader-ejb-1.1-SNAPSHOT.jar: 
.................... (140K)
Uploading to geronimo/poms/daytrader-ejb-1.1-SNAPSHOT.pom: 
.................... (10K)

+----------------------------------------
| applications DayTrader :: Web Application
| Memory: 24M/67M
+----------------------------------------
DEPRECATED: the default goal should be specified in the <build> section of project.xml instead of maven.xml
DEPRECATED: the default goal should be specified in the <build> section of project.xml instead of maven.xml

build:end:

Attempting to download daytrader-ejb-1.1-SNAPSHOT.jar.
build:start:

multiproject:install-callback:
    [echo] Running war:install for DayTrader :: Web Application
Tag library requested that is not present: 'caller' in plugin: 'maven-war-plugin-1.6.1'
war:init:

war:war-resources:

java:prepare-filesystem:

java:compile:
<depend closure="false" srcdir="1.4" dump="false" destdir="/home/continuum/continuum-1.0.2/apps/continuum/work/68/applications/daytrader/web/target/classes"></depend>    [echo] Compiling to /home/continuum/continuum-1.0.2/apps/continuum/work/68/applications/daytrader/web/target/classes

java:jar-resources:

test:prepare-filesystem:

test:test-resources:

test:compile:

test:test:
    [echo] NOTICE: Skipping tests; they seem to have passed already
    [echo] No tests to run.
Running post goal: test:test

war:webapp:
    [echo] Assembling webapp daytrader-web
    [copy] Copying 33 files to /home/continuum/continuum-1.0.2/apps/continuum/work/68/applications/daytrader/web/target/daytrader-web/WEB-INF/classes
Running post goal: war:webapp
    [echo] Generating /web.xml
Running post goal: war:webapp
    [echo] Use classes.jar ? true
    [move] Warning: /home/continuum/continuum-1.0.2/apps/continuum/work/68/applications/daytrader/web/target/daytrader-web/WEB-INF/work not found.
    [move] Moving 33 files to /home/continuum/continuum-1.0.2/apps/continuum/work/68/applications/daytrader/web/target/temp
    [jar] Building jar: /home/continuum/continuum-1.0.2/apps/continuum/work/68/applications/daytrader/web/target/daytrader-web/WEB-INF/lib/classes.jar
    [delete] Deleted 7 directories from /home/continuum/continuum-1.0.2/apps/continuum/work/68/applications/daytrader/web/target/daytrader-web/WEB-INF/classes
    [delete] /home/continuum/continuum-1.0.2/apps/continuum/work/68/applications/daytrader/web/target/daytrader-web/WEB-INF/work not found.
    [delete] Deleting 33 files from /home/continuum/continuum-1.0.2/apps/continuum/work/68/applications/daytrader/web/target/temp
    [delete] Deleted 8 directories from /home/continuum/continuum-1.0.2/apps/continuum/work/68/applications/daytrader/web/target/temp

war:war:
    [echo] Building WAR daytrader-web
    [jar] Building jar: /home/continuum/continuum-1.0.2/apps/continuum/work/68/applications/daytrader/web/target/daytrader-web-1.1-SNAPSHOT.war

war:install:
    [echo] Installing...
Uploading to geronimo/wars/daytrader-web-1.1-SNAPSHOT.war: 
.................... (446K)
Uploading to geronimo/poms/daytrader-web-1.1-SNAPSHOT.pom: 
.................... (10K)

+----------------------------------------
| applications DayTrader :: Quote Streamer
| Memory: 25M/67M
+----------------------------------------
DEPRECATED: the default goal should be specified in the <build> section of project.xml instead of maven.xml
DEPRECATED: the default goal should be specified in the <build> section of project.xml instead of maven.xml

build:end:

build:start:

multiproject:install-callback:
    [echo] Running jar:install for DayTrader :: Quote Streamer
java:prepare-filesystem:

java:compile:
<depend closure="false" srcdir="1.4" dump="false" destdir="/home/continuum/continuum-1.0.2/apps/continuum/work/68/applications/daytrader/streamer/target/classes"></depend>    [echo] Compiling to /home/continuum/continuum-1.0.2/apps/continuum/work/68/applications/daytrader/streamer/target/classes

java:jar-resources:

test:prepare-filesystem:

test:test-resources:

test:compile:

test:test:
    [echo] NOTICE: Skipping tests; they seem to have passed already
    [echo] No tests to run.
Running post goal: test:test

jar:jar:
    [echo] Generating Manifest file for Streamer Application
    [echo] And this is found in /client/META-INF

jar:install:
    [echo] Installing...
Uploading to geronimo/jars/daytrader-streamer-1.1-SNAPSHOT.jar: 
.................... (24K)
Uploading to geronimo/poms/daytrader-streamer-1.1-SNAPSHOT.pom: 
.................... (10K)

+----------------------------------------
| applications DayTrader :: Enterprise Application
| Memory: 27M/67M
+----------------------------------------
DEPRECATED: the default goal should be specified in the <build> section of project.xml instead of maven.xml
DEPRECATED: the default goal should be specified in the <build> section of project.xml instead of maven.xml

build:end:

Attempting to download daytrader-web-1.1-SNAPSHOT.war.
Attempting to download daytrader-streamer-1.1-SNAPSHOT.jar.
build:start:

multiproject:install-callback:
    [echo] Running ear:install for DayTrader :: Enterprise Application
ear:init:

ear:ear:
ear:generate-ear-descriptor:
    [echo] Generating /home/continuum/continuum-1.0.2/apps/continuum/work/68/applications/daytrader/ear/target/application.xml

    [echo] Building EAR daytrader-ear-1.1-SNAPSHOT.ear with appxml "/home/continuum/continuum-1.0.2/apps/continuum/work/68/applications/daytrader/ear/target/application.xml"
    [echo] Dependency daytrader-core-1.1-SNAPSHOT.jar will be bundled as core.jar
    [copy] Copying 1 file to /home/continuum/continuum-1.0.2/apps/continuum/work/68/applications/daytrader/ear/target/tmpEarDeps
    [echo] Dependency daytrader-wsappclient-1.1-SNAPSHOT.jar will be bundled as wsappclient.jar
    [copy] Copying 1 file to /home/continuum/continuum-1.0.2/apps/continuum/work/68/applications/daytrader/ear/target/tmpEarDeps
    [echo] Dependency daytrader-web-1.1-SNAPSHOT.war will be bundled as web.war
    [copy] Copying 1 file to /home/continuum/continuum-1.0.2/apps/continuum/work/68/applications/daytrader/ear/target/tmpEarDeps
    [echo] Dependency daytrader-ejb-1.1-SNAPSHOT.jar will be bundled as dt-ejb.jar
    [copy] Copying 1 file to /home/continuum/continuum-1.0.2/apps/continuum/work/68/applications/daytrader/ear/target/tmpEarDeps
    [echo] Dependency daytrader-streamer-1.1-SNAPSHOT.jar will be bundled as streamer.jar
    [copy] Copying 1 file to /home/continuum/continuum-1.0.2/apps/continuum/work/68/applications/daytrader/ear/target/tmpEarDeps
    [ear] Building ear: /home/continuum/continuum-1.0.2/apps/continuum/work/68/applications/daytrader/ear/target/daytrader-ear-1.1-SNAPSHOT.ear
    [delete] Deleting directory /home/continuum/continuum-1.0.2/apps/continuum/work/68/applications/daytrader/ear/target/tmpEarDeps

ear:install:
    [echo] Installing...
Uploading to geronimo/ears/daytrader-ear-1.1-SNAPSHOT.ear: 
.................... (634K)
Uploading to geronimo/poms/daytrader-ear-1.1-SNAPSHOT.pom: 
.................... (12K)

+----------------------------------------
| applications Geronimo :: Demo Webapp
| Memory: 31M/67M
+----------------------------------------
DEPRECATED: the default goal should be specified in the <build> section of project.xml instead of maven.xml
DEPRECATED: the default goal should be specified in the <build> section of project.xml instead of maven.xml

build:end:

build:start:

multiproject:install-callback:
    [echo] Running war:install for Geronimo :: Demo Webapp
Tag library requested that is not present: 'caller' in plugin: 'maven-war-plugin-1.6.1'
war:init:

war:war-resources:
    [copy] Copying 1 file to /home/continuum/continuum-1.0.2/apps/continuum/work/68/applications/demo/target/geronimo-demo/WEB-INF

java:prepare-filesystem:

java:compile:
    [echo] Compiling to /home/continuum/continuum-1.0.2/apps/continuum/work/68/applications/demo/target/classes
    [echo] No java source files to compile.

java:jar-resources:

test:prepare-filesystem:

test:test-resources:

test:compile:
    [echo] No test source files to compile.

test:test:
    [echo] NOTICE: Skipping tests; they seem to have passed already
    [echo] No tests to run.
Running post goal: test:test

war:webapp:
    [echo] Assembling webapp geronimo-demo
Running post goal: war:webapp
    [echo] Use classes.jar ? true
    [move] Warning: /home/continuum/continuum-1.0.2/apps/continuum/work/68/applications/demo/target/geronimo-demo/WEB-INF/work not found.

war:war:
    [echo] Building WAR geronimo-demo
    [jar] Building jar: /home/continuum/continuum-1.0.2/apps/continuum/work/68/applications/demo/target/geronimo-demo-1.1-SNAPSHOT.war

war:install:
    [echo] Installing...
Uploading to geronimo/wars/geronimo-demo-1.1-SNAPSHOT.war: 
.................... (4K)
Uploading to geronimo/poms/geronimo-demo-1.1-SNAPSHOT.pom: 
.................... (10K)

+----------------------------------------
| applications Geronimo :: JMX Debug Webapp
| Memory: 31M/67M
+----------------------------------------
DEPRECATED: the default goal should be specified in the <build> section of project.xml instead of maven.xml
DEPRECATED: the default goal should be specified in the <build> section of project.xml instead of maven.xml

build:end:

build:start:

multiproject:install-callback:
    [echo] Running war:install for Geronimo :: JMX Debug Webapp
Tag library requested that is not present: 'caller' in plugin: 'maven-war-plugin-1.6.1'
war:init:

war:war-resources:
    [copy] Copying 1 file to /home/continuum/continuum-1.0.2/apps/continuum/work/68/applications/jmxdebug/target/geronimo-jmxdebug/WEB-INF

java:prepare-filesystem:

java:compile:
<depend closure="false" srcdir="1.4" dump="false" destdir="/home/continuum/continuum-1.0.2/apps/continuum/work/68/applications/jmxdebug/target/classes"></depend>    [echo] Compiling to /home/continuum/continuum-1.0.2/apps/continuum/work/68/applications/jmxdebug/target/classes

java:jar-resources:

test:prepare-filesystem:

test:test-resources:

test:compile:
    [echo] No test source files to compile.

test:test:
    [echo] NOTICE: Skipping tests; they seem to have passed already
    [echo] No tests to run.
Running post goal: test:test

war:webapp:
    [echo] Assembling webapp geronimo-jmxdebug
    [copy] Copying 11 files to /home/continuum/continuum-1.0.2/apps/continuum/work/68/applications/jmxdebug/target/geronimo-jmxdebug/WEB-INF/classes
Running post goal: war:webapp
    [echo] Use classes.jar ? true
    [move] Warning: /home/continuum/continuum-1.0.2/apps/continuum/work/68/applications/jmxdebug/target/geronimo-jmxdebug/WEB-INF/work not found.
    [move] Moving 11 files to /home/continuum/continuum-1.0.2/apps/continuum/work/68/applications/jmxdebug/target/temp
    [jar] Building jar: /home/continuum/continuum-1.0.2/apps/continuum/work/68/applications/jmxdebug/target/geronimo-jmxdebug/WEB-INF/lib/classes.jar
    [delete] Deleted 8 directories from /home/continuum/continuum-1.0.2/apps/continuum/work/68/applications/jmxdebug/target/geronimo-jmxdebug/WEB-INF/classes
    [delete] /home/continuum/continuum-1.0.2/apps/continuum/work/68/applications/jmxdebug/target/geronimo-jmxdebug/WEB-INF/work not found.
    [delete] Deleting 11 files from /home/continuum/continuum-1.0.2/apps/continuum/work/68/applications/jmxdebug/target/temp
    [delete] Deleted 9 directories from /home/continuum/continuum-1.0.2/apps/continuum/work/68/applications/jmxdebug/target/temp

war:war:
    [echo] Building WAR geronimo-jmxdebug
    [jar] Building jar: /home/continuum/continuum-1.0.2/apps/continuum/work/68/applications/jmxdebug/target/geronimo-jmxdebug-1.1-SNAPSHOT.war

war:install:
    [echo] Installing...
Uploading to geronimo/wars/geronimo-jmxdebug-1.1-SNAPSHOT.war: 
.................... (470K)
Uploading to geronimo/poms/geronimo-jmxdebug-1.1-SNAPSHOT.pom: 
.................... (10K)

+----------------------------------------
| applications Geronimo :: LDAP Demo Application
| Memory: 30M/67M
+----------------------------------------
DEPRECATED: the default goal should be specified in the <build> section of project.xml instead of maven.xml
DEPRECATED: the default goal should be specified in the <build> section of project.xml instead of maven.xml

build:end:

build:start:

multiproject:install-callback:
    [echo] Running war:install for Geronimo :: LDAP Demo Application
Tag library requested that is not present: 'caller' in plugin: 'maven-war-plugin-1.6.1'
war:init:

war:war-resources:
    [copy] Copying 1 file to /home/continuum/continuum-1.0.2/apps/continuum/work/68/applications/ldap-realm-demo/target/geronimo-ldap-demo/WEB-INF

java:prepare-filesystem:

java:compile:
    [echo] Compiling to /home/continuum/continuum-1.0.2/apps/continuum/work/68/applications/ldap-realm-demo/target/classes
    [echo] No java source files to compile.

java:jar-resources:

test:prepare-filesystem:

test:test-resources:

test:compile:
    [echo] No test source files to compile.

test:test:
    [echo] NOTICE: Skipping tests; they seem to have passed already
    [echo] No tests to run.
Running post goal: test:test

war:webapp:
    [echo] Assembling webapp geronimo-ldap-demo
Running post goal: war:webapp
    [echo] Use classes.jar ? true
    [move] Warning: /home/continuum/continuum-1.0.2/apps/continuum/work/68/applications/ldap-realm-demo/target/geronimo-ldap-demo/WEB-INF/work not found.

war:war:
    [echo] Building WAR geronimo-ldap-demo
    [jar] Building jar: /home/continuum/continuum-1.0.2/apps/continuum/work/68/applications/ldap-realm-demo/target/geronimo-ldap-demo-1.1-SNAPSHOT.war

war:install:
    [echo] Installing...
Uploading to geronimo/wars/geronimo-ldap-demo-1.1-SNAPSHOT.war: 
.................... (4K)
Uploading to geronimo/poms/geronimo-ldap-demo-1.1-SNAPSHOT.pom: 
.................... (10K)

+----------------------------------------
| applications Geronimo :: The Magic G Ball Sample Application
| Memory: 31M/67M
+----------------------------------------
DEPRECATED: the default goal should be specified in the <build> section of project.xml instead of maven.xml
DEPRECATED: the default goal should be specified in the <build> section of project.xml instead of maven.xml

build:end:

build:start:

multiproject:install-callback:
    [echo] Running war:install for Geronimo :: The Magic G Ball Sample Application
Tag library requested that is not present: 'caller' in plugin: 'maven-war-plugin-1.6.1'
war:init:

war:war-resources:
    [copy] Copying 1 file to /home/continuum/continuum-1.0.2/apps/continuum/work/68/applications/magicGball/target/magicGball/WEB-INF

java:prepare-filesystem:

java:compile:
<depend closure="false" srcdir="1.4" dump="false" destdir="/home/continuum/continuum-1.0.2/apps/continuum/work/68/applications/magicGball/target/classes"></depend>    [echo] Compiling to /home/continuum/continuum-1.0.2/apps/continuum/work/68/applications/magicGball/target/classes

java:jar-resources:

test:prepare-filesystem:

test:test-resources:

test:compile:
    [echo] No test source files to compile.

test:test:
    [echo] NOTICE: Skipping tests; they seem to have passed already
    [echo] No tests to run.
Running post goal: test:test

war:webapp:
    [echo] Assembling webapp magicGball
    [copy] Copying 1 file to /home/continuum/continuum-1.0.2/apps/continuum/work/68/applications/magicGball/target/magicGball/WEB-INF/classes
Running post goal: war:webapp
    [echo] Use classes.jar ? true
    [move] Warning: /home/continuum/continuum-1.0.2/apps/continuum/work/68/applications/magicGball/target/magicGball/WEB-INF/work not found.
    [move] Moving 1 file to /home/continuum/continuum-1.0.2/apps/continuum/work/68/applications/magicGball/target/temp
    [jar] Building jar: /home/continuum/continuum-1.0.2/apps/continuum/work/68/applications/magicGball/target/magicGball/WEB-INF/lib/classes.jar
    [delete] Deleted 2 directories from /home/continuum/continuum-1.0.2/apps/continuum/work/68/applications/magicGball/target/magicGball/WEB-INF/classes
    [delete] /home/continuum/continuum-1.0.2/apps/continuum/work/68/applications/magicGball/target/magicGball/WEB-INF/work not found.
    [delete] Deleting 1 files from /home/continuum/continuum-1.0.2/apps/continuum/work/68/applications/magicGball/target/temp
    [delete] Deleted 3 directories from /home/continuum/continuum-1.0.2/apps/continuum/work/68/applications/magicGball/target/temp

war:war:
    [echo] Building WAR magicGball
    [jar] Building jar: /home/continuum/continuum-1.0.2/apps/continuum/work/68/applications/magicGball/target/magicGball-1.1-SNAPSHOT.war

war:install:
    [echo] Installing...
Uploading to geronimo/wars/magicGball-1.1-SNAPSHOT.war: 
.................... (2K)
Uploading to geronimo/poms/magicGball-1.1-SNAPSHOT.pom: 
.................... (10K)

+----------------------------------------
| applications Geronimo :: Remote Deploy GBean
| Memory: 30M/67M
+----------------------------------------
DEPRECATED: the default goal should be specified in the <build> section of project.xml instead of maven.xml
DEPRECATED: the default goal should be specified in the <build> section of project.xml instead of maven.xml

build:end:

build:start:

multiproject:install-callback:
    [echo] Running jar:install for Geronimo :: Remote Deploy GBean
java:prepare-filesystem:

java:compile:
<depend closure="false" srcdir="1.4" dump="false" destdir="/home/continuum/continuum-1.0.2/apps/continuum/work/68/applications/remote-deploy-lib/target/classes"></depend>    [echo] Compiling to /home/continuum/continuum-1.0.2/apps/continuum/work/68/applications/remote-deploy-lib/target/classes

java:jar-resources:

test:prepare-filesystem:

test:test-resources:

test:compile:
    [echo] No test source files to compile.

test:test:
    [echo] NOTICE: Skipping tests; they seem to have passed already
    [echo] No tests to run.
Running post goal: test:test

jar:jar:

jar:install:
    [echo] Installing...
Uploading to geronimo/jars/geronimo-remote-deploy-lib-1.1-SNAPSHOT.jar: 
.................... (6K)
Uploading to geronimo/poms/geronimo-remote-deploy-lib-1.1-SNAPSHOT.pom: 
.................... (10K)

+----------------------------------------
| applications Geronimo :: Remote Deploy Application
| Memory: 31M/67M
+----------------------------------------
DEPRECATED: the default goal should be specified in the <build> section of project.xml instead of maven.xml
DEPRECATED: the default goal should be specified in the <build> section of project.xml instead of maven.xml

build:end:

Attempting to download geronimo-remote-deploy-lib-1.1-SNAPSHOT.jar.
build:start:

multiproject:install-callback:
    [echo] Running war:install for Geronimo :: Remote Deploy Application
Tag library requested that is not present: 'caller' in plugin: 'maven-war-plugin-1.6.1'
war:init:

war:war-resources:
    [copy] Copying 1 file to /home/continuum/continuum-1.0.2/apps/continuum/work/68/applications/remote-deploy/target/geronimo-remote-deploy/WEB-INF

java:prepare-filesystem:

java:compile:
<depend closure="false" srcdir="1.4" dump="false" destdir="/home/continuum/continuum-1.0.2/apps/continuum/work/68/applications/remote-deploy/target/classes"></depend>    [echo] Compiling to /home/continuum/continuum-1.0.2/apps/continuum/work/68/applications/remote-deploy/target/classes

java:jar-resources:

test:prepare-filesystem:

test:test-resources:

test:compile:
    [echo] No test source files to compile.

test:test:
    [echo] NOTICE: Skipping tests; they seem to have passed already
    [echo] No tests to run.
Running post goal: test:test

war:webapp:
    [echo] Assembling webapp geronimo-remote-deploy
    [copy] Copying 2 files to /home/continuum/continuum-1.0.2/apps/continuum/work/68/applications/remote-deploy/target/geronimo-remote-deploy/WEB-INF/classes
Running post goal: war:webapp
    [echo] Use classes.jar ? true
    [move] Warning: /home/continuum/continuum-1.0.2/apps/continuum/work/68/applications/remote-deploy/target/geronimo-remote-deploy/WEB-INF/work not found.
    [move] Moving 2 files to /home/continuum/continuum-1.0.2/apps/continuum/work/68/applications/remote-deploy/target/temp
    [jar] Building jar: /home/continuum/continuum-1.0.2/apps/continuum/work/68/applications/remote-deploy/target/geronimo-remote-deploy/WEB-INF/lib/classes.jar
    [delete] Deleted 5 directories from /home/continuum/continuum-1.0.2/apps/continuum/work/68/applications/remote-deploy/target/geronimo-remote-deploy/WEB-INF/classes
    [delete] /home/continuum/continuum-1.0.2/apps/continuum/work/68/applications/remote-deploy/target/geronimo-remote-deploy/WEB-INF/work not found.
    [delete] Deleting 2 files from /home/continuum/continuum-1.0.2/apps/continuum/work/68/applications/remote-deploy/target/temp
    [delete] Deleted 6 directories from /home/continuum/continuum-1.0.2/apps/continuum/work/68/applications/remote-deploy/target/temp

war:war:
    [echo] Building WAR geronimo-remote-deploy
    [jar] Building jar: /home/continuum/continuum-1.0.2/apps/continuum/work/68/applications/remote-deploy/target/geronimo-remote-deploy-1.1-SNAPSHOT.war

war:install:
    [echo] Installing...
Uploading to geronimo/wars/geronimo-remote-deploy-1.1-SNAPSHOT.war: 
.................... (4K)
Uploading to geronimo/poms/geronimo-remote-deploy-1.1-SNAPSHOT.pom: 
.................... (11K)

+----------------------------------------
| applications Geronimo :: UDDI-Server database
| Memory: 30M/67M
+----------------------------------------
DEPRECATED: the default goal should be specified in the <build> section of project.xml instead of maven.xml
DEPRECATED: the default goal should be specified in the <build> section of project.xml instead of maven.xml

build:end:

build:start:

multiproject:install-callback:
    [echo] Running jar:install for Geronimo :: UDDI-Server database
java:prepare-filesystem:
init-database:
    [delete] Deleting directory /home/continuum/continuum-1.0.2/apps/continuum/work/68/applications/uddi-db/target/resources/META-INF/geronimo-uddi-db/var/derby
    [mkdir] Created dir: /home/continuum/continuum-1.0.2/apps/continuum/work/68/applications/uddi-db/target/resources/META-INF/geronimo-uddi-db/var/derby
    [sql] Executing file: /home/continuum/continuum-1.0.2/apps/continuum/work/68/applications/uddi-db/src/sql/juddi.sql
    [sql] 87 of 87 SQL statements executed successfully


java:compile:
    [echo] Compiling to /home/continuum/continuum-1.0.2/apps/continuum/work/68/applications/uddi-db/target/classes
    [echo] No java source files to compile.

java:jar-resources:
Copying 142 files to /home/continuum/continuum-1.0.2/apps/continuum/work/68/applications/uddi-db/target/classes

test:prepare-filesystem:

test:test-resources:

test:compile:
    [echo] No test source files to compile.

test:test:
    [echo] NOTICE: Skipping tests; they seem to have passed already
    [echo] No tests to run.
Running post goal: test:test

jar:jar:
    [jar] Building jar: /home/continuum/continuum-1.0.2/apps/continuum/work/68/applications/uddi-db/target/geronimo-uddi-db-1.1-SNAPSHOT.jar

jar:install:
    [echo] Installing...
Uploading to geronimo/jars/geronimo-uddi-db-1.1-SNAPSHOT.jar: 
.................... (140K)
Uploading to geronimo/poms/geronimo-uddi-db-1.1-SNAPSHOT.pom: 
.................... (10K)

+----------------------------------------
| applications Geronimo :: UDDI-Server
| Memory: 37M/67M
+----------------------------------------
DEPRECATED: the default goal should be specified in the <build> section of project.xml instead of maven.xml
DEPRECATED: the default goal should be specified in the <build> section of project.xml instead of maven.xml

build:end:

build:start:

multiproject:install-callback:
    [echo] Running war:install for Geronimo :: UDDI-Server
Tag library requested that is not present: 'caller' in plugin: 'maven-war-plugin-1.6.1'
war:init:

war:war-resources:
    [copy] Copying 1 file to /home/continuum/continuum-1.0.2/apps/continuum/work/68/applications/uddi-server/target/geronimo-uddi-server/WEB-INF

java:prepare-filesystem:

java:compile:
    [echo] Compiling to /home/continuum/continuum-1.0.2/apps/continuum/work/68/applications/uddi-server/target/classes
    [echo] No java source files to compile.

java:jar-resources:

test:prepare-filesystem:

test:test-resources:

test:compile:
    [echo] No test source files to compile.

test:test:
    [echo] NOTICE: Skipping tests; they seem to have passed already
    [echo] No tests to run.
Running post goal: test:test

war:webapp:
    [echo] Assembling webapp geronimo-uddi-server
Running post goal: war:webapp
    [echo] Use classes.jar ? true
    [move] Warning: /home/continuum/continuum-1.0.2/apps/continuum/work/68/applications/uddi-server/target/geronimo-uddi-server/WEB-INF/work not found.

war:war:
    [echo] Building WAR geronimo-uddi-server
    [jar] Building jar: /home/continuum/continuum-1.0.2/apps/continuum/work/68/applications/uddi-server/target/geronimo-uddi-server-1.1-SNAPSHOT.war

war:install:
    [echo] Installing...
Uploading to geronimo/wars/geronimo-uddi-server-1.1-SNAPSHOT.war: 
.................... (5K)
Uploading to geronimo/poms/geronimo-uddi-server-1.1-SNAPSHOT.pom: 
.................... (10K)

+----------------------------------------
| applications Geronimo :: Welcome Application
| Memory: 37M/67M
+----------------------------------------
DEPRECATED: the default goal should be specified in the <build> section of project.xml instead of maven.xml
DEPRECATED: the default goal should be specified in the <build> section of project.xml instead of maven.xml

build:end:

build:start:

multiproject:install-callback:
    [echo] Running war:install for Geronimo :: Welcome Application
Tag library requested that is not present: 'caller' in plugin: 'maven-war-plugin-1.6.1'
war:init:

war:war-resources:
    [copy] Copying 1 file to /home/continuum/continuum-1.0.2/apps/continuum/work/68/applications/welcome/target/geronimo-welcome/WEB-INF

java:prepare-filesystem:

java:compile:
    [echo] Compiling to /home/continuum/continuum-1.0.2/apps/continuum/work/68/applications/welcome/target/classes
    [echo] No java source files to compile.

java:jar-resources:

test:prepare-filesystem:

test:test-resources:

test:compile:
    [echo] No test source files to compile.

test:test:
    [echo] NOTICE: Skipping tests; they seem to have passed already
    [echo] No tests to run.
Running post goal: test:test

war:webapp:
    [echo] Assembling webapp geronimo-welcome
Running post goal: war:webapp
    [echo] Use classes.jar ? true
    [move] Warning: /home/continuum/continuum-1.0.2/apps/continuum/work/68/applications/welcome/target/geronimo-welcome/WEB-INF/work not found.

war:war:
    [echo] Building WAR geronimo-welcome
    [jar] Building jar: /home/continuum/continuum-1.0.2/apps/continuum/work/68/applications/welcome/target/geronimo-welcome-1.1-SNAPSHOT.war

war:install:
    [echo] Installing...
Uploading to geronimo/wars/geronimo-welcome-1.1-SNAPSHOT.war: 
.................... (33K)
Uploading to geronimo/poms/geronimo-welcome-1.1-SNAPSHOT.pom: 
.................... (10K)


build:end:


Starting the reactor...
Our processing order:
Geronimo Configuration for performing service deployments
System Configuration for the J2EE Server
RMI/Naming configuration
Server Configuration for the J2EE Server
System Configuration for the J2EE Client
Configuration for the J2EE Client
Configuration for performing J2EE deployments
Configuration for application client deployments
Axis Configuration for the J2EE Server
openejb Configuration for the J2EE Server
openejb Configuration for performing J2EE deployments
Axis Configuration for performing J2EE deployments
System Database Configuration for the J2EE Server
ActiveMQ broker configuration
Activemq configuration
Corba Configuration for the J2EE Client
Security Configuration for the J2EE Client
Security Configuration for the J2EE Server
Jetty Configuration for the J2EE Server
Jetty Deployer Configuration for the J2EE Server
Web console deployed on jetty
Tomcat Configuration for the J2EE Server
Tomcat Deployer Configuration for the J2EE Server
Web console deployed on tomcat
Daytrader using derby deployed on jetty
Daytrader using derby deployed on tomcat
Directory Configuration
Hot deployer
Corba Configuration for the J2EE Server
JavaMail
JMX Debug app for Jetty
JMX Debug app Tomcat
JSP Examples for Jetty
JSP Examples Tomcat
LDAP security realm
LDAP Demo for Jetty
LDAP Demo for Tomcat
Online Deployer
Geronimo :: Remote Deploy Jetty Application
Geronimo :: Remote Deploy Tomcat Application
Servlet Examples for Jetty
Servlet Examples Tomcat
Shared Library GBean
Shutdown
UDDI server Configuration for the J2EE Jetty Server
UDDI server Configuration for the J2EE Tomcat Server
Configuration for no j2ee app clients
Configuration for no EJBs
Unavailable Web Services deployer
Welcome app for Jetty
Welcome app Tomcat
+----------------------------------------
| configurations Geronimo Configuration for performing service deployments
| Memory: 43M/67M
+----------------------------------------
DEPRECATED: the default goal should be specified in the <build> section of project.xml instead of maven.xml
DEPRECATED: the default goal should be specified in the <build> section of project.xml instead of maven.xml
new4:
build:start:

multiproject:install-callback:
    [echo] Running car:install for Geronimo Configuration for performing service deployments
car:prepare-plan:

car:package:

    Packaging configuration /home/continuum/continuum-1.0.2/apps/continuum/work/68/configs/geronimo-gbean-deployer/target/plan/plan.xml


car:install:
    [echo] Installing...
Uploading to geronimo/cars/geronimo-gbean-deployer-1.1-SNAPSHOT.car: 
.................... (3K)
Uploading to geronimo/poms/geronimo-gbean-deployer-1.1-SNAPSHOT.pom: 
.................... (13K)
    [echo] about to copy configs
java.lang.reflect.InvocationTargetException
	at sun.reflect.NativeConstructorAccessorImpl.newInstance0(Native Method)
	at sun.reflect.NativeConstructorAccessorImpl.newInstance(NativeConstructorAccessorImpl.java:39)
	at sun.reflect.DelegatingConstructorAccessorImpl.newInstance(DelegatingConstructorAccessorImpl.java:27)
	at java.lang.reflect.Constructor.newInstance(Constructor.java:274)
	at org.apache.geronimo.plugin.packaging.ConfigCopier.execute(ConfigCopier.java:106)
	at sun.reflect.NativeMethodAccessorImpl.invoke0(Native Method)
	at sun.reflect.NativeMethodAccessorImpl.invoke(NativeMethodAccessorImpl.java:39)
	at sun.reflect.DelegatingMethodAccessorImpl.invoke(DelegatingMethodAccessorImpl.java:25)
	at java.lang.reflect.Method.invoke(Method.java:324)
	at org.apache.commons.jelly.impl.DynamicBeanTag.doTag(DynamicBeanTag.java:180)
	at org.apache.commons.jelly.impl.StaticTagScript.run(StaticTagScript.java:102)
	at org.apache.commons.jelly.impl.ScriptBlock.run(ScriptBlock.java:95)
	at org.apache.commons.jelly.TagSupport.invokeBody(TagSupport.java:186)
	at org.apache.commons.jelly.tags.core.CatchTag.doTag(CatchTag.java:44)
	at org.apache.commons.jelly.impl.TagScript.run(TagScript.java:247)
	at org.apache.commons.jelly.impl.ScriptBlock.run(ScriptBlock.java:95)
	at org.apache.maven.jelly.tags.werkz.MavenGoalTag.runBodyTag(MavenGoalTag.java:78)
	at org.apache.maven.jelly.tags.werkz.MavenGoalTag$MavenGoalAction.performAction(MavenGoalTag.java:109)
	at org.apache.maven.werkz.Goal.fire(Goal.java:656)
	at org.apache.maven.werkz.Goal.attain(Goal.java:592)
	at org.apache.maven.werkz.WerkzProject.attainGoal(WerkzProject.java:210)
	at org.apache.maven.jelly.tags.werkz.MavenAttainGoalTag.doTag(MavenAttainGoalTag.java:114)
	at org.apache.commons.jelly.impl.TagScript.run(TagScript.java:247)
	at org.apache.commons.jelly.impl.ScriptBlock.run(ScriptBlock.java:95)
	at org.apache.maven.jelly.tags.werkz.MavenGoalTag.runBodyTag(MavenGoalTag.java:78)
	at org.apache.maven.jelly.tags.werkz.MavenGoalTag$MavenGoalAction.performAction(MavenGoalTag.java:109)
	at org.apache.maven.werkz.Goal.fire(Goal.java:656)
	at org.apache.maven.werkz.Goal.attain(Goal.java:592)
	at org.apache.maven.plugin.PluginManager.attainGoals(PluginManager.java:693)
	at org.apache.maven.MavenSession.attainGoals(MavenSession.java:263)
	at org.apache.maven.jelly.tags.maven.ReactorTag.doTag(ReactorTag.java:368)
	at org.apache.commons.jelly.impl.TagScript.run(TagScript.java:247)
	at org.apache.commons.jelly.impl.ScriptBlock.run(ScriptBlock.java:95)
	at org.apache.maven.jelly.tags.werkz.MavenGoalTag.runBodyTag(MavenGoalTag.java:78)
	at org.apache.maven.jelly.tags.werkz.MavenGoalTag$MavenGoalAction.performAction(MavenGoalTag.java:109)
	at org.apache.maven.werkz.Goal.fire(Goal.java:656)
	at org.apache.maven.werkz.Goal.attain(Goal.java:592)
	at org.apache.maven.werkz.WerkzProject.attainGoal(WerkzProject.java:210)
	at org.apache.maven.jelly.tags.werkz.MavenAttainGoalTag.doTag(MavenAttainGoalTag.java:114)
	at org.apache.commons.jelly.impl.TagScript.run(TagScript.java:247)
	at org.apache.commons.jelly.impl.ScriptBlock.run(ScriptBlock.java:95)
	at org.apache.maven.jelly.tags.werkz.MavenGoalTag.runBodyTag(MavenGoalTag.java:78)
	at org.apache.maven.jelly.tags.werkz.MavenGoalTag$MavenGoalAction.performAction(MavenGoalTag.java:109)
	at org.apache.maven.werkz.Goal.fire(Goal.java:656)
	at org.apache.maven.werkz.Goal.attain(Goal.java:592)
	at org.apache.maven.plugin.PluginManager.attainGoals(PluginManager.java:693)
	at org.apache.maven.MavenSession.attainGoals(MavenSession.java:263)
	at org.apache.maven.cli.App.doMain(App.java:511)
	at org.apache.maven.cli.App.main(App.java:1258)
	at sun.reflect.NativeMethodAccessorImpl.invoke0(Native Method)
	at sun.reflect.NativeMethodAccessorImpl.invoke(NativeMethodAccessorImpl.java:39)
	at sun.reflect.DelegatingMethodAccessorImpl.invoke(DelegatingMethodAccessorImpl.java:25)
	at java.lang.reflect.Method.invoke(Method.java:324)
	at com.werken.forehead.Forehead.run(Forehead.java:551)
	at com.werken.forehead.Forehead.main(Forehead.java:581)
Caused by: java.lang.IllegalStateException: Maven2Repository must have a root that's a valid readable directory (not /home/continuum/continuum-1.0.2/apps/continuum/work/68/configs/geronimo-gbean-deployer/target/repository)
	at org.apache.geronimo.system.repository.AbstractRepository.<init>(AbstractRepository.java:65)
	at org.apache.geronimo.system.repository.Maven2Repository.<init>(Maven2Repository.java:42)
	... 55 more

+----------------------------------------
| configurations System Configuration for the J2EE Server
| Memory: 45M/67M
+----------------------------------------
DEPRECATED: the default goal should be specified in the <build> section of project.xml instead of maven.xml
DEPRECATED: the default goal should be specified in the <build> section of project.xml instead of maven.xml

build:end:

Attempting to download geronimo-gbean-deployer-1.1-SNAPSHOT.car.
build:start:

multiproject:install-callback:
    [echo] Running car:install for System Configuration for the J2EE Server
car:prepare-plan:

car:package:
    [delete] Deleting directory /home/continuum/continuum-1.0.2/apps/continuum/work/68/configs/j2ee-system/target/repository
    [mkdir] Created dir: /home/continuum/continuum-1.0.2/apps/continuum/work/68/configs/j2ee-system/target/repository

    Packaging configuration /home/continuum/continuum-1.0.2/apps/continuum/work/68/configs/j2ee-system/target/plan/plan.xml

0 [main] DEBUG org.apache.geronimo.kernel.basic.BasicKernel  - Starting boot
508 [main] DEBUG org.apache.geronimo.gbean.runtime.GBeanInstanceState  - GBeanInstanceState for: geronimo/boot/none/car?role=kernel State changed from stopped to starting
509 [main] DEBUG org.apache.geronimo.gbean.runtime.GBeanInstanceState  - GBeanInstanceState for: geronimo/boot/none/car?role=kernel State changed from starting to running
509 [main] DEBUG org.apache.geronimo.kernel.basic.BasicKernel  - Booted
627 [main] DEBUG org.apache.geronimo.gbean.runtime.GBeanInstanceState  - GBeanInstanceState for: geronimo/packaging/fixed/car?configurationName=geronimo/packaging/fixed/car State changed from stopped to starting
628 [main] DEBUG org.apache.geronimo.kernel.config.Configuration  - ClassPath for geronimo/packaging/fixed/car resolved to []
630 [main] DEBUG org.apache.geronimo.kernel.config.Configuration  - Started configuration geronimo/packaging/fixed/car
630 [main] DEBUG org.apache.geronimo.gbean.runtime.GBeanInstanceState  - GBeanInstanceState for: geronimo/packaging/fixed/car?configurationName=geronimo/packaging/fixed/car State changed from starting to running
767 [main] DEBUG org.apache.geronimo.gbean.runtime.GBeanInstanceState  - GBeanInstanceState for: geronimo/packaging/fixed/car?j2eeType=ConfigurationStore,name=ConfigStore State changed from stopped to starting
767 [main] DEBUG org.apache.geronimo.gbean.runtime.GBeanSingleReference  - Waiting to start geronimo/packaging/fixed/car?j2eeType=ConfigurationStore,name=ConfigStore because no targets are running for reference Repository matching the patterns geronimo/packaging/fixed/car?j2eeType=Repository,name=SourceRepository
768 [main] DEBUG org.apache.geronimo.gbean.runtime.GBeanInstanceState  - GBeanInstanceState for: geronimo/packaging/fixed/car?j2eeType=ArtifactResolver,name=ArtifactResolver State changed from stopped to starting
829 [main] DEBUG org.apache.geronimo.gbean.runtime.GBeanSingleReference  - Waiting to start geronimo/packaging/fixed/car?j2eeType=ArtifactResolver,name=ArtifactResolver because no targets are running for reference ArtifactManager matching the patterns geronimo/packaging/fixed/car?j2eeType=ArtifactManager,name=ArtifactManager
829 [main] DEBUG org.apache.geronimo.gbean.runtime.GBeanInstanceState  - GBeanInstanceState for: geronimo/packaging/fixed/car?j2eeType=Repository,name=TargetRepository State changed from stopped to starting
829 [main] DEBUG org.apache.geronimo.system.repository.AbstractRepository  - Repository root is /home/continuum/continuum-1.0.2/apps/continuum/work/68/configs/j2ee-system/target/repository
831 [main] DEBUG org.apache.geronimo.gbean.runtime.GBeanInstanceState  - GBeanInstanceState for: geronimo/packaging/fixed/car?j2eeType=Repository,name=TargetRepository State changed from starting to running
831 [main] DEBUG org.apache.geronimo.gbean.runtime.GBeanInstanceState  - GBeanInstanceState for: geronimo/packaging/fixed/car?j2eeType=ConfigurationStore,name=TargetConfigStore State changed from stopped to starting
891 [main] DEBUG org.apache.geronimo.gbean.runtime.GBeanInstanceState  - GBeanInstanceState for: geronimo/packaging/fixed/car?j2eeType=ConfigurationStore,name=TargetConfigStore State changed from starting to running
894 [main] DEBUG org.apache.geronimo.gbean.runtime.GBeanInstanceState  - GBeanInstanceState for: geronimo/packaging/fixed/car?j2eeType=ArtifactManager,name=ArtifactManager State changed from stopped to starting
894 [main] DEBUG org.apache.geronimo.gbean.runtime.GBeanInstanceState  - GBeanInstanceState for: geronimo/packaging/fixed/car?j2eeType=ArtifactManager,name=ArtifactManager State changed from starting to running
894 [main] DEBUG org.apache.geronimo.gbean.runtime.GBeanInstanceState  - Checking if parent is running: parent=geronimo/packaging/fixed/car?configurationName=geronimo/packaging/fixed/car
894 [main] DEBUG org.apache.geronimo.gbean.runtime.GBeanInstanceState  - Parent is running: parent=geronimo/packaging/fixed/car?configurationName=geronimo/packaging/fixed/car
930 [main] DEBUG org.apache.geronimo.gbean.runtime.GBeanInstanceState  - GBeanInstanceState for: geronimo/packaging/fixed/car?j2eeType=ArtifactResolver,name=ArtifactResolver State changed from starting to running
930 [main] DEBUG org.apache.geronimo.gbean.runtime.GBeanInstanceState  - GBeanInstanceState for: geronimo/packaging/fixed/car?j2eeType=ConfigurationManager,name=ConfigManager State changed from stopped to starting
996 [main] DEBUG org.apache.geronimo.gbean.runtime.GBeanSingleReference  - Waiting to start geronimo/packaging/fixed/car?j2eeType=ConfigurationManager,name=ConfigManager because no targets are running for reference AttributeStore matching the patterns geronimo/packaging/fixed/car?j2eeType=GBean,name=AttributeStore
998 [main] DEBUG org.apache.geronimo.gbean.runtime.GBeanInstanceState  - Checking if parent is running: parent=geronimo/packaging/fixed/car?configurationName=geronimo/packaging/fixed/car
998 [main] DEBUG org.apache.geronimo.gbean.runtime.GBeanInstanceState  - Parent is running: parent=geronimo/packaging/fixed/car?configurationName=geronimo/packaging/fixed/car
998 [main] DEBUG org.apache.geronimo.gbean.runtime.GBeanInstanceState  - Checking if parent is running: parent=geronimo/packaging/fixed/car?j2eeType=ArtifactResolver,name=ArtifactResolver
998 [main] DEBUG org.apache.geronimo.gbean.runtime.GBeanInstanceState  - Parent is running: parent=geronimo/packaging/fixed/car?j2eeType=ArtifactResolver,name=ArtifactResolver
998 [main] DEBUG org.apache.geronimo.gbean.runtime.GBeanSingleReference  - Waiting to start geronimo/packaging/fixed/car?j2eeType=ConfigurationManager,name=ConfigManager because no targets are running for reference AttributeStore matching the patterns geronimo/packaging/fixed/car?j2eeType=GBean,name=AttributeStore
998 [main] DEBUG org.apache.geronimo.gbean.runtime.GBeanInstanceState  - GBeanInstanceState for: geronimo/packaging/fixed/car?j2eeType=Repository,name=SourceRepository State changed from stopped to starting
998 [main] DEBUG org.apache.geronimo.system.repository.AbstractRepository  - Repository root is /home/continuum/.geronimo-1.1-maven/repository
998 [main] DEBUG org.apache.geronimo.gbean.runtime.GBeanInstanceState  - GBeanInstanceState for: geronimo/packaging/fixed/car?j2eeType=Repository,name=SourceRepository State changed from starting to running
999 [main] DEBUG org.apache.geronimo.gbean.runtime.GBeanInstanceState  - Checking if parent is running: parent=geronimo/packaging/fixed/car?configurationName=geronimo/packaging/fixed/car
999 [main] DEBUG org.apache.geronimo.gbean.runtime.GBeanInstanceState  - Parent is running: parent=geronimo/packaging/fixed/car?configurationName=geronimo/packaging/fixed/car
1000 [main] DEBUG org.apache.geronimo.gbean.runtime.GBeanInstanceState  - GBeanInstanceState for: geronimo/packaging/fixed/car?j2eeType=ConfigurationStore,name=ConfigStore State changed from starting to running
1004 [main] DEBUG org.apache.geronimo.gbean.runtime.GBeanInstanceState  - GBeanInstanceState for: geronimo/packaging/fixed/car?j2eeType=GBean,name=AttributeStore State changed from stopped to starting
1004 [main] DEBUG org.apache.geronimo.gbean.runtime.GBeanInstanceState  - GBeanInstanceState for: geronimo/packaging/fixed/car?j2eeType=GBean,name=AttributeStore State changed from starting to running
1004 [main] DEBUG org.apache.geronimo.gbean.runtime.GBeanInstanceState  - Checking if parent is running: parent=geronimo/packaging/fixed/car?configurationName=geronimo/packaging/fixed/car
1004 [main] DEBUG org.apache.geronimo.gbean.runtime.GBeanInstanceState  - Parent is running: parent=geronimo/packaging/fixed/car?configurationName=geronimo/packaging/fixed/car
1004 [main] DEBUG org.apache.geronimo.gbean.runtime.GBeanInstanceState  - Checking if parent is running: parent=geronimo/packaging/fixed/car?j2eeType=ArtifactResolver,name=ArtifactResolver
1004 [main] DEBUG org.apache.geronimo.gbean.runtime.GBeanInstanceState  - Parent is running: parent=geronimo/packaging/fixed/car?j2eeType=ArtifactResolver,name=ArtifactResolver
1004 [main] DEBUG org.apache.geronimo.gbean.runtime.GBeanInstanceState  - Checking if parent is running: parent=geronimo/packaging/fixed/car?j2eeType=ArtifactManager,name=ArtifactManager
1004 [main] DEBUG org.apache.geronimo.gbean.runtime.GBeanInstanceState  - Parent is running: parent=geronimo/packaging/fixed/car?j2eeType=ArtifactManager,name=ArtifactManager
1063 [main] DEBUG org.apache.geronimo.gbean.runtime.GBeanInstanceState  - GBeanInstanceState for: geronimo/packaging/fixed/car?j2eeType=ConfigurationManager,name=ConfigManager State changed from starting to running
1171 [main] DEBUG org.apache.geronimo.gbean.runtime.GBeanInstanceState  - GBeanInstanceState for: geronimo/geronimo-gbean-deployer/1.1-SNAPSHOT/car?configurationName=geronimo/geronimo-gbean-deployer/1.1-SNAPSHOT/car State changed from stopped to starting
1182 [main] DEBUG org.apache.geronimo.kernel.config.Configuration  - ClassPath for geronimo/geronimo-gbean-deployer/1.1-SNAPSHOT/car resolved to [file:/home/continuum/.geronimo-1.1-maven/repository/geronimo/jars/geronimo-system-1.1-SNAPSHOT.jar, file:/home/continuum/.geronimo-1.1-maven/repository/geronimo/jars/geronimo-common-1.1-SNAPSHOT.jar, file:/home/continuum/.geronimo-1.1-maven/repository/geronimo/jars/geronimo-deployment-1.1-SNAPSHOT.jar, file:/home/continuum/.geronimo-1.1-maven/repository/geronimo/jars/geronimo-j2ee-1.1-SNAPSHOT.jar, file:/home/continuum/.geronimo-1.1-maven/repository/geronimo/jars/geronimo-management-1.1-SNAPSHOT.jar, file:/home/continuum/.geronimo-1.1-maven/repository/geronimo/jars/geronimo-service-builder-1.1-SNAPSHOT.jar, file:/home/continuum/.geronimo-1.1-maven/repository/xmlbeans/jars/xbean-2.0.0.jar, file:/home/continuum/.geronimo-1.1-maven/repository/stax/jars/stax-api-1.0.jar, file:/home/continuum/.geronimo-1.1-maven/repository/xstream/jars/xstream-1.1.3.jar, file:/home/continuum/.geronimo-1.1-maven/repository/xpp3/jars/xpp3-1.1.3.3.jar]
1224 [main] DEBUG org.apache.geronimo.kernel.config.Configuration  - Started configuration geronimo/geronimo-gbean-deployer/1.1-SNAPSHOT/car
1224 [main] DEBUG org.apache.geronimo.gbean.runtime.GBeanInstanceState  - GBeanInstanceState for: geronimo/geronimo-gbean-deployer/1.1-SNAPSHOT/car?configurationName=geronimo/geronimo-gbean-deployer/1.1-SNAPSHOT/car State changed from starting to running
1225 [main] DEBUG org.apache.geronimo.kernel.config.SimpleConfigurationManager  - Loaded Configuration geronimo/geronimo-gbean-deployer/1.1-SNAPSHOT/car?configurationName=geronimo/geronimo-gbean-deployer/1.1-SNAPSHOT/car
1269 [main] DEBUG org.apache.geronimo.gbean.runtime.GBeanInstanceState  - GBeanInstanceState for: geronimo/geronimo-gbean-deployer/1.1-SNAPSHOT/car?ServiceModule=geronimo/geronimo-gbean-deployer/1.1-SNAPSHOT/car,j2eeType=Deployer,name=Deployer State changed from stopped to starting
Generated package /home/continuum/continuum-1.0.2/apps/continuum/work/68/configs/j2ee-system/target/j2ee-system-1.1-SNAPSHOT.car

car:install:
    [echo] Installing...
Uploading to geronimo/cars/j2ee-system-1.1-SNAPSHOT.car: 
.................... (7K)
Uploading to geronimo/poms/j2ee-system-1.1-SNAPSHOT.pom: 
.................... (14K)
    [echo] about to copy configs
    [echo] done copying configs

+----------------------------------------
| configurations RMI/Naming configuration
| Memory: 38M/67M
+----------------------------------------
DEPRECATED: the default goal should be specified in the <build> section of project.xml instead of maven.xml
DEPRECATED: the default goal should be specified in the <build> section of project.xml instead of maven.xml

build:end:

Attempting to download j2ee-system-1.1-SNAPSHOT.car.
Attempting to download geronimo-activation-1.1-SNAPSHOT.jar.
Attempting to download geronimo-jmxremoting-1.1-SNAPSHOT.jar.
Attempting to download activemq-gbean-management-3.2.4-SNAPSHOT.jar.
build:start:

multiproject:install-callback:
    [echo] Running car:install for RMI/Naming configuration
car:prepare-plan:

car:package:
    [delete] Deleting directory /home/continuum/continuum-1.0.2/apps/continuum/work/68/configs/rmi-naming/target/repository
    [mkdir] Created dir: /home/continuum/continuum-1.0.2/apps/continuum/work/68/configs/rmi-naming/target/repository

    Packaging configuration /home/continuum/continuum-1.0.2/apps/continuum/work/68/configs/rmi-naming/target/plan/plan.xml

Generated package /home/continuum/continuum-1.0.2/apps/continuum/work/68/configs/rmi-naming/target/rmi-naming-1.1-SNAPSHOT.car

car:install:
    [echo] Installing...
    [echo] about to copy configs
    [echo] done copying configs

+----------------------------------------
| configurations Server Configuration for the J2EE Server
| Memory: 39M/67M
+----------------------------------------
DEPRECATED: the default goal should be specified in the <build> section of project.xml instead of maven.xml
DEPRECATED: the default goal should be specified in the <build> section of project.xml instead of maven.xml

build:end:

Attempting to download rmi-naming-1.1-SNAPSHOT.car.
build:start:

multiproject:install-callback:
    [echo] Running car:install for Server Configuration for the J2EE Server
car:prepare-plan:

car:package:
    [delete] Deleting directory /home/continuum/continuum-1.0.2/apps/continuum/work/68/configs/j2ee-server/target/repository
    [mkdir] Created dir: /home/continuum/continuum-1.0.2/apps/continuum/work/68/configs/j2ee-server/target/repository

    Packaging configuration /home/continuum/continuum-1.0.2/apps/continuum/work/68/configs/j2ee-server/target/plan/plan.xml

Generated package /home/continuum/continuum-1.0.2/apps/continuum/work/68/configs/j2ee-server/target/j2ee-server-1.1-SNAPSHOT.car

car:install:
    [echo] Installing...
    [echo] about to copy configs
    [echo] done copying configs

+----------------------------------------
| configurations System Configuration for the J2EE Client
| Memory: 44M/67M
+----------------------------------------
DEPRECATED: the default goal should be specified in the <build> section of project.xml instead of maven.xml
DEPRECATED: the default goal should be specified in the <build> section of project.xml instead of maven.xml

build:end:

build:start:

multiproject:install-callback:
    [echo] Running car:install for System Configuration for the J2EE Client
car:prepare-plan:

car:package:
    [delete] Deleting directory /home/continuum/continuum-1.0.2/apps/continuum/work/68/configs/client-system/target/repository
    [mkdir] Created dir: /home/continuum/continuum-1.0.2/apps/continuum/work/68/configs/client-system/target/repository

    Packaging configuration /home/continuum/continuum-1.0.2/apps/continuum/work/68/configs/client-system/target/plan/plan.xml

Generated package /home/continuum/continuum-1.0.2/apps/continuum/work/68/configs/client-system/target/client-system-1.1-SNAPSHOT.car

car:install:
    [echo] Installing...
Uploading to geronimo/cars/client-system-1.1-SNAPSHOT.car: 
.................... (7K)
Uploading to geronimo/poms/client-system-1.1-SNAPSHOT.pom: 
.................... (13K)
    [echo] about to copy configs
    [echo] done copying configs

+----------------------------------------
| configurations Configuration for the J2EE Client
| Memory: 48M/67M
+----------------------------------------
DEPRECATED: the default goal should be specified in the <build> section of project.xml instead of maven.xml
DEPRECATED: the default goal should be specified in the <build> section of project.xml instead of maven.xml

build:end:

Attempting to download client-system-1.1-SNAPSHOT.car.
build:start:

multiproject:install-callback:
    [echo] Running car:install for Configuration for the J2EE Client
car:prepare-plan:

car:package:
    [delete] Deleting directory /home/continuum/continuum-1.0.2/apps/continuum/work/68/configs/client/target/repository
    [mkdir] Created dir: /home/continuum/continuum-1.0.2/apps/continuum/work/68/configs/client/target/repository

    Packaging configuration /home/continuum/continuum-1.0.2/apps/continuum/work/68/configs/client/target/plan/plan.xml

Generated package /home/continuum/continuum-1.0.2/apps/continuum/work/68/configs/client/target/client-1.1-SNAPSHOT.car

car:install:
    [echo] Installing...
    [echo] about to copy configs
    [echo] done copying configs

+----------------------------------------
| configurations Configuration for performing J2EE deployments
| Memory: 51M/67M
+----------------------------------------
DEPRECATED: the default goal should be specified in the <build> section of project.xml instead of maven.xml
DEPRECATED: the default goal should be specified in the <build> section of project.xml instead of maven.xml

build:end:

Attempting to download j2ee-server-1.1-SNAPSHOT.car.
Attempting to download client-1.1-SNAPSHOT.car.
build:start:

multiproject:install-callback:
    [echo] Running car:install for Configuration for performing J2EE deployments
car:prepare-plan:

car:package:
    [delete] Deleting directory /home/continuum/continuum-1.0.2/apps/continuum/work/68/configs/j2ee-deployer/target/repository
    [mkdir] Created dir: /home/continuum/continuum-1.0.2/apps/continuum/work/68/configs/j2ee-deployer/target/repository

    Packaging configuration /home/continuum/continuum-1.0.2/apps/continuum/work/68/configs/j2ee-deployer/target/plan/plan.xml

Generated package /home/continuum/continuum-1.0.2/apps/continuum/work/68/configs/j2ee-deployer/target/j2ee-deployer-1.1-SNAPSHOT.car

car:install:
    [echo] Installing...
    [echo] about to copy configs
    [echo] done copying configs

+----------------------------------------
| configurations Configuration for application client deployments
| Memory: 40M/67M
+----------------------------------------
DEPRECATED: the default goal should be specified in the <build> section of project.xml instead of maven.xml
DEPRECATED: the default goal should be specified in the <build> section of project.xml instead of maven.xml

build:end:

Attempting to download j2ee-deployer-1.1-SNAPSHOT.car.
build:start:

multiproject:install-callback:
    [echo] Running car:install for Configuration for application client deployments
car:prepare-plan:

car:package:
    [delete] Deleting directory /home/continuum/continuum-1.0.2/apps/continuum/work/68/configs/client-deployer/target/repository
    [mkdir] Created dir: /home/continuum/continuum-1.0.2/apps/continuum/work/68/configs/client-deployer/target/repository

    Packaging configuration /home/continuum/continuum-1.0.2/apps/continuum/work/68/configs/client-deployer/target/plan/plan.xml

Generated package /home/continuum/continuum-1.0.2/apps/continuum/work/68/configs/client-deployer/target/client-deployer-1.1-SNAPSHOT.car

car:install:
    [echo] Installing...
    [echo] about to copy configs
    [echo] done copying configs

+----------------------------------------
| configurations Axis Configuration for the J2EE Server
| Memory: 41M/67M
+----------------------------------------
DEPRECATED: the default goal should be specified in the <build> section of project.xml instead of maven.xml
DEPRECATED: the default goal should be specified in the <build> section of project.xml instead of maven.xml

build:end:

build:start:

multiproject:install-callback:
    [echo] Running car:install for Axis Configuration for the J2EE Server
car:prepare-plan:

car:package:
    [delete] Deleting directory /home/continuum/continuum-1.0.2/apps/continuum/work/68/configs/axis/target/repository
    [mkdir] Created dir: /home/continuum/continuum-1.0.2/apps/continuum/work/68/configs/axis/target/repository

    Packaging configuration /home/continuum/continuum-1.0.2/apps/continuum/work/68/configs/axis/target/plan/plan.xml

Generated package /home/continuum/continuum-1.0.2/apps/continuum/work/68/configs/axis/target/axis-1.1-SNAPSHOT.car

car:install:
    [echo] Installing...
    [echo] about to copy configs
    [echo] done copying configs

+----------------------------------------
| configurations openejb Configuration for the J2EE Server
| Memory: 46M/67M
+----------------------------------------
DEPRECATED: the default goal should be specified in the <build> section of project.xml instead of maven.xml
DEPRECATED: the default goal should be specified in the <build> section of project.xml instead of maven.xml

build:end:

Attempting to download axis-1.1-SNAPSHOT.car.
build:start:

multiproject:install-callback:
    [echo] Running car:install for openejb Configuration for the J2EE Server
car:prepare-plan:

car:package:
    [delete] Deleting directory /home/continuum/continuum-1.0.2/apps/continuum/work/68/configs/openejb/target/repository
    [mkdir] Created dir: /home/continuum/continuum-1.0.2/apps/continuum/work/68/configs/openejb/target/repository

    Packaging configuration /home/continuum/continuum-1.0.2/apps/continuum/work/68/configs/openejb/target/plan/plan.xml

Generated package /home/continuum/continuum-1.0.2/apps/continuum/work/68/configs/openejb/target/openejb-1.1-SNAPSHOT.car

car:install:
    [echo] Installing...
    [echo] about to copy configs
    [echo] done copying configs

+----------------------------------------
| configurations openejb Configuration for performing J2EE deployments
| Memory: 46M/67M
+----------------------------------------
DEPRECATED: the default goal should be specified in the <build> section of project.xml instead of maven.xml
DEPRECATED: the default goal should be specified in the <build> section of project.xml instead of maven.xml

build:end:

Attempting to download openejb-1.1-SNAPSHOT.car.
build:start:

multiproject:install-callback:
    [echo] Running car:install for openejb Configuration for performing J2EE deployments
car:prepare-plan:

car:package:
    [delete] Deleting directory /home/continuum/continuum-1.0.2/apps/continuum/work/68/configs/openejb-deployer/target/repository
    [mkdir] Created dir: /home/continuum/continuum-1.0.2/apps/continuum/work/68/configs/openejb-deployer/target/repository

    Packaging configuration /home/continuum/continuum-1.0.2/apps/continuum/work/68/configs/openejb-deployer/target/plan/plan.xml

Generated package /home/continuum/continuum-1.0.2/apps/continuum/work/68/configs/openejb-deployer/target/openejb-deployer-1.1-SNAPSHOT.car

car:install:
    [echo] Installing...
    [echo] about to copy configs
    [echo] done copying configs

+----------------------------------------
| configurations Axis Configuration for performing J2EE deployments
| Memory: 52M/67M
+----------------------------------------
DEPRECATED: the default goal should be specified in the <build> section of project.xml instead of maven.xml
DEPRECATED: the default goal should be specified in the <build> section of project.xml instead of maven.xml

build:end:

build:start:

multiproject:install-callback:
    [echo] Running car:install for Axis Configuration for performing J2EE deployments
car:prepare-plan:

car:package:
    [delete] Deleting directory /home/continuum/continuum-1.0.2/apps/continuum/work/68/configs/axis-deployer/target/repository
    [mkdir] Created dir: /home/continuum/continuum-1.0.2/apps/continuum/work/68/configs/axis-deployer/target/repository

    Packaging configuration /home/continuum/continuum-1.0.2/apps/continuum/work/68/configs/axis-deployer/target/plan/plan.xml

Generated package /home/continuum/continuum-1.0.2/apps/continuum/work/68/configs/axis-deployer/target/axis-deployer-1.1-SNAPSHOT.car

car:install:
    [echo] Installing...
    [echo] about to copy configs
    [echo] done copying configs

+----------------------------------------
| configurations System Database Configuration for the J2EE Server
| Memory: 54M/67M
+----------------------------------------
DEPRECATED: the default goal should be specified in the <build> section of project.xml instead of maven.xml
DEPRECATED: the default goal should be specified in the <build> section of project.xml instead of maven.xml

build:end:

Attempting to download client-deployer-1.1-SNAPSHOT.car.
Attempting to download openejb-deployer-1.1-SNAPSHOT.car.
Attempting to download axis-deployer-1.1-SNAPSHOT.car.
build:start:

multiproject:install-callback:
    [echo] Running car:install for System Database Configuration for the J2EE Server
car:prepare-plan:

car:package:
    [delete] Deleting directory /home/continuum/continuum-1.0.2/apps/continuum/work/68/configs/system-database/target/repository
    [mkdir] Created dir: /home/continuum/continuum-1.0.2/apps/continuum/work/68/configs/system-database/target/repository

    Packaging configuration /home/continuum/continuum-1.0.2/apps/continuum/work/68/configs/system-database/target/plan/plan.xml

Generated package /home/continuum/continuum-1.0.2/apps/continuum/work/68/configs/system-database/target/system-database-1.1-SNAPSHOT.car

car:install:
    [echo] Installing...
    [echo] about to copy configs
    [echo] done copying configs

+----------------------------------------
| configurations ActiveMQ broker configuration
| Memory: 43M/68M
+----------------------------------------
DEPRECATED: the default goal should be specified in the <build> section of project.xml instead of maven.xml
DEPRECATED: the default goal should be specified in the <build> section of project.xml instead of maven.xml

build:end:

Attempting to download system-database-1.1-SNAPSHOT.car.
Attempting to download activemq-gbean-g1_1-3.2.4-SNAPSHOT.jar.
Attempting to download activemq-gbean-management-g1_1-3.2.4-SNAPSHOT.jar.
build:start:

multiproject:install-callback:
    [echo] Running car:install for ActiveMQ broker configuration
car:prepare-plan:

car:package:
    [delete] Deleting directory /home/continuum/continuum-1.0.2/apps/continuum/work/68/configs/activemq-broker/target/repository
    [mkdir] Created dir: /home/continuum/continuum-1.0.2/apps/continuum/work/68/configs/activemq-broker/target/repository

    Packaging configuration /home/continuum/continuum-1.0.2/apps/continuum/work/68/configs/activemq-broker/target/plan/plan.xml

Generated package /home/continuum/continuum-1.0.2/apps/continuum/work/68/configs/activemq-broker/target/activemq-broker-1.1-SNAPSHOT.car

car:install:
    [echo] Installing...
    [echo] about to copy configs
    [echo] done copying configs

+----------------------------------------
| configurations Activemq configuration
| Memory: 44M/68M
+----------------------------------------
DEPRECATED: the default goal should be specified in the <build> section of project.xml instead of maven.xml
DEPRECATED: the default goal should be specified in the <build> section of project.xml instead of maven.xml

build:end:

Attempting to download activemq-broker-1.1-SNAPSHOT.car.
Attempting to download activemq-ra-3.2.4-SNAPSHOT.rar.
build:start:

multiproject:install-callback:
    [echo] Running car:install for Activemq configuration
car:prepare-plan:

car:package:
    [delete] Deleting directory /home/continuum/continuum-1.0.2/apps/continuum/work/68/configs/activemq/target/repository
    [mkdir] Created dir: /home/continuum/continuum-1.0.2/apps/continuum/work/68/configs/activemq/target/repository

    Packaging configuration /home/continuum/continuum-1.0.2/apps/continuum/work/68/configs/activemq/target/plan/plan.xml

Generated package /home/continuum/continuum-1.0.2/apps/continuum/work/68/configs/activemq/target/activemq-1.1-SNAPSHOT.car

car:install:
    [echo] Installing...
    [echo] about to copy configs
    [echo] done copying configs

+----------------------------------------
| configurations Corba Configuration for the J2EE Client
| Memory: 49M/68M
+----------------------------------------
DEPRECATED: the default goal should be specified in the <build> section of project.xml instead of maven.xml
DEPRECATED: the default goal should be specified in the <build> section of project.xml instead of maven.xml

build:end:

build:start:

multiproject:install-callback:
    [echo] Running car:install for Corba Configuration for the J2EE Client
car:prepare-plan:

car:package:
    [delete] Deleting directory /home/continuum/continuum-1.0.2/apps/continuum/work/68/configs/client-corba/target/repository
    [mkdir] Created dir: /home/continuum/continuum-1.0.2/apps/continuum/work/68/configs/client-corba/target/repository

    Packaging configuration /home/continuum/continuum-1.0.2/apps/continuum/work/68/configs/client-corba/target/plan/plan.xml

Generated package /home/continuum/continuum-1.0.2/apps/continuum/work/68/configs/client-corba/target/client-corba-1.1-SNAPSHOT.car

car:install:
    [echo] Installing...
    [echo] about to copy configs
    [echo] done copying configs

+----------------------------------------
| configurations Security Configuration for the J2EE Client
| Memory: 52M/68M
+----------------------------------------
DEPRECATED: the default goal should be specified in the <build> section of project.xml instead of maven.xml
DEPRECATED: the default goal should be specified in the <build> section of project.xml instead of maven.xml

build:end:

build:start:

multiproject:install-callback:
    [echo] Running car:install for Security Configuration for the J2EE Client
car:prepare-plan:

car:package:
    [delete] Deleting directory /home/continuum/continuum-1.0.2/apps/continuum/work/68/configs/client-security/target/repository
    [mkdir] Created dir: /home/continuum/continuum-1.0.2/apps/continuum/work/68/configs/client-security/target/repository

    Packaging configuration /home/continuum/continuum-1.0.2/apps/continuum/work/68/configs/client-security/target/plan/plan.xml

Generated package /home/continuum/continuum-1.0.2/apps/continuum/work/68/configs/client-security/target/client-security-1.1-SNAPSHOT.car

car:install:
    [echo] Installing...
    [echo] about to copy configs
    [echo] done copying configs

+----------------------------------------
| configurations Security Configuration for the J2EE Server
| Memory: 54M/68M
+----------------------------------------
DEPRECATED: the default goal should be specified in the <build> section of project.xml instead of maven.xml
DEPRECATED: the default goal should be specified in the <build> section of project.xml instead of maven.xml

build:end:

build:start:

multiproject:install-callback:
    [echo] Running car:install for Security Configuration for the J2EE Server
car:prepare-plan:

car:package:
    [delete] Deleting directory /home/continuum/continuum-1.0.2/apps/continuum/work/68/configs/j2ee-security/target/repository
    [mkdir] Created dir: /home/continuum/continuum-1.0.2/apps/continuum/work/68/configs/j2ee-security/target/repository

    Packaging configuration /home/continuum/continuum-1.0.2/apps/continuum/work/68/configs/j2ee-security/target/plan/plan.xml

Generated package /home/continuum/continuum-1.0.2/apps/continuum/work/68/configs/j2ee-security/target/j2ee-security-1.1-SNAPSHOT.car

car:install:
    [echo] Installing...
    [echo] about to copy configs
    [echo] done copying configs

+----------------------------------------
| configurations Jetty Configuration for the J2EE Server
| Memory: 56M/68M
+----------------------------------------
DEPRECATED: the default goal should be specified in the <build> section of project.xml instead of maven.xml
DEPRECATED: the default goal should be specified in the <build> section of project.xml instead of maven.xml

build:end:

Attempting to download j2ee-security-1.1-SNAPSHOT.car.
build:start:

multiproject:install-callback:
    [echo] Running car:install for Jetty Configuration for the J2EE Server
car:prepare-plan:

car:package:
    [delete] Deleting directory /home/continuum/continuum-1.0.2/apps/continuum/work/68/configs/jetty/target/repository
    [mkdir] Created dir: /home/continuum/continuum-1.0.2/apps/continuum/work/68/configs/jetty/target/repository

    Packaging configuration /home/continuum/continuum-1.0.2/apps/continuum/work/68/configs/jetty/target/plan/plan.xml

Generated package /home/continuum/continuum-1.0.2/apps/continuum/work/68/configs/jetty/target/jetty-1.1-SNAPSHOT.car

car:install:
    [echo] Installing...
    [echo] about to copy configs
    [echo] done copying configs

+----------------------------------------
| configurations Jetty Deployer Configuration for the J2EE Server
| Memory: 59M/68M
+----------------------------------------
DEPRECATED: the default goal should be specified in the <build> section of project.xml instead of maven.xml
DEPRECATED: the default goal should be specified in the <build> section of project.xml instead of maven.xml

build:end:

Attempting to download jetty-1.1-SNAPSHOT.car.
build:start:

multiproject:install-callback:
    [echo] Running car:install for Jetty Deployer Configuration for the J2EE Server
car:prepare-plan:

car:package:
    [delete] Deleting directory /home/continuum/continuum-1.0.2/apps/continuum/work/68/configs/jetty-deployer/target/repository
    [mkdir] Created dir: /home/continuum/continuum-1.0.2/apps/continuum/work/68/configs/jetty-deployer/target/repository

    Packaging configuration /home/continuum/continuum-1.0.2/apps/continuum/work/68/configs/jetty-deployer/target/plan/plan.xml

Generated package /home/continuum/continuum-1.0.2/apps/continuum/work/68/configs/jetty-deployer/target/jetty-deployer-1.1-SNAPSHOT.car

car:install:
    [echo] Installing...
    [echo] about to copy configs
    [echo] done copying configs

+----------------------------------------
| configurations Web console deployed on jetty
| Memory: 37M/68M
+----------------------------------------
DEPRECATED: the default goal should be specified in the <build> section of project.xml instead of maven.xml
DEPRECATED: the default goal should be specified in the <build> section of project.xml instead of maven.xml

build:end:

Attempting to download jetty-deployer-1.1-SNAPSHOT.car.
Attempting to download activemq-gbean-3.2.4-SNAPSHOT.jar.
build:start:

multiproject:install-callback:
    [echo] Running car:install for Web console deployed on jetty
car:prepare-plan:

car:package:
    [delete] Deleting directory /home/continuum/continuum-1.0.2/apps/continuum/work/68/configs/console-jetty/target/repository
    [mkdir] Created dir: /home/continuum/continuum-1.0.2/apps/continuum/work/68/configs/console-jetty/target/repository

    Packaging configuration /home/continuum/continuum-1.0.2/apps/continuum/work/68/configs/console-jetty/target/plan/plan.xml

Generated package /home/continuum/continuum-1.0.2/apps/continuum/work/68/configs/console-jetty/target/webconsole-jetty-1.1-SNAPSHOT.car

car:install:
    [echo] Installing...
    [echo] about to copy configs
    [echo] done copying configs

+----------------------------------------
| configurations Tomcat Configuration for the J2EE Server
| Memory: 44M/76M
+----------------------------------------
DEPRECATED: the default goal should be specified in the <build> section of project.xml instead of maven.xml
DEPRECATED: the default goal should be specified in the <build> section of project.xml instead of maven.xml

build:end:

build:start:

multiproject:install-callback:
    [echo] Running car:install for Tomcat Configuration for the J2EE Server
car:prepare-plan:

car:package:
    [delete] Deleting directory /home/continuum/continuum-1.0.2/apps/continuum/work/68/configs/tomcat/target/repository
    [mkdir] Created dir: /home/continuum/continuum-1.0.2/apps/continuum/work/68/configs/tomcat/target/repository

    Packaging configuration /home/continuum/continuum-1.0.2/apps/continuum/work/68/configs/tomcat/target/plan/plan.xml

Generated package /home/continuum/continuum-1.0.2/apps/continuum/work/68/configs/tomcat/target/tomcat-1.1-SNAPSHOT.car

car:install:
    [echo] Installing...
    [echo] about to copy configs
    [echo] done copying configs

+----------------------------------------
| configurations Tomcat Deployer Configuration for the J2EE Server
| Memory: 49M/76M
+----------------------------------------
DEPRECATED: the default goal should be specified in the <build> section of project.xml instead of maven.xml
DEPRECATED: the default goal should be specified in the <build> section of project.xml instead of maven.xml

build:end:

Attempting to download tomcat-1.1-SNAPSHOT.car.
build:start:

multiproject:install-callback:
    [echo] Running car:install for Tomcat Deployer Configuration for the J2EE Server
car:prepare-plan:

car:package:
    [delete] Deleting directory /home/continuum/continuum-1.0.2/apps/continuum/work/68/configs/tomcat-deployer/target/repository
    [mkdir] Created dir: /home/continuum/continuum-1.0.2/apps/continuum/work/68/configs/tomcat-deployer/target/repository

    Packaging configuration /home/continuum/continuum-1.0.2/apps/continuum/work/68/configs/tomcat-deployer/target/plan/plan.xml

Generated package /home/continuum/continuum-1.0.2/apps/continuum/work/68/configs/tomcat-deployer/target/tomcat-deployer-1.1-SNAPSHOT.car

car:install:
    [echo] Installing...
    [echo] about to copy configs
    [echo] done copying configs

+----------------------------------------
| configurations Web console deployed on tomcat
| Memory: 53M/76M
+----------------------------------------
DEPRECATED: the default goal should be specified in the <build> section of project.xml instead of maven.xml
DEPRECATED: the default goal should be specified in the <build> section of project.xml instead of maven.xml

build:end:

Attempting to download tomcat-deployer-1.1-SNAPSHOT.car.
build:start:

multiproject:install-callback:
    [echo] Running car:install for Web console deployed on tomcat
car:prepare-plan:

car:package:
    [delete] Deleting directory /home/continuum/continuum-1.0.2/apps/continuum/work/68/configs/console-tomcat/target/repository
    [mkdir] Created dir: /home/continuum/continuum-1.0.2/apps/continuum/work/68/configs/console-tomcat/target/repository

    Packaging configuration /home/continuum/continuum-1.0.2/apps/continuum/work/68/configs/console-tomcat/target/plan/plan.xml

Generated package /home/continuum/continuum-1.0.2/apps/continuum/work/68/configs/console-tomcat/target/webconsole-tomcat-1.1-SNAPSHOT.car

car:install:
    [echo] Installing...
    [echo] about to copy configs
    [echo] done copying configs

+----------------------------------------
| configurations Daytrader using derby deployed on jetty
| Memory: 57M/76M
+----------------------------------------
DEPRECATED: the default goal should be specified in the <build> section of project.xml instead of maven.xml
DEPRECATED: the default goal should be specified in the <build> section of project.xml instead of maven.xml

build:end:

Attempting to download geronimo-daytrader-derby-db-1.1-SNAPSHOT.jar.
Attempting to download daytrader-ear-1.1-SNAPSHOT.ear.
build:start:

multiproject:install-callback:
    [echo] Running car:install for Daytrader using derby deployed on jetty
car:prepare-plan:

car:package:
    [delete] Deleting directory /home/continuum/continuum-1.0.2/apps/continuum/work/68/configs/daytrader-jetty/target/repository
    [mkdir] Created dir: /home/continuum/continuum-1.0.2/apps/continuum/work/68/configs/daytrader-jetty/target/repository

    Packaging configuration /home/continuum/continuum-1.0.2/apps/continuum/work/68/configs/daytrader-jetty/target/plan/plan.xml

Retrieving document at 'WEB-INF/wsdl/TradeServices.wsdl'.
Retrieving document at 'META-INF/wsdl/TradeServices.wsdl'.
Retrieving document at 'WEB-INF/wsdl/TradeServices.wsdl'.
Generated package /home/continuum/continuum-1.0.2/apps/continuum/work/68/configs/daytrader-jetty/target/daytrader-derby-jetty-1.1-SNAPSHOT.car

car:install:
    [echo] Installing...
    [echo] about to copy configs
    [echo] done copying configs

+----------------------------------------
| configurations Daytrader using derby deployed on tomcat
| Memory: 52M/85M
+----------------------------------------
DEPRECATED: the default goal should be specified in the <build> section of project.xml instead of maven.xml
DEPRECATED: the default goal should be specified in the <build> section of project.xml instead of maven.xml

build:end:

build:start:

multiproject:install-callback:
    [echo] Running car:install for Daytrader using derby deployed on tomcat
car:prepare-plan:

car:package:
    [delete] Deleting directory /home/continuum/continuum-1.0.2/apps/continuum/work/68/configs/daytrader-tomcat/target/repository
    [mkdir] Created dir: /home/continuum/continuum-1.0.2/apps/continuum/work/68/configs/daytrader-tomcat/target/repository

    Packaging configuration /home/continuum/continuum-1.0.2/apps/continuum/work/68/configs/daytrader-tomcat/target/plan/plan.xml

Retrieving document at 'WEB-INF/wsdl/TradeServices.wsdl'.
Retrieving document at 'META-INF/wsdl/TradeServices.wsdl'.
Retrieving document at 'WEB-INF/wsdl/TradeServices.wsdl'.
Generated package /home/continuum/continuum-1.0.2/apps/continuum/work/68/configs/daytrader-tomcat/target/daytrader-derby-tomcat-1.1-SNAPSHOT.car

car:install:
    [echo] Installing...
    [echo] about to copy configs
    [echo] done copying configs

+----------------------------------------
| configurations Directory Configuration
| Memory: 70M/85M
+----------------------------------------
DEPRECATED: the default goal should be specified in the <build> section of project.xml instead of maven.xml
DEPRECATED: the default goal should be specified in the <build> section of project.xml instead of maven.xml

build:end:

Attempting to download geronimo-directory-1.1-SNAPSHOT.jar.
build:start:

multiproject:install-callback:
    [echo] Running car:install for Directory Configuration
car:prepare-plan:

car:package:
    [delete] Deleting directory /home/continuum/continuum-1.0.2/apps/continuum/work/68/configs/directory/target/repository
    [mkdir] Created dir: /home/continuum/continuum-1.0.2/apps/continuum/work/68/configs/directory/target/repository

    Packaging configuration /home/continuum/continuum-1.0.2/apps/continuum/work/68/configs/directory/target/plan/plan.xml

Generated package /home/continuum/continuum-1.0.2/apps/continuum/work/68/configs/directory/target/directory-1.1-SNAPSHOT.car

car:install:
    [echo] Installing...
    [echo] about to copy configs
    [echo] done copying configs

+----------------------------------------
| configurations Hot deployer
| Memory: 71M/85M
+----------------------------------------
DEPRECATED: the default goal should be specified in the <build> section of project.xml instead of maven.xml
DEPRECATED: the default goal should be specified in the <build> section of project.xml instead of maven.xml

build:end:

Attempting to download geronimo-hot-deploy-1.1-SNAPSHOT.jar.
build:start:

multiproject:install-callback:
    [echo] Running car:install for Hot deployer
car:prepare-plan:

car:package:
    [delete] Deleting directory /home/continuum/continuum-1.0.2/apps/continuum/work/68/configs/hot-deployer/target/repository
    [mkdir] Created dir: /home/continuum/continuum-1.0.2/apps/continuum/work/68/configs/hot-deployer/target/repository

    Packaging configuration /home/continuum/continuum-1.0.2/apps/continuum/work/68/configs/hot-deployer/target/plan/plan.xml

Generated package /home/continuum/continuum-1.0.2/apps/continuum/work/68/configs/hot-deployer/target/hot-deployer-1.1-SNAPSHOT.car

car:install:
    [echo] Installing...
    [echo] about to copy configs
    [echo] done copying configs

+----------------------------------------
| configurations Corba Configuration for the J2EE Server
| Memory: 70M/85M
+----------------------------------------
DEPRECATED: the default goal should be specified in the <build> section of project.xml instead of maven.xml
DEPRECATED: the default goal should be specified in the <build> section of project.xml instead of maven.xml

build:end:

build:start:

multiproject:install-callback:
    [echo] Running car:install for Corba Configuration for the J2EE Server
car:prepare-plan:

car:package:
    [delete] Deleting directory /home/continuum/continuum-1.0.2/apps/continuum/work/68/configs/j2ee-corba/target/repository
    [mkdir] Created dir: /home/continuum/continuum-1.0.2/apps/continuum/work/68/configs/j2ee-corba/target/repository

    Packaging configuration /home/continuum/continuum-1.0.2/apps/continuum/work/68/configs/j2ee-corba/target/plan/plan.xml

Generated package /home/continuum/continuum-1.0.2/apps/continuum/work/68/configs/j2ee-corba/target/j2ee-corba-1.1-SNAPSHOT.car

car:install:
    [echo] Installing...
    [echo] about to copy configs
    [echo] done copying configs

+----------------------------------------
| configurations JavaMail
| Memory: 46M/85M
+----------------------------------------
DEPRECATED: the default goal should be specified in the <build> section of project.xml instead of maven.xml
DEPRECATED: the default goal should be specified in the <build> section of project.xml instead of maven.xml

build:end:

Attempting to download geronimo-mail-1.1-SNAPSHOT.jar.
Attempting to download geronimo-javamail-transport-1.1-SNAPSHOT.jar.
build:start:

multiproject:install-callback:
    [echo] Running car:install for JavaMail
car:prepare-plan:

car:package:
    [delete] Deleting directory /home/continuum/continuum-1.0.2/apps/continuum/work/68/configs/javamail/target/repository
    [mkdir] Created dir: /home/continuum/continuum-1.0.2/apps/continuum/work/68/configs/javamail/target/repository

    Packaging configuration /home/continuum/continuum-1.0.2/apps/continuum/work/68/configs/javamail/target/plan/plan.xml

Generated package /home/continuum/continuum-1.0.2/apps/continuum/work/68/configs/javamail/target/javamail-1.1-SNAPSHOT.car

car:install:
    [echo] Installing...
    [echo] about to copy configs
    [echo] done copying configs

+----------------------------------------
| configurations JMX Debug app for Jetty
| Memory: 46M/85M
+----------------------------------------
DEPRECATED: the default goal should be specified in the <build> section of project.xml instead of maven.xml
DEPRECATED: the default goal should be specified in the <build> section of project.xml instead of maven.xml

build:end:

build:start:

multiproject:install-callback:
    [echo] Running car:install for JMX Debug app for Jetty
car:prepare-plan:

car:package:
    [delete] Deleting directory /home/continuum/continuum-1.0.2/apps/continuum/work/68/configs/jmxdebug-jetty/target/repository
    [mkdir] Created dir: /home/continuum/continuum-1.0.2/apps/continuum/work/68/configs/jmxdebug-jetty/target/repository

    Packaging configuration /home/continuum/continuum-1.0.2/apps/continuum/work/68/configs/jmxdebug-jetty/target/plan/plan.xml

Generated package /home/continuum/continuum-1.0.2/apps/continuum/work/68/configs/jmxdebug-jetty/target/jmxdebug-jetty-1.1-SNAPSHOT.car

car:install:
    [echo] Installing...
    [echo] about to copy configs
    [echo] done copying configs

+----------------------------------------
| configurations JMX Debug app Tomcat
| Memory: 49M/85M
+----------------------------------------
DEPRECATED: the default goal should be specified in the <build> section of project.xml instead of maven.xml
DEPRECATED: the default goal should be specified in the <build> section of project.xml instead of maven.xml

build:end:

build:start:

multiproject:install-callback:
    [echo] Running car:install for JMX Debug app Tomcat
car:prepare-plan:

car:package:
    [delete] Deleting directory /home/continuum/continuum-1.0.2/apps/continuum/work/68/configs/jmxdebug-tomcat/target/repository
    [mkdir] Created dir: /home/continuum/continuum-1.0.2/apps/continuum/work/68/configs/jmxdebug-tomcat/target/repository

    Packaging configuration /home/continuum/continuum-1.0.2/apps/continuum/work/68/configs/jmxdebug-tomcat/target/plan/plan.xml

Generated package /home/continuum/continuum-1.0.2/apps/continuum/work/68/configs/jmxdebug-tomcat/target/jmxdebug-tomcat-1.1-SNAPSHOT.car

car:install:
    [echo] Installing...
    [echo] about to copy configs
    [echo] done copying configs

+----------------------------------------
| configurations JSP Examples for Jetty
| Memory: 51M/85M
+----------------------------------------
DEPRECATED: the default goal should be specified in the <build> section of project.xml instead of maven.xml
DEPRECATED: the default goal should be specified in the <build> section of project.xml instead of maven.xml

build:end:

build:start:

multiproject:install-callback:
    [echo] Running car:install for JSP Examples for Jetty
car:prepare-plan:

car:package:
    [delete] Deleting directory /home/continuum/continuum-1.0.2/apps/continuum/work/68/configs/jsp-examples-jetty/target/repository
    [mkdir] Created dir: /home/continuum/continuum-1.0.2/apps/continuum/work/68/configs/jsp-examples-jetty/target/repository

    Packaging configuration /home/continuum/continuum-1.0.2/apps/continuum/work/68/configs/jsp-examples-jetty/target/plan/plan.xml

Generated package /home/continuum/continuum-1.0.2/apps/continuum/work/68/configs/jsp-examples-jetty/target/jsp-examples-jetty-1.1-SNAPSHOT.car

car:install:
    [echo] Installing...
    [echo] about to copy configs
    [echo] done copying configs

+----------------------------------------
| configurations JSP Examples Tomcat
| Memory: 53M/85M
+----------------------------------------
DEPRECATED: the default goal should be specified in the <build> section of project.xml instead of maven.xml
DEPRECATED: the default goal should be specified in the <build> section of project.xml instead of maven.xml

build:end:

build:start:

multiproject:install-callback:
    [echo] Running car:install for JSP Examples Tomcat
car:prepare-plan:

car:package:
    [delete] Deleting directory /home/continuum/continuum-1.0.2/apps/continuum/work/68/configs/jsp-examples-tomcat/target/repository
    [mkdir] Created dir: /home/continuum/continuum-1.0.2/apps/continuum/work/68/configs/jsp-examples-tomcat/target/repository

    Packaging configuration /home/continuum/continuum-1.0.2/apps/continuum/work/68/configs/jsp-examples-tomcat/target/plan/plan.xml

Generated package /home/continuum/continuum-1.0.2/apps/continuum/work/68/configs/jsp-examples-tomcat/target/jsp-examples-tomcat-1.1-SNAPSHOT.car

car:install:
    [echo] Installing...
    [echo] about to copy configs
    [echo] done copying configs

+----------------------------------------
| configurations LDAP security realm
| Memory: 60M/85M
+----------------------------------------
DEPRECATED: the default goal should be specified in the <build> section of project.xml instead of maven.xml
DEPRECATED: the default goal should be specified in the <build> section of project.xml instead of maven.xml

build:end:

build:start:

multiproject:install-callback:
    [echo] Running car:install for LDAP security realm
car:prepare-plan:

car:package:
    [delete] Deleting directory /home/continuum/continuum-1.0.2/apps/continuum/work/68/configs/ldap-realm/target/repository
    [mkdir] Created dir: /home/continuum/continuum-1.0.2/apps/continuum/work/68/configs/ldap-realm/target/repository

    Packaging configuration /home/continuum/continuum-1.0.2/apps/continuum/work/68/configs/ldap-realm/target/plan/plan.xml

Generated package /home/continuum/continuum-1.0.2/apps/continuum/work/68/configs/ldap-realm/target/ldap-realm-1.1-SNAPSHOT.car

car:install:
    [echo] Installing...
    [echo] about to copy configs
    [echo] done copying configs

+----------------------------------------
| configurations LDAP Demo for Jetty
| Memory: 60M/85M
+----------------------------------------
DEPRECATED: the default goal should be specified in the <build> section of project.xml instead of maven.xml
DEPRECATED: the default goal should be specified in the <build> section of project.xml instead of maven.xml

build:end:

Attempting to download ldap-realm-1.1-SNAPSHOT.car.
Attempting to download geronimo-ldap-demo-1.1-SNAPSHOT.war.
build:start:

multiproject:install-callback:
    [echo] Running car:install for LDAP Demo for Jetty
car:prepare-plan:

car:package:
    [delete] Deleting directory /home/continuum/continuum-1.0.2/apps/continuum/work/68/configs/ldap-demo-jetty/target/repository
    [mkdir] Created dir: /home/continuum/continuum-1.0.2/apps/continuum/work/68/configs/ldap-demo-jetty/target/repository

    Packaging configuration /home/continuum/continuum-1.0.2/apps/continuum/work/68/configs/ldap-demo-jetty/target/plan/plan.xml

Generated package /home/continuum/continuum-1.0.2/apps/continuum/work/68/configs/ldap-demo-jetty/target/ldap-demo-jetty-1.1-SNAPSHOT.car

car:install:
    [echo] Installing...
    [echo] about to copy configs
    [echo] done copying configs

+----------------------------------------
| configurations LDAP Demo for Tomcat
| Memory: 65M/85M
+----------------------------------------
DEPRECATED: the default goal should be specified in the <build> section of project.xml instead of maven.xml
DEPRECATED: the default goal should be specified in the <build> section of project.xml instead of maven.xml

build:end:

build:start:

multiproject:install-callback:
    [echo] Running car:install for LDAP Demo for Tomcat
car:prepare-plan:

car:package:
    [delete] Deleting directory /home/continuum/continuum-1.0.2/apps/continuum/work/68/configs/ldap-demo-tomcat/target/repository
    [mkdir] Created dir: /home/continuum/continuum-1.0.2/apps/continuum/work/68/configs/ldap-demo-tomcat/target/repository

    Packaging configuration /home/continuum/continuum-1.0.2/apps/continuum/work/68/configs/ldap-demo-tomcat/target/plan/plan.xml

Generated package /home/continuum/continuum-1.0.2/apps/continuum/work/68/configs/ldap-demo-tomcat/target/ldap-demo-tomcat-1.1-SNAPSHOT.car

car:install:
    [echo] Installing...
    [echo] about to copy configs
    [echo] done copying configs

+----------------------------------------
| configurations Online Deployer
| Memory: 68M/85M
+----------------------------------------
DEPRECATED: the default goal should be specified in the <build> section of project.xml instead of maven.xml
DEPRECATED: the default goal should be specified in the <build> section of project.xml instead of maven.xml

build:end:

build:start:

multiproject:install-callback:
    [echo] Running car:install for Online Deployer
car:prepare-plan:

car:package:
    [delete] Deleting directory /home/continuum/continuum-1.0.2/apps/continuum/work/68/configs/online-deployer/target/repository
    [mkdir] Created dir: /home/continuum/continuum-1.0.2/apps/continuum/work/68/configs/online-deployer/target/repository

    Packaging configuration /home/continuum/continuum-1.0.2/apps/continuum/work/68/configs/online-deployer/target/plan/plan.xml

Generated package /home/continuum/continuum-1.0.2/apps/continuum/work/68/configs/online-deployer/target/online-deployer-1.1-SNAPSHOT.car

car:install:
    [echo] Installing...
Uploading to geronimo/cars/online-deployer-1.1-SNAPSHOT.car: 
.................... (1K)
Uploading to geronimo/poms/online-deployer-1.1-SNAPSHOT.pom: 
.................... (12K)
    [echo] about to copy configs
    [echo] done copying configs

+----------------------------------------
| configurations Geronimo :: Remote Deploy Jetty Application
| Memory: 67M/85M
+----------------------------------------
DEPRECATED: the default goal should be specified in the <build> section of project.xml instead of maven.xml
DEPRECATED: the default goal should be specified in the <build> section of project.xml instead of maven.xml

build:end:

build:start:

multiproject:install-callback:
    [echo] Running car:install for Geronimo :: Remote Deploy Jetty Application
car:prepare-plan:

car:package:
    [delete] Deleting directory /home/continuum/continuum-1.0.2/apps/continuum/work/68/configs/remote-deploy-jetty/target/repository
    [mkdir] Created dir: /home/continuum/continuum-1.0.2/apps/continuum/work/68/configs/remote-deploy-jetty/target/repository

    Packaging configuration /home/continuum/continuum-1.0.2/apps/continuum/work/68/configs/remote-deploy-jetty/target/plan/plan.xml

Generated package /home/continuum/continuum-1.0.2/apps/continuum/work/68/configs/remote-deploy-jetty/target/remote-deploy-jetty-1.1-SNAPSHOT.car

car:install:
    [echo] Installing...
    [echo] about to copy configs
    [echo] done copying configs

+----------------------------------------
| configurations Geronimo :: Remote Deploy Tomcat Application
| Memory: 70M/85M
+----------------------------------------
DEPRECATED: the default goal should be specified in the <build> section of project.xml instead of maven.xml
DEPRECATED: the default goal should be specified in the <build> section of project.xml instead of maven.xml

build:end:

build:start:

multiproject:install-callback:
    [echo] Running car:install for Geronimo :: Remote Deploy Tomcat Application
car:prepare-plan:

car:package:
    [delete] Deleting directory /home/continuum/continuum-1.0.2/apps/continuum/work/68/configs/remote-deploy-tomcat/target/repository
    [mkdir] Created dir: /home/continuum/continuum-1.0.2/apps/continuum/work/68/configs/remote-deploy-tomcat/target/repository

    Packaging configuration /home/continuum/continuum-1.0.2/apps/continuum/work/68/configs/remote-deploy-tomcat/target/plan/plan.xml

Generated package /home/continuum/continuum-1.0.2/apps/continuum/work/68/configs/remote-deploy-tomcat/target/remote-deploy-tomcat-1.1-SNAPSHOT.car

car:install:
    [echo] Installing...
    [echo] about to copy configs
    [echo] done copying configs

+----------------------------------------
| configurations Servlet Examples for Jetty
| Memory: 74M/85M
+----------------------------------------
DEPRECATED: the default goal should be specified in the <build> section of project.xml instead of maven.xml
DEPRECATED: the default goal should be specified in the <build> section of project.xml instead of maven.xml

build:end:

build:start:

multiproject:install-callback:
    [echo] Running car:install for Servlet Examples for Jetty
car:prepare-plan:

car:package:
    [delete] Deleting directory /home/continuum/continuum-1.0.2/apps/continuum/work/68/configs/servlets-examples-jetty/target/repository
    [mkdir] Created dir: /home/continuum/continuum-1.0.2/apps/continuum/work/68/configs/servlets-examples-jetty/target/repository

    Packaging configuration /home/continuum/continuum-1.0.2/apps/continuum/work/68/configs/servlets-examples-jetty/target/plan/plan.xml

Generated package /home/continuum/continuum-1.0.2/apps/continuum/work/68/configs/servlets-examples-jetty/target/servlets-examples-jetty-1.1-SNAPSHOT.car

car:install:
    [echo] Installing...
    [echo] about to copy configs
    [echo] done copying configs

+----------------------------------------
| configurations Servlet Examples Tomcat
| Memory: 79M/85M
+----------------------------------------
DEPRECATED: the default goal should be specified in the <build> section of project.xml instead of maven.xml
DEPRECATED: the default goal should be specified in the <build> section of project.xml instead of maven.xml

build:end:

build:start:

multiproject:install-callback:
    [echo] Running car:install for Servlet Examples Tomcat
car:prepare-plan:

car:package:
    [delete] Deleting directory /home/continuum/continuum-1.0.2/apps/continuum/work/68/configs/servlets-examples-tomcat/target/repository
    [mkdir] Created dir: /home/continuum/continuum-1.0.2/apps/continuum/work/68/configs/servlets-examples-tomcat/target/repository

    Packaging configuration /home/continuum/continuum-1.0.2/apps/continuum/work/68/configs/servlets-examples-tomcat/target/plan/plan.xml

Generated package /home/continuum/continuum-1.0.2/apps/continuum/work/68/configs/servlets-examples-tomcat/target/servlets-examples-tomcat-1.1-SNAPSHOT.car

car:install:
    [echo] Installing...
    [echo] about to copy configs
    [echo] done copying configs

+----------------------------------------
| configurations Shared Library GBean
| Memory: 78M/85M
+----------------------------------------
DEPRECATED: the default goal should be specified in the <build> section of project.xml instead of maven.xml
DEPRECATED: the default goal should be specified in the <build> section of project.xml instead of maven.xml

build:end:

build:start:

multiproject:install-callback:
    [echo] Running car:install for Shared Library GBean
car:prepare-plan:

car:package:
    [delete] Deleting directory /home/continuum/continuum-1.0.2/apps/continuum/work/68/configs/sharedlib/target/repository
    [mkdir] Created dir: /home/continuum/continuum-1.0.2/apps/continuum/work/68/configs/sharedlib/target/repository

    Packaging configuration /home/continuum/continuum-1.0.2/apps/continuum/work/68/configs/sharedlib/target/plan/plan.xml

Generated package /home/continuum/continuum-1.0.2/apps/continuum/work/68/configs/sharedlib/target/sharedlib-1.1-SNAPSHOT.car

car:install:
    [echo] Installing...
    [echo] about to copy configs
    [echo] done copying configs

+----------------------------------------
| configurations Shutdown
| Memory: 47M/85M
+----------------------------------------
DEPRECATED: the default goal should be specified in the <build> section of project.xml instead of maven.xml
DEPRECATED: the default goal should be specified in the <build> section of project.xml instead of maven.xml

build:end:

build:start:

multiproject:install-callback:
    [echo] Running car:install for Shutdown
car:prepare-plan:

car:package:
    [delete] Deleting directory /home/continuum/continuum-1.0.2/apps/continuum/work/68/configs/shutdown/target/repository
    [mkdir] Created dir: /home/continuum/continuum-1.0.2/apps/continuum/work/68/configs/shutdown/target/repository

    Packaging configuration /home/continuum/continuum-1.0.2/apps/continuum/work/68/configs/shutdown/target/plan/plan.xml

Generated package /home/continuum/continuum-1.0.2/apps/continuum/work/68/configs/shutdown/target/shutdown-1.1-SNAPSHOT.car

car:install:
    [echo] Installing...
Uploading to geronimo/cars/shutdown-1.1-SNAPSHOT.car: 
.................... (1K)
Uploading to geronimo/poms/shutdown-1.1-SNAPSHOT.pom: 
.................... (11K)
    [echo] about to copy configs
    [echo] done copying configs

+----------------------------------------
| configurations UDDI server Configuration for the J2EE Jetty Server
| Memory: 50M/85M
+----------------------------------------
DEPRECATED: the default goal should be specified in the <build> section of project.xml instead of maven.xml
DEPRECATED: the default goal should be specified in the <build> section of project.xml instead of maven.xml

build:end:

Attempting to download geronimo-uddi-db-1.1-SNAPSHOT.jar.
build:start:

multiproject:install-callback:
    [echo] Running car:install for UDDI server Configuration for the J2EE Jetty Server
car:prepare-plan:

car:package:
    [delete] Deleting directory /home/continuum/continuum-1.0.2/apps/continuum/work/68/configs/uddi-jetty/target/repository
    [mkdir] Created dir: /home/continuum/continuum-1.0.2/apps/continuum/work/68/configs/uddi-jetty/target/repository

    Packaging configuration /home/continuum/continuum-1.0.2/apps/continuum/work/68/configs/uddi-jetty/target/plan/plan.xml

Generated package /home/continuum/continuum-1.0.2/apps/continuum/work/68/configs/uddi-jetty/target/uddi-jetty-1.1-SNAPSHOT.car

car:install:
    [echo] Installing...
    [echo] about to copy configs
    [echo] done copying configs

+----------------------------------------
| configurations UDDI server Configuration for the J2EE Tomcat Server
| Memory: 54M/85M
+----------------------------------------
DEPRECATED: the default goal should be specified in the <build> section of project.xml instead of maven.xml
DEPRECATED: the default goal should be specified in the <build> section of project.xml instead of maven.xml

build:end:

build:start:

multiproject:install-callback:
    [echo] Running car:install for UDDI server Configuration for the J2EE Tomcat Server
car:prepare-plan:

car:package:
    [delete] Deleting directory /home/continuum/continuum-1.0.2/apps/continuum/work/68/configs/uddi-tomcat/target/repository
    [mkdir] Created dir: /home/continuum/continuum-1.0.2/apps/continuum/work/68/configs/uddi-tomcat/target/repository

    Packaging configuration /home/continuum/continuum-1.0.2/apps/continuum/work/68/configs/uddi-tomcat/target/plan/plan.xml

Generated package /home/continuum/continuum-1.0.2/apps/continuum/work/68/configs/uddi-tomcat/target/uddi-tomcat-1.1-SNAPSHOT.car

car:install:
    [echo] Installing...
    [echo] about to copy configs
    [echo] done copying configs

+----------------------------------------
| configurations Configuration for no j2ee app clients
| Memory: 55M/85M
+----------------------------------------
DEPRECATED: the default goal should be specified in the <build> section of project.xml instead of maven.xml
DEPRECATED: the default goal should be specified in the <build> section of project.xml instead of maven.xml

build:end:

build:start:

multiproject:install-callback:
    [echo] Running car:install for Configuration for no j2ee app clients
car:prepare-plan:

car:package:
    [delete] Deleting directory /home/continuum/continuum-1.0.2/apps/continuum/work/68/configs/unavailable-client-deployer/target/repository
    [mkdir] Created dir: /home/continuum/continuum-1.0.2/apps/continuum/work/68/configs/unavailable-client-deployer/target/repository

    Packaging configuration /home/continuum/continuum-1.0.2/apps/continuum/work/68/configs/unavailable-client-deployer/target/plan/plan.xml

Generated package /home/continuum/continuum-1.0.2/apps/continuum/work/68/configs/unavailable-client-deployer/target/unavailable-client-deployer-1.1-SNAPSHOT.car

car:install:
    [echo] Installing...
    [echo] about to copy configs
    [echo] done copying configs

+----------------------------------------
| configurations Configuration for no EJBs
| Memory: 58M/85M
+----------------------------------------
DEPRECATED: the default goal should be specified in the <build> section of project.xml instead of maven.xml
DEPRECATED: the default goal should be specified in the <build> section of project.xml instead of maven.xml

build:end:

build:start:

multiproject:install-callback:
    [echo] Running car:install for Configuration for no EJBs
car:prepare-plan:

car:package:
    [delete] Deleting directory /home/continuum/continuum-1.0.2/apps/continuum/work/68/configs/unavailable-ejb-deployer/target/repository
    [mkdir] Created dir: /home/continuum/continuum-1.0.2/apps/continuum/work/68/configs/unavailable-ejb-deployer/target/repository

    Packaging configuration /home/continuum/continuum-1.0.2/apps/continuum/work/68/configs/unavailable-ejb-deployer/target/plan/plan.xml

Generated package /home/continuum/continuum-1.0.2/apps/continuum/work/68/configs/unavailable-ejb-deployer/target/unavailable-ejb-deployer-1.1-SNAPSHOT.car

car:install:
    [echo] Installing...
    [echo] about to copy configs
    [echo] done copying configs

+----------------------------------------
| configurations Unavailable Web Services deployer
| Memory: 62M/85M
+----------------------------------------
DEPRECATED: the default goal should be specified in the <build> section of project.xml instead of maven.xml
DEPRECATED: the default goal should be specified in the <build> section of project.xml instead of maven.xml

build:end:

build:start:

multiproject:install-callback:
    [echo] Running car:install for Unavailable Web Services deployer
car:prepare-plan:

car:package:
    [delete] Deleting directory /home/continuum/continuum-1.0.2/apps/continuum/work/68/configs/unavailable-webservices-deployer/target/repository
    [mkdir] Created dir: /home/continuum/continuum-1.0.2/apps/continuum/work/68/configs/unavailable-webservices-deployer/target/repository

    Packaging configuration /home/continuum/continuum-1.0.2/apps/continuum/work/68/configs/unavailable-webservices-deployer/target/plan/plan.xml

Generated package /home/continuum/continuum-1.0.2/apps/continuum/work/68/configs/unavailable-webservices-deployer/target/unavailable-webservices-deployer-1.1-SNAPSHOT.car

car:install:
    [echo] Installing...
    [echo] about to copy configs
    [echo] done copying configs

+----------------------------------------
| configurations Welcome app for Jetty
| Memory: 65M/85M
+----------------------------------------
DEPRECATED: the default goal should be specified in the <build> section of project.xml instead of maven.xml
DEPRECATED: the default goal should be specified in the <build> section of project.xml instead of maven.xml

build:end:

build:start:

multiproject:install-callback:
    [echo] Running car:install for Welcome app for Jetty
car:prepare-plan:

car:package:
    [delete] Deleting directory /home/continuum/continuum-1.0.2/apps/continuum/work/68/configs/welcome-jetty/target/repository
    [mkdir] Created dir: /home/continuum/continuum-1.0.2/apps/continuum/work/68/configs/welcome-jetty/target/repository

    Packaging configuration /home/continuum/continuum-1.0.2/apps/continuum/work/68/configs/welcome-jetty/target/plan/plan.xml

Generated package /home/continuum/continuum-1.0.2/apps/continuum/work/68/configs/welcome-jetty/target/welcome-jetty-1.1-SNAPSHOT.car

BUILD FAILED
File...... /home/continuum/continuum-1.0.2/apps/continuum/work/68/maven.xml
Element... maven:reactor
Line...... 58
Column.... -1
Unable to obtain goal [multiproject:install-callback] -- /home/continuum/continuum-1.0.2/apps/continuum/work/68/configs/welcome-jetty/maven.xml:30:-1: <velocity:merge> /home/continuum/continuum-1.0.2/apps/continuum/work/68/configs/welcome-jetty/target/repository/geronimo/welcome-jetty/1.1-SNAPSHOT/welcome-jetty-1.1-SNAPSHOT.car/META-INF/geronimo-plugin.xml (No such file or directory)
Total time   : 8 minutes 1 seconds 
Finished at  : Friday, April 21, 2006 10:26:44 PM PDT


****************************************************************************



Mime
View raw message