geronimo-scm mailing list archives

Site index · List index
Message view « Date » · « Thread »
Top « Date » · « Thread »
From continuum <contin...@stan.gbuild.org>
Subject [continuum] BUILD FAILURE: Geronimo 1.1
Date Sat, 29 Apr 2006 03:50:46 GMT
Online report : http://ci.gbuild.org/continuum/servlet/continuum/target/ProjectBuild.vm/view/ProjectBuild/id/68/buildId/2802
Build statistics:
  State: Failed
  Previous State: Ok
  Started at: Fri, 28 Apr 2006 20:43:09 -0700
  Finished at: Fri, 28 Apr 2006 20:50:44 -0700
  Total time: 7m 35s
  Build Trigger: Forced
  Exit code: 70
  Building machine hostname: stan.gbuild.org
  Operating system : Linux(unknown)
  Java version : 1.4.2_08(Sun Microsystems Inc.)

Changes
                            assemblies/minimal-tomcat-server/project.xml
            assemblies/j2ee-jetty-server/src/var/config/config.xml
            configs/j2ee-server/src/plan/plan.xml
            configs/daytrader-tomcat/project.xml
            configs/openejb/project.xml
            configs/uddi-jetty/project.xml
            configs/uddi-jetty/src/plan/plan.xml
            configs/uddi-tomcat/project.xml
            configs/uddi-tomcat/src/plan/plan.xml
            configs/daytrader-jetty/project.xml
            modules/kernel/src/java/org/apache/geronimo/gbean/GBeanInfo.java
            modules/deployment/src/test/org/apache/geronimo/deployment/SingleFileHotDeployerTest.java
            modules/deployment/src/java/org/apache/geronimo/deployment/SingleFileHotDeployer.java
            modules/deployment/src/java/org/apache/geronimo/deployment/Deployer.java
            modules/deployment/src/java/org/apache/geronimo/deployment/ModuleIDBuilder.java
            modules/deployment/src/java/org/apache/geronimo/deployment/ConfigurationBuilder.java
            modules/jetty-builder/src/test/org/apache/geronimo/jetty/deployment/JettyModuleBuilderTest.java
            modules/jetty-builder/src/java/org/apache/geronimo/jetty/deployment/JettyModuleBuilder.java
            modules/naming-builder/src/java/org/apache/geronimo/naming/deployment/ENCConfigBuilder.java
            modules/web-builder/src/java/org/apache/geronimo/web/deployment/AbstractWebModuleBuilder.java
            modules/deploy-tool/src/java/org/apache/geronimo/deployment/PluginBootstrap.java
            modules/connector-builder/src/test/org/apache/geronimo/connector/deployment/ConnectorModuleBuilderTest.java
            modules/connector-builder/src/java/org/apache/geronimo/connector/deployment/ConnectorModuleBuilder.java
            modules/webservices/project.xml
            modules/webservices/src/java/org/apache/geronimo/webservices/jaxr/JAXRGBean.java
            modules/service-builder/src/test/org/apache/geronimo/deployment/service/ServiceConfigBuilderTest.java
            modules/service-builder/src/java/org/apache/geronimo/deployment/service/EnvironmentBuilder.java
            modules/service-builder/src/java/org/apache/geronimo/deployment/service/ServiceConfigBuilder.java
            modules/client-builder/src/java/org/apache/geronimo/client/builder/AppClientModuleBuilder.java
            modules/j2ee-builder/src/test/org/apache/geronimo/j2ee/deployment/MockWARConfigBuilder.java
            modules/j2ee-builder/src/test/org/apache/geronimo/j2ee/deployment/MockConnectorConfigBuilder.java
            modules/j2ee-builder/src/test/org/apache/geronimo/j2ee/deployment/EARConfigBuilderTest.java
            modules/j2ee-builder/src/test/org/apache/geronimo/j2ee/deployment/MockEJBConfigBuilder.java
            modules/j2ee-builder/src/java/org/apache/geronimo/j2ee/deployment/UnavailableModuleBuilder.java
            modules/j2ee-builder/src/java/org/apache/geronimo/j2ee/deployment/EARConfigBuilder.java
            modules/j2ee-builder/src/java/org/apache/geronimo/j2ee/deployment/SwitchingModuleBuilder.java
            modules/j2ee-builder/src/java/org/apache/geronimo/j2ee/deployment/ModuleBuilder.java
            modules/tomcat-builder/src/test/org/apache/geronimo/tomcat/deployment/TomcatModuleBuilderTest.java
            modules/tomcat-builder/src/java/org/apache/geronimo/tomcat/deployment/TomcatModuleBuilder.java
        
****************************************************************************
Output:
****************************************************************************
 __  __
|  \/  |__ _Apache__ ___
| |\/| / _` \ V / -_) ' \  ~ intelligent projects ~
|_|  |_\__,_|\_/\___|_||_|  v. 1.1-beta-2

DEPRECATED: the default goal should be specified in the <build> section of project.xml instead of maven.xml
DEPRECATED: the default goal should be specified in the <build> section of project.xml instead of maven.xml
build:start:

m:checkout:
    [exec] U    openejb/modules/openejb-builder/maven.xml
    [exec] U    openejb/modules/openejb-builder/project.xml
    [exec] U    openejb/modules/openejb-builder/src/java/org/openejb/deployment/OpenEJBReferenceBuilder.java
    [exec] U    openejb/modules/core/src/java/org/openejb/mejb/MEJB.java
    [exec] Checked out revision 2631.
Starting the reactor...
Our processing order:

new:
new0:

Starting the reactor...
Our processing order:
new00:

Starting the reactor...
Our processing order:
Geronimo :: Activation
Geronimo :: Kernel
Geronimo :: Common
Geronimo :: Util
Geronimo :: System
Geronimo :: Deployment
Geronimo :: Deploy :: Common Config
Geronimo :: Management API
Geronimo :: Core
Geronimo :: J2EE
Geronimo :: J2EE Schema
Geronimo :: Service :: Builder
Geronimo :: Maven Dependency Plugin
Geronimo :: Naming
Geronimo :: Security
Geronimo :: Web Services
Geronimo :: Axis
Geronimo :: Test :: DDBeans
Geronimo :: Transaction
Geronimo :: Connector
Geronimo :: Security :: Builder
Geronimo :: J2EE
Geronimo :: Naming :: Builder
Geronimo :: Connector :: Builder
Geronimo :: Axis :: Builder
Geronimo :: Client
Geronimo :: Client Builder
Geronimo :: Console Web
Geronimo :: Configuration Converter
Geronimo :: Web :: Builder
Geronimo :: Deploy :: JSR-88
Geronimo :: Deploy :: CLI Tool
Geronimo :: Derby
Geronimo :: Directory
Geronimo :: Deploy :: Hot Deployer
Geronimo :: Installer Processing
Geronimo :: Installer Support
Geronimo :: JavaMail Transport
Geronimo :: Jetty
Geronimo :: Jetty :: Builder
Geronimo :: JMX Remoting
Geronimo :: Mail
Geronimo :: Scripts
Geronimo :: Timer
Geronimo :: Tomcat
Geronimo :: Tomcat :: Builder
Geronimo :: Upgrade
Geronimo :: Maven Assembly Plugin
Geronimo :: Maven Deployment Plugin
Geronimo :: IZPack Installer Build Plugin
Geronimo :: Maven Packaging Plugin
+----------------------------------------
| geronimo and geronimo-plugins Geronimo :: Activation
| Memory: 6M/8M
+----------------------------------------
DEPRECATED: the default goal should be specified in the <build> section of project.xml instead of maven.xml
new1:
Attempting to download geronimo-javamail_1.3.1_spec-1.1-SNAPSHOT.jar.
build:start:

multiproject:install-callback:
    [echo] Running jar:install for Geronimo :: Activation
java:prepare-filesystem:

java:compile:
<depend closure="false" srcdir="1.4" dump="false" destdir="/home/continuum/continuum-1.0.2/apps/continuum/work/68/modules/activation/target/classes"></depend>    [echo] Compiling to /home/continuum/continuum-1.0.2/apps/continuum/work/68/modules/activation/target/classes

java:jar-resources:

test:prepare-filesystem:

test:test-resources:

test:compile:

test:test:
    [echo] NOTICE: Skipping tests; they seem to have passed already
    [echo] No tests to run.
Running post goal: test:test

jar:jar:

jar:install:
    [echo] Installing...
Uploading to geronimo/jars/geronimo-activation-1.1-SNAPSHOT.jar: 
.................... (13K)
Uploading to geronimo/poms/geronimo-activation-1.1-SNAPSHOT.pom: 
.................... (10K)

+----------------------------------------
| geronimo and geronimo-plugins Geronimo :: Kernel
| Memory: 8M/11M
+----------------------------------------
DEPRECATED: the default goal should be specified in the <build> section of project.xml instead of maven.xml
DEPRECATED: the default goal should be specified in the <build> section of project.xml instead of maven.xml

build:end:

build:start:

multiproject:install-callback:
    [echo] Running jar:install for Geronimo :: Kernel
Tag library requested that is not present: 'xmlbeans2:maven' in plugin: 'null'
java:prepare-filesystem:

java:compile:
<depend closure="false" srcdir="1.4" dump="false" destdir="/home/continuum/continuum-1.0.2/apps/continuum/work/68/modules/kernel/target/classes"></depend>    [echo] Compiling to /home/continuum/continuum-1.0.2/apps/continuum/work/68/modules/kernel/target/classes
    [javac] Compiling 1 source file to /home/continuum/continuum-1.0.2/apps/continuum/work/68/modules/kernel/target/classes

java:jar-resources:

test:prepare-filesystem:

test:test-resources:

test:compile:

test:test:
    [junit] Running org.apache.geronimo.gbean.GBeanInfoFactoryTest
    [junit] Tests run: 4, Failures: 0, Errors: 0, Time elapsed: 0.596 sec
    [junit] Running org.apache.geronimo.gbean.GBeanInfoTest
    [junit] Tests run: 9, Failures: 0, Errors: 0, Time elapsed: 0.042 sec
    [junit] Running org.apache.geronimo.gbean.runtime.GBeanAttributeTest
    [junit] Tests run: 4, Failures: 0, Errors: 0, Time elapsed: 0.685 sec
    [junit] Running org.apache.geronimo.gbean.runtime.GBeanDependencyTest
    [junit] Tests run: 1, Failures: 0, Errors: 0, Time elapsed: 0.456 sec
    [junit] Running org.apache.geronimo.kernel.BootstrapTest
    [junit] Tests run: 1, Failures: 0, Errors: 0, Time elapsed: 0.379 sec
    [junit] Running org.apache.geronimo.kernel.ClassloadingTest
    [junit] Tests run: 10, Failures: 0, Errors: 0, Time elapsed: 0.073 sec
    [junit] Running org.apache.geronimo.kernel.ConfigTest
    [junit] Tests run: 3, Failures: 0, Errors: 0, Time elapsed: 1.828 sec
    [junit] Running org.apache.geronimo.kernel.GBeanTest
    [junit] Tests run: 18, Failures: 0, Errors: 0, Time elapsed: 1.834 sec
    [junit] Running org.apache.geronimo.kernel.SimpleGBeanTest
    [junit] Tests run: 1, Failures: 0, Errors: 0, Time elapsed: 0.964 sec
    [junit] Running org.apache.geronimo.kernel.basic.BasicProxyMapTest
    [junit] Tests run: 7, Failures: 0, Errors: 0, Time elapsed: 1.186 sec
    [junit] Running org.apache.geronimo.kernel.config.ConfigurationManagerTest
    [junit] Tests run: 8, Failures: 0, Errors: 0, Time elapsed: 1.293 sec
    [junit] Running org.apache.geronimo.kernel.config.ConfigurationModelTest
    [junit] Tests run: 4, Failures: 0, Errors: 0, Time elapsed: 0.016 sec
    [junit] Running org.apache.geronimo.kernel.config.ConfigurationUtilTest
    [junit] Tests run: 1, Failures: 0, Errors: 0, Time elapsed: 0.507 sec
    [junit] Running org.apache.geronimo.kernel.config.MultiParentClassLoaderTest
    [junit] Tests run: 14, Failures: 0, Errors: 0, Time elapsed: 0.798 sec
    [junit] Running org.apache.geronimo.kernel.management.StateTest
    [junit] Tests run: 5, Failures: 0, Errors: 0, Time elapsed: 0.008 sec
    [junit] Running org.apache.geronimo.kernel.repository.ArtifactManagerTest
    [junit] Tests run: 3, Failures: 0, Errors: 0, Time elapsed: 0.029 sec
    [junit] Running org.apache.geronimo.kernel.repository.ArtifactResolverTest
    [junit] Tests run: 4, Failures: 0, Errors: 0, Time elapsed: 0.17 sec
Running post goal: test:test

jar:jar:
    [jar] Building jar: /home/continuum/continuum-1.0.2/apps/continuum/work/68/modules/kernel/target/geronimo-kernel-1.1-SNAPSHOT.jar

jar:install:
    [echo] Installing...
Uploading to geronimo/jars/geronimo-kernel-1.1-SNAPSHOT.jar: 
.................... (303K)
Uploading to geronimo/poms/geronimo-kernel-1.1-SNAPSHOT.pom: 
.................... (11K)

+----------------------------------------
| geronimo and geronimo-plugins Geronimo :: Common
| Memory: 16M/20M
+----------------------------------------
DEPRECATED: the default goal should be specified in the <build> section of project.xml instead of maven.xml

build:end:

Attempting to download geronimo-kernel-1.1-SNAPSHOT.jar.
build:start:

multiproject:install-callback:
    [echo] Running jar:install for Geronimo :: Common
java:prepare-filesystem:

java:compile:
<depend closure="false" srcdir="1.4" dump="false" destdir="/home/continuum/continuum-1.0.2/apps/continuum/work/68/modules/common/target/classes"></depend>    [echo] Compiling to /home/continuum/continuum-1.0.2/apps/continuum/work/68/modules/common/target/classes

java:jar-resources:

test:prepare-filesystem:

test:test-resources:

test:compile:

test:test:
    [echo] NOTICE: Skipping tests; they seem to have passed already
    [echo] No tests to run.
Running post goal: test:test

jar:jar:

jar:install:
    [echo] Installing...
Uploading to geronimo/jars/geronimo-common-1.1-SNAPSHOT.jar: 
.................... (36K)
Uploading to geronimo/poms/geronimo-common-1.1-SNAPSHOT.pom: 
.................... (10K)

+----------------------------------------
| geronimo and geronimo-plugins Geronimo :: Util
| Memory: 17M/20M
+----------------------------------------
DEPRECATED: the default goal should be specified in the <build> section of project.xml instead of maven.xml

build:end:

build:start:

multiproject:install-callback:
    [echo] Running jar:install for Geronimo :: Util
java:prepare-filesystem:

java:compile:
<depend closure="false" srcdir="1.4" dump="false" destdir="/home/continuum/continuum-1.0.2/apps/continuum/work/68/modules/util/target/classes"></depend>    [echo] Compiling to /home/continuum/continuum-1.0.2/apps/continuum/work/68/modules/util/target/classes

java:jar-resources:

test:prepare-filesystem:

test:test-resources:

test:compile:

test:test:
    [echo] NOTICE: Skipping tests; they seem to have passed already
    [echo] No tests to run.
Running post goal: test:test

jar:jar:

jar:install:
    [echo] Installing...
Uploading to geronimo/jars/geronimo-util-1.1-SNAPSHOT.jar: 
.................... (243K)
Uploading to geronimo/poms/geronimo-util-1.1-SNAPSHOT.pom: 
.................... (10K)

+----------------------------------------
| geronimo and geronimo-plugins Geronimo :: System
| Memory: 18M/20M
+----------------------------------------
DEPRECATED: the default goal should be specified in the <build> section of project.xml instead of maven.xml
DEPRECATED: the default goal should be specified in the <build> section of project.xml instead of maven.xml

build:end:

Attempting to download geronimo-common-1.1-SNAPSHOT.jar.
Attempting to download geronimo-util-1.1-SNAPSHOT.jar.
build:start:

multiproject:install-callback:
    [echo] Running jar:install for Geronimo :: System
java:prepare-filesystem:

java:compile:
<depend closure="false" srcdir="1.4" dump="false" destdir="/home/continuum/continuum-1.0.2/apps/continuum/work/68/modules/system/target/classes"></depend>    [echo] Compiling to /home/continuum/continuum-1.0.2/apps/continuum/work/68/modules/system/target/classes
Running post goal: java:compile

java:jar-resources:

test:prepare-filesystem:

test:test-resources:
Running post goal: test:test-resources
    [delete] Deleting directory /home/continuum/continuum-1.0.2/apps/continuum/work/68/modules/system/target/tmp
    [mkdir] Created dir: /home/continuum/continuum-1.0.2/apps/continuum/work/68/modules/system/target/tmp

test:compile:

test:test:
    [echo] NOTICE: Skipping tests; they seem to have passed already
    [echo] No tests to run.
Running post goal: test:test

jar:jar:
    [jar] Building jar: /home/continuum/continuum-1.0.2/apps/continuum/work/68/modules/system/target/geronimo-system-1.1-SNAPSHOT.jar

jar:install:
    [echo] Installing...
Uploading to geronimo/jars/geronimo-system-1.1-SNAPSHOT.jar: 
.................... (243K)
Uploading to geronimo/poms/geronimo-system-1.1-SNAPSHOT.pom: 
.................... (11K)

+----------------------------------------
| geronimo and geronimo-plugins Geronimo :: Deployment
| Memory: 20M/20M
+----------------------------------------
DEPRECATED: the default goal should be specified in the <build> section of project.xml instead of maven.xml
DEPRECATED: the default goal should be specified in the <build> section of project.xml instead of maven.xml

build:end:

Attempting to download geronimo-system-1.1-SNAPSHOT.jar.
build:start:

multiproject:install-callback:
    [echo] Running jar:install for Geronimo :: Deployment
java:prepare-filesystem:

java:compile:
<depend closure="false" srcdir="1.4" dump="false" destdir="/home/continuum/continuum-1.0.2/apps/continuum/work/68/modules/deployment/target/classes"></depend>    [echo] Compiling to /home/continuum/continuum-1.0.2/apps/continuum/work/68/modules/deployment/target/classes
    [javac] Compiling 4 source files to /home/continuum/continuum-1.0.2/apps/continuum/work/68/modules/deployment/target/classes

java:jar-resources:

test:prepare-filesystem:

test:test-resources:

test:compile:
    [javac] Compiling 1 source file to /home/continuum/continuum-1.0.2/apps/continuum/work/68/modules/deployment/target/test-classes

test:test:
    [junit] Running org.apache.geronimo.deployment.DeploymentContextTest
    [junit] Tests run: 1, Failures: 0, Errors: 0, Time elapsed: 0.35 sec
    [junit] Running org.apache.geronimo.deployment.SingleFileHotDeployerTest
    [junit] Tests run: 6, Failures: 0, Errors: 0, Time elapsed: 0.159 sec
Running post goal: test:test
20:44:39,380 INFO  [PostGoalTag] Running post goal: test:test
20:44:39,380 INFO  [PostGoalTag] Running post goal: test:test

jar:jar:
    [jar] Building jar: /home/continuum/continuum-1.0.2/apps/continuum/work/68/modules/deployment/target/geronimo-deployment-1.1-SNAPSHOT.jar

jar:install:
    [echo] Installing...
Uploading to geronimo/jars/geronimo-deployment-1.1-SNAPSHOT.jar: 
.................... (58K)
Uploading to geronimo/poms/geronimo-deployment-1.1-SNAPSHOT.pom: 
.................... (11K)

+----------------------------------------

build:end:

20:44:39,776 INFO  [ReactorTag] +----------------------------------------
20:44:39,776 INFO  [ReactorTag] +----------------------------------------
| geronimo and geronimo-plugins Geronimo :: Deploy :: Common Config
20:44:39,776 INFO  [ReactorTag] | geronimo and geronimo-plugins Geronimo :: Deploy :: Common Config
20:44:39,776 INFO  [ReactorTag] | geronimo and geronimo-plugins Geronimo :: Deploy :: Common Config
| Memory: 18M/27M
20:44:39,776 INFO  [ReactorTag] | Memory: 18M/27M
20:44:39,776 INFO  [ReactorTag] | Memory: 18M/27M
+----------------------------------------
20:44:39,776 INFO  [ReactorTag] +----------------------------------------
20:44:39,776 INFO  [ReactorTag] +----------------------------------------
DEPRECATED: the default goal should be specified in the <build> section of project.xml instead of maven.xml
20:44:39,798 WARN  [PluginScriptParser] DEPRECATED: the default goal should be specified in the <build> section of project.xml instead of maven.xml
20:44:39,798 WARN  [PluginScriptParser] DEPRECATED: the default goal should be specified in the <build> section of project.xml instead of maven.xml
DEPRECATED: the default goal should be specified in the <build> section of project.xml instead of maven.xml
20:44:39,799 WARN  [PluginScriptParser] DEPRECATED: the default goal should be specified in the <build> section of project.xml instead of maven.xml
20:44:39,799 WARN  [PluginScriptParser] DEPRECATED: the default goal should be specified in the <build> section of project.xml instead of maven.xml
build:start:

multiproject:install-callback:
    [echo] Running jar:install for Geronimo :: Deploy :: Common Config
java:prepare-filesystem:

java:compile:
<depend closure="false" srcdir="1.4" dump="false" destdir="/home/continuum/continuum-1.0.2/apps/continuum/work/68/modules/deploy-config/target/classes"></depend>    [echo] Compiling to /home/continuum/continuum-1.0.2/apps/continuum/work/68/modules/deploy-config/target/classes

java:jar-resources:

test:prepare-filesystem:

test:test-resources:

test:compile:

test:test:
    [echo] NOTICE: Skipping tests; they seem to have passed already
    [echo] No tests to run.
Running post goal: test:test
20:44:40,906 INFO  [PostGoalTag] Running post goal: test:test
20:44:40,906 INFO  [PostGoalTag] Running post goal: test:test

jar:jar:

jar:install:
    [echo] Installing...
Uploading to geronimo/jars/geronimo-deploy-config-1.1-SNAPSHOT.jar: 
.................... (10K)
Uploading to geronimo/poms/geronimo-deploy-config-1.1-SNAPSHOT.pom: 
.................... (11K)

+----------------------------------------

build:end:

20:44:41,160 INFO  [ReactorTag] +----------------------------------------
20:44:41,160 INFO  [ReactorTag] +----------------------------------------
| geronimo and geronimo-plugins Geronimo :: Management API
20:44:41,160 INFO  [ReactorTag] | geronimo and geronimo-plugins Geronimo :: Management API
20:44:41,160 INFO  [ReactorTag] | geronimo and geronimo-plugins Geronimo :: Management API
| Memory: 17M/27M
20:44:41,160 INFO  [ReactorTag] | Memory: 17M/27M
20:44:41,160 INFO  [ReactorTag] | Memory: 17M/27M
+----------------------------------------
20:44:41,160 INFO  [ReactorTag] +----------------------------------------
20:44:41,160 INFO  [ReactorTag] +----------------------------------------
DEPRECATED: the default goal should be specified in the <build> section of project.xml instead of maven.xml
20:44:41,173 WARN  [PluginScriptParser] DEPRECATED: the default goal should be specified in the <build> section of project.xml instead of maven.xml
20:44:41,173 WARN  [PluginScriptParser] DEPRECATED: the default goal should be specified in the <build> section of project.xml instead of maven.xml
DEPRECATED: the default goal should be specified in the <build> section of project.xml instead of maven.xml
20:44:41,179 WARN  [PluginScriptParser] DEPRECATED: the default goal should be specified in the <build> section of project.xml instead of maven.xml
20:44:41,179 WARN  [PluginScriptParser] DEPRECATED: the default goal should be specified in the <build> section of project.xml instead of maven.xml
build:start:

multiproject:install-callback:
    [echo] Running jar:install for Geronimo :: Management API
java:prepare-filesystem:

java:compile:
<depend closure="false" srcdir="1.4" dump="false" destdir="/home/continuum/continuum-1.0.2/apps/continuum/work/68/modules/management/target/classes"></depend>    [echo] Compiling to /home/continuum/continuum-1.0.2/apps/continuum/work/68/modules/management/target/classes

java:jar-resources:

test:prepare-filesystem:

test:test-resources:

test:compile:
    [echo] No test source files to compile.

test:test:
    [echo] NOTICE: Skipping tests; they seem to have passed already
    [echo] No tests to run.
Running post goal: test:test
20:44:42,527 INFO  [PostGoalTag] Running post goal: test:test
20:44:42,527 INFO  [PostGoalTag] Running post goal: test:test

jar:jar:

jar:install:
    [echo] Installing...
Uploading to geronimo/jars/geronimo-management-1.1-SNAPSHOT.jar: 
.................... (40K)
Uploading to geronimo/poms/geronimo-management-1.1-SNAPSHOT.pom: 
.................... (10K)

+----------------------------------------

build:end:

20:44:42,848 INFO  [ReactorTag] +----------------------------------------
20:44:42,848 INFO  [ReactorTag] +----------------------------------------
| geronimo and geronimo-plugins Geronimo :: Core
20:44:42,849 INFO  [ReactorTag] | geronimo and geronimo-plugins Geronimo :: Core
20:44:42,849 INFO  [ReactorTag] | geronimo and geronimo-plugins Geronimo :: Core
| Memory: 19M/27M
20:44:42,849 INFO  [ReactorTag] | Memory: 19M/27M
20:44:42,849 INFO  [ReactorTag] | Memory: 19M/27M
+----------------------------------------
20:44:42,849 INFO  [ReactorTag] +----------------------------------------
20:44:42,849 INFO  [ReactorTag] +----------------------------------------
DEPRECATED: the default goal should be specified in the <build> section of project.xml instead of maven.xml
20:44:42,881 WARN  [PluginScriptParser] DEPRECATED: the default goal should be specified in the <build> section of project.xml instead of maven.xml
20:44:42,881 WARN  [PluginScriptParser] DEPRECATED: the default goal should be specified in the <build> section of project.xml instead of maven.xml
DEPRECATED: the default goal should be specified in the <build> section of project.xml instead of maven.xml
20:44:42,882 WARN  [PluginScriptParser] DEPRECATED: the default goal should be specified in the <build> section of project.xml instead of maven.xml
20:44:42,882 WARN  [PluginScriptParser] DEPRECATED: the default goal should be specified in the <build> section of project.xml instead of maven.xml
Attempting to download geronimo-management-1.1-SNAPSHOT.jar.
20:44:43,207 INFO  [DependencyVerifier] Attempting to download geronimo-management-1.1-SNAPSHOT.jar.
20:44:43,207 INFO  [DependencyVerifier] Attempting to download geronimo-management-1.1-SNAPSHOT.jar.
build:start:

multiproject:install-callback:
    [echo] Running jar:install for Geronimo :: Core
java:prepare-filesystem:

java:compile:
<depend closure="false" srcdir="1.4" dump="false" destdir="/home/continuum/continuum-1.0.2/apps/continuum/work/68/modules/core/target/classes"></depend>    [echo] Compiling to /home/continuum/continuum-1.0.2/apps/continuum/work/68/modules/core/target/classes

java:jar-resources:

test:prepare-filesystem:

test:test-resources:

test:compile:

test:test:
    [echo] NOTICE: Skipping tests; they seem to have passed already
    [echo] No tests to run.
Running post goal: test:test
20:44:44,944 INFO  [PostGoalTag] Running post goal: test:test
20:44:44,944 INFO  [PostGoalTag] Running post goal: test:test

jar:jar:

jar:install:
    [echo] Installing...
Uploading to geronimo/jars/geronimo-core-1.1-SNAPSHOT.jar: 
.................... (39K)
Uploading to geronimo/poms/geronimo-core-1.1-SNAPSHOT.pom: 
.................... (11K)

+----------------------------------------

build:end:

20:44:45,243 INFO  [ReactorTag] +----------------------------------------
20:44:45,243 INFO  [ReactorTag] +----------------------------------------
| geronimo and geronimo-plugins Geronimo :: J2EE
20:44:45,243 INFO  [ReactorTag] | geronimo and geronimo-plugins Geronimo :: J2EE
20:44:45,243 INFO  [ReactorTag] | geronimo and geronimo-plugins Geronimo :: J2EE
| Memory: 19M/27M
20:44:45,243 INFO  [ReactorTag] | Memory: 19M/27M
20:44:45,243 INFO  [ReactorTag] | Memory: 19M/27M
+----------------------------------------
20:44:45,244 INFO  [ReactorTag] +----------------------------------------
20:44:45,244 INFO  [ReactorTag] +----------------------------------------
DEPRECATED: the default goal should be specified in the <build> section of project.xml instead of maven.xml
20:44:45,279 WARN  [PluginScriptParser] DEPRECATED: the default goal should be specified in the <build> section of project.xml instead of maven.xml
20:44:45,279 WARN  [PluginScriptParser] DEPRECATED: the default goal should be specified in the <build> section of project.xml instead of maven.xml
DEPRECATED: the default goal should be specified in the <build> section of project.xml instead of maven.xml
20:44:45,280 WARN  [PluginScriptParser] DEPRECATED: the default goal should be specified in the <build> section of project.xml instead of maven.xml
20:44:45,280 WARN  [PluginScriptParser] DEPRECATED: the default goal should be specified in the <build> section of project.xml instead of maven.xml
Attempting to download geronimo-core-1.1-SNAPSHOT.jar.
20:44:45,604 INFO  [DependencyVerifier] Attempting to download geronimo-core-1.1-SNAPSHOT.jar.
20:44:45,604 INFO  [DependencyVerifier] Attempting to download geronimo-core-1.1-SNAPSHOT.jar.
build:start:

multiproject:install-callback:
    [echo] Running jar:install for Geronimo :: J2EE
java:prepare-filesystem:

java:compile:
<depend closure="false" srcdir="1.4" dump="false" destdir="/home/continuum/continuum-1.0.2/apps/continuum/work/68/modules/j2ee/target/classes"></depend>    [echo] Compiling to /home/continuum/continuum-1.0.2/apps/continuum/work/68/modules/j2ee/target/classes

java:jar-resources:

test:prepare-filesystem:

test:test-resources:

test:compile:

test:test:
    [echo] NOTICE: Skipping tests; they seem to have passed already
    [echo] No tests to run.
Running post goal: test:test
20:44:50,373 INFO  [PostGoalTag] Running post goal: test:test
20:44:50,373 INFO  [PostGoalTag] Running post goal: test:test

jar:jar:

jar:install:
    [echo] Installing...
Uploading to geronimo/jars/geronimo-j2ee-1.1-SNAPSHOT.jar: 
.................... (28K)
Uploading to geronimo/poms/geronimo-j2ee-1.1-SNAPSHOT.pom: 
.................... (12K)

+----------------------------------------

build:end:

20:44:50,653 INFO  [ReactorTag] +----------------------------------------
20:44:50,653 INFO  [ReactorTag] +----------------------------------------
| geronimo and geronimo-plugins Geronimo :: J2EE Schema
20:44:50,654 INFO  [ReactorTag] | geronimo and geronimo-plugins Geronimo :: J2EE Schema
20:44:50,654 INFO  [ReactorTag] | geronimo and geronimo-plugins Geronimo :: J2EE Schema
| Memory: 19M/27M
20:44:50,654 INFO  [ReactorTag] | Memory: 19M/27M
20:44:50,654 INFO  [ReactorTag] | Memory: 19M/27M
+----------------------------------------
20:44:50,654 INFO  [ReactorTag] +----------------------------------------
20:44:50,654 INFO  [ReactorTag] +----------------------------------------
DEPRECATED: the default goal should be specified in the <build> section of project.xml instead of maven.xml
20:44:50,673 WARN  [PluginScriptParser] DEPRECATED: the default goal should be specified in the <build> section of project.xml instead of maven.xml
20:44:50,673 WARN  [PluginScriptParser] DEPRECATED: the default goal should be specified in the <build> section of project.xml instead of maven.xml
DEPRECATED: the default goal should be specified in the <build> section of project.xml instead of maven.xml
20:44:50,674 WARN  [PluginScriptParser] DEPRECATED: the default goal should be specified in the <build> section of project.xml instead of maven.xml
20:44:50,674 WARN  [PluginScriptParser] DEPRECATED: the default goal should be specified in the <build> section of project.xml instead of maven.xml
build:start:

multiproject:install-callback:
    [echo] Running jar:install for Geronimo :: J2EE Schema
java:prepare-filesystem:

java:compile:
<depend closure="false" srcdir="1.4" dump="false" destdir="/home/continuum/continuum-1.0.2/apps/continuum/work/68/modules/j2ee-schema/target/classes"></depend>    [echo] Compiling to /home/continuum/continuum-1.0.2/apps/continuum/work/68/modules/j2ee-schema/target/classes

java:jar-resources:

test:prepare-filesystem:

test:test-resources:

test:compile:

test:test:
    [echo] NOTICE: Skipping tests; they seem to have passed already
    [echo] No tests to run.
Running post goal: test:test
20:44:52,855 INFO  [PostGoalTag] Running post goal: test:test
20:44:52,855 INFO  [PostGoalTag] Running post goal: test:test

jar:jar:

jar:install:
    [echo] Installing...
Uploading to geronimo/jars/geronimo-j2ee-schema-1.1-SNAPSHOT.jar: 
.................... (1501K)
Uploading to geronimo/poms/geronimo-j2ee-schema-1.1-SNAPSHOT.pom: 
.................... (11K)

+----------------------------------------

build:end:

20:44:54,361 INFO  [ReactorTag] +----------------------------------------
20:44:54,361 INFO  [ReactorTag] +----------------------------------------
| geronimo and geronimo-plugins Geronimo :: Service :: Builder
20:44:54,361 INFO  [ReactorTag] | geronimo and geronimo-plugins Geronimo :: Service :: Builder
20:44:54,361 INFO  [ReactorTag] | geronimo and geronimo-plugins Geronimo :: Service :: Builder
| Memory: 22M/27M
20:44:54,361 INFO  [ReactorTag] | Memory: 22M/27M
20:44:54,361 INFO  [ReactorTag] | Memory: 22M/27M
+----------------------------------------
20:44:54,361 INFO  [ReactorTag] +----------------------------------------
20:44:54,361 INFO  [ReactorTag] +----------------------------------------
DEPRECATED: the default goal should be specified in the <build> section of project.xml instead of maven.xml
20:44:54,376 WARN  [PluginScriptParser] DEPRECATED: the default goal should be specified in the <build> section of project.xml instead of maven.xml
20:44:54,376 WARN  [PluginScriptParser] DEPRECATED: the default goal should be specified in the <build> section of project.xml instead of maven.xml
DEPRECATED: the default goal should be specified in the <build> section of project.xml instead of maven.xml
20:44:54,377 WARN  [PluginScriptParser] DEPRECATED: the default goal should be specified in the <build> section of project.xml instead of maven.xml
20:44:54,377 WARN  [PluginScriptParser] DEPRECATED: the default goal should be specified in the <build> section of project.xml instead of maven.xml
Attempting to download geronimo-deployment-1.1-SNAPSHOT.jar.
20:44:54,706 INFO  [DependencyVerifier] Attempting to download geronimo-deployment-1.1-SNAPSHOT.jar.
20:44:54,706 INFO  [DependencyVerifier] Attempting to download geronimo-deployment-1.1-SNAPSHOT.jar.
Attempting to download geronimo-deploy-config-1.1-SNAPSHOT.jar.
20:44:55,589 INFO  [DependencyVerifier] Attempting to download geronimo-deploy-config-1.1-SNAPSHOT.jar.
20:44:55,589 INFO  [DependencyVerifier] Attempting to download geronimo-deploy-config-1.1-SNAPSHOT.jar.
Attempting to download geronimo-j2ee-1.1-SNAPSHOT.jar.
20:44:56,559 INFO  [DependencyVerifier] Attempting to download geronimo-j2ee-1.1-SNAPSHOT.jar.
20:44:56,559 INFO  [DependencyVerifier] Attempting to download geronimo-j2ee-1.1-SNAPSHOT.jar.
Attempting to download geronimo-j2ee-schema-1.1-SNAPSHOT.jar.
20:44:57,582 INFO  [DependencyVerifier] Attempting to download geronimo-j2ee-schema-1.1-SNAPSHOT.jar.
20:44:57,582 INFO  [DependencyVerifier] Attempting to download geronimo-j2ee-schema-1.1-SNAPSHOT.jar.
build:start:

multiproject:install-callback:
    [echo] Running jar:install for Geronimo :: Service :: Builder
java:prepare-filesystem:

java:compile:
<depend closure="false" srcdir="1.4" dump="false" destdir="/home/continuum/continuum-1.0.2/apps/continuum/work/68/modules/service-builder/target/classes"></depend>    [echo] Compiling to /home/continuum/continuum-1.0.2/apps/continuum/work/68/modules/service-builder/target/classes
    [javac] Compiling 2 source files to /home/continuum/continuum-1.0.2/apps/continuum/work/68/modules/service-builder/target/classes

java:jar-resources:

test:prepare-filesystem:

test:test-resources:

test:compile:
    [javac] Compiling 1 source file to /home/continuum/continuum-1.0.2/apps/continuum/work/68/modules/service-builder/target/test-classes

test:test:
    [junit] Running org.apache.geronimo.deployment.service.EnvironmentBuilderTest
    [junit] Tests run: 3, Failures: 0, Errors: 0, Time elapsed: 0.665 sec
    [junit] Running org.apache.geronimo.deployment.service.ServiceConfigBuilderTest
    [junit] Tests run: 2, Failures: 0, Errors: 0, Time elapsed: 0.965 sec
Running post goal: test:test
20:45:02,482 INFO  [PostGoalTag] Running post goal: test:test
20:45:02,482 INFO  [PostGoalTag] Running post goal: test:test
20:45:02,482 INFO  [PostGoalTag] Running post goal: test:test

jar:jar:
    [jar] Building jar: /home/continuum/continuum-1.0.2/apps/continuum/work/68/modules/service-builder/target/geronimo-service-builder-1.1-SNAPSHOT.jar

jar:install:
    [echo] Installing...
Uploading to geronimo/jars/geronimo-service-builder-1.1-SNAPSHOT.jar: 
.................... (180K)
Uploading to geronimo/poms/geronimo-service-builder-1.1-SNAPSHOT.pom: 
.................... (12K)

+----------------------------------------

build:end:

20:45:03,623 INFO  [ReactorTag] +----------------------------------------
20:45:03,623 INFO  [ReactorTag] +----------------------------------------
20:45:03,623 INFO  [ReactorTag] +----------------------------------------
| geronimo and geronimo-plugins Geronimo :: Maven Dependency Plugin
20:45:03,623 INFO  [ReactorTag] | geronimo and geronimo-plugins Geronimo :: Maven Dependency Plugin
20:45:03,623 INFO  [ReactorTag] | geronimo and geronimo-plugins Geronimo :: Maven Dependency Plugin
20:45:03,623 INFO  [ReactorTag] | geronimo and geronimo-plugins Geronimo :: Maven Dependency Plugin
| Memory: 18M/33M
20:45:03,623 INFO  [ReactorTag] | Memory: 18M/33M
20:45:03,623 INFO  [ReactorTag] | Memory: 18M/33M
20:45:03,623 INFO  [ReactorTag] | Memory: 18M/33M
+----------------------------------------
20:45:03,623 INFO  [ReactorTag] +----------------------------------------
20:45:03,623 INFO  [ReactorTag] +----------------------------------------
20:45:03,623 INFO  [ReactorTag] +----------------------------------------
DEPRECATED: the default goal should be specified in the <build> section of project.xml instead of maven.xml
20:45:03,668 WARN  [PluginScriptParser] DEPRECATED: the default goal should be specified in the <build> section of project.xml instead of maven.xml
20:45:03,668 WARN  [PluginScriptParser] DEPRECATED: the default goal should be specified in the <build> section of project.xml instead of maven.xml
20:45:03,668 WARN  [PluginScriptParser] DEPRECATED: the default goal should be specified in the <build> section of project.xml instead of maven.xml
Attempting to download geronimo-service-builder-1.1-SNAPSHOT.jar.
20:45:03,899 INFO  [DependencyVerifier] Attempting to download geronimo-service-builder-1.1-SNAPSHOT.jar.
20:45:03,899 INFO  [DependencyVerifier] Attempting to download geronimo-service-builder-1.1-SNAPSHOT.jar.
20:45:03,899 INFO  [DependencyVerifier] Attempting to download geronimo-service-builder-1.1-SNAPSHOT.jar.
Artifact /geronimo/jars/geronimo-service-builder-1.1-SNAPSHOT.jar doesn't exist in remote repository, but it exists locally.
20:45:04,439 INFO  [DependencyVerifier] Artifact /geronimo/jars/geronimo-service-builder-1.1-SNAPSHOT.jar doesn't exist in remote repository, but it exists locally.
20:45:04,439 INFO  [DependencyVerifier] Artifact /geronimo/jars/geronimo-service-builder-1.1-SNAPSHOT.jar doesn't exist in remote repository, but it exists locally.
20:45:04,439 INFO  [DependencyVerifier] Artifact /geronimo/jars/geronimo-service-builder-1.1-SNAPSHOT.jar doesn't exist in remote repository, but it exists locally.
build:start:

multiproject:install-callback:
    [echo] Running plugin:repository-install for Geronimo :: Maven Dependency Plugin
plugin:plugin:
java:prepare-filesystem:

java:compile:
    [echo] Compiling to /home/continuum/continuum-1.0.2/apps/continuum/work/68/plugins/geronimo-dependency-plugin/target/classes

java:jar-resources:

test:prepare-filesystem:

test:test-resources:

test:compile:
    [echo] No test source files to compile.

test:test:
    [echo] No tests to run.

jar:jar:


plugin:repository-install:
    [echo] Installing...
Uploading to geronimo/plugins/geronimo-dependency-plugin-1.1.0-3.jar: 
.................... (9K)
Uploading to geronimo/poms/geronimo-dependency-plugin-1.1.0-3.pom: 
.................... (1K)

+----------------------------------------

build:end:

20:45:05,364 INFO  [ReactorTag] +----------------------------------------
20:45:05,364 INFO  [ReactorTag] +----------------------------------------
20:45:05,364 INFO  [ReactorTag] +----------------------------------------
| geronimo and geronimo-plugins Geronimo :: Naming
20:45:05,364 INFO  [ReactorTag] | geronimo and geronimo-plugins Geronimo :: Naming
20:45:05,364 INFO  [ReactorTag] | geronimo and geronimo-plugins Geronimo :: Naming
20:45:05,364 INFO  [ReactorTag] | geronimo and geronimo-plugins Geronimo :: Naming
| Memory: 18M/33M
20:45:05,364 INFO  [ReactorTag] | Memory: 18M/33M
20:45:05,364 INFO  [ReactorTag] | Memory: 18M/33M
20:45:05,364 INFO  [ReactorTag] | Memory: 18M/33M
+----------------------------------------
20:45:05,365 INFO  [ReactorTag] +----------------------------------------
20:45:05,365 INFO  [ReactorTag] +----------------------------------------
20:45:05,365 INFO  [ReactorTag] +----------------------------------------
DEPRECATED: the default goal should be specified in the <build> section of project.xml instead of maven.xml
20:45:05,405 WARN  [PluginScriptParser] DEPRECATED: the default goal should be specified in the <build> section of project.xml instead of maven.xml
20:45:05,405 WARN  [PluginScriptParser] DEPRECATED: the default goal should be specified in the <build> section of project.xml instead of maven.xml
20:45:05,405 WARN  [PluginScriptParser] DEPRECATED: the default goal should be specified in the <build> section of project.xml instead of maven.xml
DEPRECATED: the default goal should be specified in the <build> section of project.xml instead of maven.xml
20:45:05,409 WARN  [PluginScriptParser] DEPRECATED: the default goal should be specified in the <build> section of project.xml instead of maven.xml
20:45:05,409 WARN  [PluginScriptParser] DEPRECATED: the default goal should be specified in the <build> section of project.xml instead of maven.xml
20:45:05,409 WARN  [PluginScriptParser] DEPRECATED: the default goal should be specified in the <build> section of project.xml instead of maven.xml
build:start:

multiproject:install-callback:
    [echo] Running jar:install for Geronimo :: Naming
java:prepare-filesystem:

java:compile:
<depend closure="false" srcdir="1.4" dump="false" destdir="/home/continuum/continuum-1.0.2/apps/continuum/work/68/modules/naming/target/classes"></depend>    [echo] Compiling to /home/continuum/continuum-1.0.2/apps/continuum/work/68/modules/naming/target/classes

java:jar-resources:

test:prepare-filesystem:

test:test-resources:

test:compile:

test:test:
    [echo] NOTICE: Skipping tests; they seem to have passed already
    [echo] No tests to run.
Running post goal: test:test
20:45:06,649 INFO  [PostGoalTag] Running post goal: test:test
20:45:06,649 INFO  [PostGoalTag] Running post goal: test:test
20:45:06,649 INFO  [PostGoalTag] Running post goal: test:test

jar:jar:

jar:install:
    [echo] Installing...
Uploading to geronimo/jars/geronimo-naming-1.1-SNAPSHOT.jar: 
.................... (47K)
Uploading to geronimo/poms/geronimo-naming-1.1-SNAPSHOT.pom: 
.................... (10K)

+----------------------------------------

build:end:

20:45:06,927 INFO  [ReactorTag] +----------------------------------------
20:45:06,927 INFO  [ReactorTag] +----------------------------------------
20:45:06,927 INFO  [ReactorTag] +----------------------------------------
| geronimo and geronimo-plugins Geronimo :: Security
20:45:06,927 INFO  [ReactorTag] | geronimo and geronimo-plugins Geronimo :: Security
20:45:06,927 INFO  [ReactorTag] | geronimo and geronimo-plugins Geronimo :: Security
20:45:06,927 INFO  [ReactorTag] | geronimo and geronimo-plugins Geronimo :: Security
| Memory: 18M/33M
20:45:06,927 INFO  [ReactorTag] | Memory: 18M/33M
20:45:06,927 INFO  [ReactorTag] | Memory: 18M/33M
20:45:06,927 INFO  [ReactorTag] | Memory: 18M/33M
+----------------------------------------
20:45:06,927 INFO  [ReactorTag] +----------------------------------------
20:45:06,927 INFO  [ReactorTag] +----------------------------------------
20:45:06,927 INFO  [ReactorTag] +----------------------------------------
DEPRECATED: the default goal should be specified in the <build> section of project.xml instead of maven.xml
20:45:06,950 WARN  [PluginScriptParser] DEPRECATED: the default goal should be specified in the <build> section of project.xml instead of maven.xml
20:45:06,950 WARN  [PluginScriptParser] DEPRECATED: the default goal should be specified in the <build> section of project.xml instead of maven.xml
20:45:06,950 WARN  [PluginScriptParser] DEPRECATED: the default goal should be specified in the <build> section of project.xml instead of maven.xml
DEPRECATED: the default goal should be specified in the <build> section of project.xml instead of maven.xml
20:45:06,951 WARN  [PluginScriptParser] DEPRECATED: the default goal should be specified in the <build> section of project.xml instead of maven.xml
20:45:06,951 WARN  [PluginScriptParser] DEPRECATED: the default goal should be specified in the <build> section of project.xml instead of maven.xml
20:45:06,951 WARN  [PluginScriptParser] DEPRECATED: the default goal should be specified in the <build> section of project.xml instead of maven.xml
build:start:

multiproject:install-callback:
    [echo] Running jar:install for Geronimo :: Security
java:prepare-filesystem:

java:compile:
<depend closure="false" srcdir="1.4" dump="false" destdir="/home/continuum/continuum-1.0.2/apps/continuum/work/68/modules/security/target/classes"></depend>    [echo] Compiling to /home/continuum/continuum-1.0.2/apps/continuum/work/68/modules/security/target/classes

java:jar-resources:

test:prepare-filesystem:

test:test-resources:
Running post goal: test:test-resources
20:45:08,414 INFO  [PostGoalTag] Running post goal: test:test-resources
20:45:08,414 INFO  [PostGoalTag] Running post goal: test:test-resources
20:45:08,414 INFO  [PostGoalTag] Running post goal: test:test-resources
    [delete] Deleting directory /home/continuum/continuum-1.0.2/apps/continuum/work/68/modules/security/target/database
    [mkdir] Created dir: /home/continuum/continuum-1.0.2/apps/continuum/work/68/modules/security/target/database

test:compile:

test:test:
    [echo] NOTICE: Skipping tests; they seem to have passed already
    [echo] No tests to run.
Running post goal: test:test
20:45:08,878 INFO  [PostGoalTag] Running post goal: test:test
20:45:08,878 INFO  [PostGoalTag] Running post goal: test:test
20:45:08,878 INFO  [PostGoalTag] Running post goal: test:test

jar:jar:

jar:install:
    [echo] Installing...
Uploading to geronimo/jars/geronimo-security-1.1-SNAPSHOT.jar: 
.................... (183K)
Uploading to geronimo/poms/geronimo-security-1.1-SNAPSHOT.pom: 
.................... (13K)

+----------------------------------------

build:end:

20:45:09,199 INFO  [ReactorTag] +----------------------------------------
20:45:09,199 INFO  [ReactorTag] +----------------------------------------
20:45:09,199 INFO  [ReactorTag] +----------------------------------------
| geronimo and geronimo-plugins Geronimo :: Web Services
20:45:09,199 INFO  [ReactorTag] | geronimo and geronimo-plugins Geronimo :: Web Services
20:45:09,199 INFO  [ReactorTag] | geronimo and geronimo-plugins Geronimo :: Web Services
20:45:09,199 INFO  [ReactorTag] | geronimo and geronimo-plugins Geronimo :: Web Services
| Memory: 20M/33M
20:45:09,199 INFO  [ReactorTag] | Memory: 20M/33M
20:45:09,199 INFO  [ReactorTag] | Memory: 20M/33M
20:45:09,199 INFO  [ReactorTag] | Memory: 20M/33M
+----------------------------------------
20:45:09,199 INFO  [ReactorTag] +----------------------------------------
20:45:09,199 INFO  [ReactorTag] +----------------------------------------
20:45:09,199 INFO  [ReactorTag] +----------------------------------------
DEPRECATED: the default goal should be specified in the <build> section of project.xml instead of maven.xml
20:45:09,211 WARN  [PluginScriptParser] DEPRECATED: the default goal should be specified in the <build> section of project.xml instead of maven.xml
20:45:09,211 WARN  [PluginScriptParser] DEPRECATED: the default goal should be specified in the <build> section of project.xml instead of maven.xml
20:45:09,211 WARN  [PluginScriptParser] DEPRECATED: the default goal should be specified in the <build> section of project.xml instead of maven.xml
build:start:

multiproject:install-callback:
    [echo] Running jar:install for Geronimo :: Web Services
java:prepare-filesystem:

java:compile:
<depend closure="false" srcdir="1.4" dump="false" destdir="/home/continuum/continuum-1.0.2/apps/continuum/work/68/modules/webservices/target/classes"></depend>    [echo] Compiling to /home/continuum/continuum-1.0.2/apps/continuum/work/68/modules/webservices/target/classes
    [javac] Compiling 1 source file to /home/continuum/continuum-1.0.2/apps/continuum/work/68/modules/webservices/target/classes

java:jar-resources:

test:prepare-filesystem:

test:test-resources:

test:compile:
    [echo] No test source files to compile.

test:test:
    [echo] No tests to run.
Running post goal: test:test
20:45:10,747 INFO  [PostGoalTag] Running post goal: test:test
20:45:10,747 INFO  [PostGoalTag] Running post goal: test:test
20:45:10,747 INFO  [PostGoalTag] Running post goal: test:test

jar:jar:
    [jar] Building jar: /home/continuum/continuum-1.0.2/apps/continuum/work/68/modules/webservices/target/geronimo-webservices-1.1-SNAPSHOT.jar

jar:install:
    [echo] Installing...
Uploading to geronimo/jars/geronimo-webservices-1.1-SNAPSHOT.jar: 
.................... (35K)
Uploading to geronimo/poms/geronimo-webservices-1.1-SNAPSHOT.pom: 
.................... (13K)

+----------------------------------------

build:end:

20:45:11,138 INFO  [ReactorTag] +----------------------------------------
20:45:11,138 INFO  [ReactorTag] +----------------------------------------
20:45:11,138 INFO  [ReactorTag] +----------------------------------------
| geronimo and geronimo-plugins Geronimo :: Axis
20:45:11,138 INFO  [ReactorTag] | geronimo and geronimo-plugins Geronimo :: Axis
20:45:11,138 INFO  [ReactorTag] | geronimo and geronimo-plugins Geronimo :: Axis
20:45:11,138 INFO  [ReactorTag] | geronimo and geronimo-plugins Geronimo :: Axis
| Memory: 23M/33M
20:45:11,139 INFO  [ReactorTag] | Memory: 23M/33M
20:45:11,139 INFO  [ReactorTag] | Memory: 23M/33M
20:45:11,139 INFO  [ReactorTag] | Memory: 23M/33M
+----------------------------------------
20:45:11,139 INFO  [ReactorTag] +----------------------------------------
20:45:11,139 INFO  [ReactorTag] +----------------------------------------
20:45:11,139 INFO  [ReactorTag] +----------------------------------------
DEPRECATED: the default goal should be specified in the <build> section of project.xml instead of maven.xml
20:45:11,159 WARN  [PluginScriptParser] DEPRECATED: the default goal should be specified in the <build> section of project.xml instead of maven.xml
20:45:11,159 WARN  [PluginScriptParser] DEPRECATED: the default goal should be specified in the <build> section of project.xml instead of maven.xml
20:45:11,159 WARN  [PluginScriptParser] DEPRECATED: the default goal should be specified in the <build> section of project.xml instead of maven.xml
DEPRECATED: the default goal should be specified in the <build> section of project.xml instead of maven.xml
20:45:11,160 WARN  [PluginScriptParser] DEPRECATED: the default goal should be specified in the <build> section of project.xml instead of maven.xml
20:45:11,160 WARN  [PluginScriptParser] DEPRECATED: the default goal should be specified in the <build> section of project.xml instead of maven.xml
20:45:11,160 WARN  [PluginScriptParser] DEPRECATED: the default goal should be specified in the <build> section of project.xml instead of maven.xml
Attempting to download geronimo-naming-1.1-SNAPSHOT.jar.
20:45:11,487 INFO  [DependencyVerifier] Attempting to download geronimo-naming-1.1-SNAPSHOT.jar.
20:45:11,487 INFO  [DependencyVerifier] Attempting to download geronimo-naming-1.1-SNAPSHOT.jar.
20:45:11,487 INFO  [DependencyVerifier] Attempting to download geronimo-naming-1.1-SNAPSHOT.jar.
Attempting to download geronimo-security-1.1-SNAPSHOT.jar.
20:45:12,644 INFO  [DependencyVerifier] Attempting to download geronimo-security-1.1-SNAPSHOT.jar.
20:45:12,644 INFO  [DependencyVerifier] Attempting to download geronimo-security-1.1-SNAPSHOT.jar.
20:45:12,644 INFO  [DependencyVerifier] Attempting to download geronimo-security-1.1-SNAPSHOT.jar.
Attempting to download geronimo-webservices-1.1-SNAPSHOT.jar.
20:45:13,635 INFO  [DependencyVerifier] Attempting to download geronimo-webservices-1.1-SNAPSHOT.jar.
20:45:13,635 INFO  [DependencyVerifier] Attempting to download geronimo-webservices-1.1-SNAPSHOT.jar.
20:45:13,635 INFO  [DependencyVerifier] Attempting to download geronimo-webservices-1.1-SNAPSHOT.jar.
build:start:

multiproject:install-callback:
    [echo] Running jar:install for Geronimo :: Axis
java:prepare-filesystem:

java:compile:
<depend closure="false" srcdir="1.4" dump="false" destdir="/home/continuum/continuum-1.0.2/apps/continuum/work/68/modules/axis/target/classes"></depend>    [echo] Compiling to /home/continuum/continuum-1.0.2/apps/continuum/work/68/modules/axis/target/classes
Running post goal: java:compile
20:45:15,488 INFO  [PostGoalTag] Running post goal: java:compile
20:45:15,488 INFO  [PostGoalTag] Running post goal: java:compile
20:45:15,488 INFO  [PostGoalTag] Running post goal: java:compile
geronimo:dependency:


java:jar-resources:
Copying 1 file to /home/continuum/continuum-1.0.2/apps/continuum/work/68/modules/axis/target/classes

test:prepare-filesystem:

test:test-resources:

test:compile:

test:test:
    [echo] NOTICE: Skipping tests; they seem to have passed already
    [echo] No tests to run.
Running post goal: test:test
20:45:17,270 INFO  [PostGoalTag] Running post goal: test:test
20:45:17,270 INFO  [PostGoalTag] Running post goal: test:test
20:45:17,270 INFO  [PostGoalTag] Running post goal: test:test

jar:jar:
    [jar] Building jar: /home/continuum/continuum-1.0.2/apps/continuum/work/68/modules/axis/target/geronimo-axis-1.1-SNAPSHOT.jar

jar:install:
    [echo] Installing...
Uploading to geronimo/jars/geronimo-axis-1.1-SNAPSHOT.jar: 
.................... (42K)
Uploading to geronimo/poms/geronimo-axis-1.1-SNAPSHOT.pom: 
.................... (12K)

+----------------------------------------

build:end:

20:45:17,685 INFO  [ReactorTag] +----------------------------------------
20:45:17,685 INFO  [ReactorTag] +----------------------------------------
20:45:17,685 INFO  [ReactorTag] +----------------------------------------
| geronimo and geronimo-plugins Geronimo :: Test :: DDBeans
20:45:17,685 INFO  [ReactorTag] | geronimo and geronimo-plugins Geronimo :: Test :: DDBeans
20:45:17,685 INFO  [ReactorTag] | geronimo and geronimo-plugins Geronimo :: Test :: DDBeans
20:45:17,685 INFO  [ReactorTag] | geronimo and geronimo-plugins Geronimo :: Test :: DDBeans
| Memory: 14M/33M
20:45:17,686 INFO  [ReactorTag] | Memory: 14M/33M
20:45:17,686 INFO  [ReactorTag] | Memory: 14M/33M
20:45:17,686 INFO  [ReactorTag] | Memory: 14M/33M
+----------------------------------------
20:45:17,686 INFO  [ReactorTag] +----------------------------------------
20:45:17,686 INFO  [ReactorTag] +----------------------------------------
20:45:17,686 INFO  [ReactorTag] +----------------------------------------
DEPRECATED: the default goal should be specified in the <build> section of project.xml instead of maven.xml
20:45:17,707 WARN  [PluginScriptParser] DEPRECATED: the default goal should be specified in the <build> section of project.xml instead of maven.xml
20:45:17,707 WARN  [PluginScriptParser] DEPRECATED: the default goal should be specified in the <build> section of project.xml instead of maven.xml
20:45:17,707 WARN  [PluginScriptParser] DEPRECATED: the default goal should be specified in the <build> section of project.xml instead of maven.xml
DEPRECATED: the default goal should be specified in the <build> section of project.xml instead of maven.xml
20:45:17,708 WARN  [PluginScriptParser] DEPRECATED: the default goal should be specified in the <build> section of project.xml instead of maven.xml
20:45:17,708 WARN  [PluginScriptParser] DEPRECATED: the default goal should be specified in the <build> section of project.xml instead of maven.xml
20:45:17,708 WARN  [PluginScriptParser] DEPRECATED: the default goal should be specified in the <build> section of project.xml instead of maven.xml
build:start:

multiproject:install-callback:
    [echo] Running jar:install for Geronimo :: Test :: DDBeans
java:prepare-filesystem:

java:compile:
<depend closure="false" srcdir="1.4" dump="false" destdir="/home/continuum/continuum-1.0.2/apps/continuum/work/68/modules/test-ddbean/target/classes"></depend>    [echo] Compiling to /home/continuum/continuum-1.0.2/apps/continuum/work/68/modules/test-ddbean/target/classes

java:jar-resources:

test:prepare-filesystem:

test:test-resources:

test:compile:

test:test:
    [echo] NOTICE: Skipping tests; they seem to have passed already
    [echo] No tests to run.
Running post goal: test:test
20:45:18,834 INFO  [PostGoalTag] Running post goal: test:test
20:45:18,834 INFO  [PostGoalTag] Running post goal: test:test
20:45:18,834 INFO  [PostGoalTag] Running post goal: test:test

jar:jar:

jar:install:
    [echo] Installing...
Uploading to geronimo/jars/geronimo-test-ddbean-1.1-SNAPSHOT.jar: 
.................... (17K)
Uploading to geronimo/poms/geronimo-test-ddbean-1.1-SNAPSHOT.pom: 
.................... (10K)

+----------------------------------------

build:end:

20:45:19,122 INFO  [ReactorTag] +----------------------------------------
20:45:19,122 INFO  [ReactorTag] +----------------------------------------
20:45:19,122 INFO  [ReactorTag] +----------------------------------------
| geronimo and geronimo-plugins Geronimo :: Transaction
20:45:19,123 INFO  [ReactorTag] | geronimo and geronimo-plugins Geronimo :: Transaction
20:45:19,123 INFO  [ReactorTag] | geronimo and geronimo-plugins Geronimo :: Transaction
20:45:19,123 INFO  [ReactorTag] | geronimo and geronimo-plugins Geronimo :: Transaction
| Memory: 16M/33M
20:45:19,123 INFO  [ReactorTag] | Memory: 16M/33M
20:45:19,123 INFO  [ReactorTag] | Memory: 16M/33M
20:45:19,123 INFO  [ReactorTag] | Memory: 16M/33M
+----------------------------------------
20:45:19,123 INFO  [ReactorTag] +----------------------------------------
20:45:19,123 INFO  [ReactorTag] +----------------------------------------
20:45:19,123 INFO  [ReactorTag] +----------------------------------------
DEPRECATED: the default goal should be specified in the <build> section of project.xml instead of maven.xml
20:45:19,133 WARN  [PluginScriptParser] DEPRECATED: the default goal should be specified in the <build> section of project.xml instead of maven.xml
20:45:19,133 WARN  [PluginScriptParser] DEPRECATED: the default goal should be specified in the <build> section of project.xml instead of maven.xml
20:45:19,133 WARN  [PluginScriptParser] DEPRECATED: the default goal should be specified in the <build> section of project.xml instead of maven.xml
build:start:

multiproject:install-callback:
    [echo] Running jar:install for Geronimo :: Transaction
java:prepare-filesystem:

java:compile:
<depend closure="false" srcdir="1.4" dump="false" destdir="/home/continuum/continuum-1.0.2/apps/continuum/work/68/modules/transaction/target/classes"></depend>    [echo] Compiling to /home/continuum/continuum-1.0.2/apps/continuum/work/68/modules/transaction/target/classes

java:jar-resources:

test:prepare-filesystem:

test:test-resources:

test:compile:

test:test:
    [echo] NOTICE: Skipping tests; they seem to have passed already
    [echo] No tests to run.
Running post goal: test:test
20:45:20,305 INFO  [PostGoalTag] Running post goal: test:test
20:45:20,305 INFO  [PostGoalTag] Running post goal: test:test
20:45:20,305 INFO  [PostGoalTag] Running post goal: test:test

jar:jar:

jar:install:
    [echo] Installing...
Uploading to geronimo/jars/geronimo-transaction-1.1-SNAPSHOT.jar: 
.................... (73K)
Uploading to geronimo/poms/geronimo-transaction-1.1-SNAPSHOT.pom: 
.................... (12K)

+----------------------------------------

build:end:

20:45:20,590 INFO  [ReactorTag] +----------------------------------------
20:45:20,590 INFO  [ReactorTag] +----------------------------------------
20:45:20,590 INFO  [ReactorTag] +----------------------------------------
| geronimo and geronimo-plugins Geronimo :: Connector
20:45:20,591 INFO  [ReactorTag] | geronimo and geronimo-plugins Geronimo :: Connector
20:45:20,591 INFO  [ReactorTag] | geronimo and geronimo-plugins Geronimo :: Connector
20:45:20,591 INFO  [ReactorTag] | geronimo and geronimo-plugins Geronimo :: Connector
| Memory: 15M/33M
20:45:20,591 INFO  [ReactorTag] | Memory: 15M/33M
20:45:20,591 INFO  [ReactorTag] | Memory: 15M/33M
20:45:20,591 INFO  [ReactorTag] | Memory: 15M/33M
+----------------------------------------
20:45:20,591 INFO  [ReactorTag] +----------------------------------------
20:45:20,591 INFO  [ReactorTag] +----------------------------------------
20:45:20,591 INFO  [ReactorTag] +----------------------------------------
DEPRECATED: the default goal should be specified in the <build> section of project.xml instead of maven.xml
20:45:20,601 WARN  [PluginScriptParser] DEPRECATED: the default goal should be specified in the <build> section of project.xml instead of maven.xml
20:45:20,601 WARN  [PluginScriptParser] DEPRECATED: the default goal should be specified in the <build> section of project.xml instead of maven.xml
20:45:20,601 WARN  [PluginScriptParser] DEPRECATED: the default goal should be specified in the <build> section of project.xml instead of maven.xml
DEPRECATED: the default goal should be specified in the <build> section of project.xml instead of maven.xml
20:45:20,602 WARN  [PluginScriptParser] DEPRECATED: the default goal should be specified in the <build> section of project.xml instead of maven.xml
20:45:20,602 WARN  [PluginScriptParser] DEPRECATED: the default goal should be specified in the <build> section of project.xml instead of maven.xml
20:45:20,602 WARN  [PluginScriptParser] DEPRECATED: the default goal should be specified in the <build> section of project.xml instead of maven.xml
Attempting to download geronimo-transaction-1.1-SNAPSHOT.jar.
20:45:20,929 INFO  [DependencyVerifier] Attempting to download geronimo-transaction-1.1-SNAPSHOT.jar.
20:45:20,929 INFO  [DependencyVerifier] Attempting to download geronimo-transaction-1.1-SNAPSHOT.jar.
20:45:20,929 INFO  [DependencyVerifier] Attempting to download geronimo-transaction-1.1-SNAPSHOT.jar.
build:start:

multiproject:install-callback:
    [echo] Running jar:install for Geronimo :: Connector
java:prepare-filesystem:

java:compile:
<depend closure="false" srcdir="1.4" dump="false" destdir="/home/continuum/continuum-1.0.2/apps/continuum/work/68/modules/connector/target/classes"></depend>    [echo] Compiling to /home/continuum/continuum-1.0.2/apps/continuum/work/68/modules/connector/target/classes

java:jar-resources:

test:prepare-filesystem:

test:test-resources:

test:compile:

test:test:
    [echo] NOTICE: Skipping tests; they seem to have passed already
    [echo] No tests to run.
Running post goal: test:test
20:45:22,935 INFO  [PostGoalTag] Running post goal: test:test
20:45:22,935 INFO  [PostGoalTag] Running post goal: test:test
20:45:22,935 INFO  [PostGoalTag] Running post goal: test:test

jar:jar:

jar:install:
    [echo] Installing...
Uploading to geronimo/jars/geronimo-connector-1.1-SNAPSHOT.jar: 
.................... (132K)
Uploading to geronimo/poms/geronimo-connector-1.1-SNAPSHOT.pom: 
.................... (13K)

+----------------------------------------

build:end:

20:45:23,287 INFO  [ReactorTag] +----------------------------------------
20:45:23,287 INFO  [ReactorTag] +----------------------------------------
20:45:23,287 INFO  [ReactorTag] +----------------------------------------
| geronimo and geronimo-plugins Geronimo :: Security :: Builder
20:45:23,287 INFO  [ReactorTag] | geronimo and geronimo-plugins Geronimo :: Security :: Builder
20:45:23,287 INFO  [ReactorTag] | geronimo and geronimo-plugins Geronimo :: Security :: Builder
20:45:23,287 INFO  [ReactorTag] | geronimo and geronimo-plugins Geronimo :: Security :: Builder
| Memory: 18M/33M
20:45:23,287 INFO  [ReactorTag] | Memory: 18M/33M
20:45:23,287 INFO  [ReactorTag] | Memory: 18M/33M
20:45:23,287 INFO  [ReactorTag] | Memory: 18M/33M
+----------------------------------------
20:45:23,287 INFO  [ReactorTag] +----------------------------------------
20:45:23,287 INFO  [ReactorTag] +----------------------------------------
20:45:23,287 INFO  [ReactorTag] +----------------------------------------
DEPRECATED: the default goal should be specified in the <build> section of project.xml instead of maven.xml
20:45:23,306 WARN  [PluginScriptParser] DEPRECATED: the default goal should be specified in the <build> section of project.xml instead of maven.xml
20:45:23,306 WARN  [PluginScriptParser] DEPRECATED: the default goal should be specified in the <build> section of project.xml instead of maven.xml
20:45:23,306 WARN  [PluginScriptParser] DEPRECATED: the default goal should be specified in the <build> section of project.xml instead of maven.xml
DEPRECATED: the default goal should be specified in the <build> section of project.xml instead of maven.xml
20:45:23,307 WARN  [PluginScriptParser] DEPRECATED: the default goal should be specified in the <build> section of project.xml instead of maven.xml
20:45:23,307 WARN  [PluginScriptParser] DEPRECATED: the default goal should be specified in the <build> section of project.xml instead of maven.xml
20:45:23,307 WARN  [PluginScriptParser] DEPRECATED: the default goal should be specified in the <build> section of project.xml instead of maven.xml
build:start:

multiproject:install-callback:
    [echo] Running jar:install for Geronimo :: Security :: Builder
java:prepare-filesystem:

java:compile:
<depend closure="false" srcdir="1.4" dump="false" destdir="/home/continuum/continuum-1.0.2/apps/continuum/work/68/modules/security-builder/target/classes"></depend>    [echo] Compiling to /home/continuum/continuum-1.0.2/apps/continuum/work/68/modules/security-builder/target/classes

java:jar-resources:

test:prepare-filesystem:

test:test-resources:
Running post goal: test:test-resources
20:45:24,509 INFO  [PostGoalTag] Running post goal: test:test-resources
20:45:24,509 INFO  [PostGoalTag] Running post goal: test:test-resources
20:45:24,509 INFO  [PostGoalTag] Running post goal: test:test-resources
    [delete] Deleting directory /home/continuum/continuum-1.0.2/apps/continuum/work/68/modules/security-builder/target/database
    [mkdir] Created dir: /home/continuum/continuum-1.0.2/apps/continuum/work/68/modules/security-builder/target/database

test:compile:
    [echo] No test source files to compile.

test:test:
    [echo] NOTICE: Skipping tests; they seem to have passed already
    [echo] No tests to run.
Running post goal: test:test
20:45:24,892 INFO  [PostGoalTag] Running post goal: test:test
20:45:24,892 INFO  [PostGoalTag] Running post goal: test:test
20:45:24,892 INFO  [PostGoalTag] Running post goal: test:test

jar:jar:

jar:install:
    [echo] Installing...
Uploading to geronimo/jars/geronimo-security-builder-1.1-SNAPSHOT.jar: 
.................... (172K)
Uploading to geronimo/poms/geronimo-security-builder-1.1-SNAPSHOT.pom: 
.................... (12K)

+----------------------------------------

build:end:

20:45:25,249 INFO  [ReactorTag] +----------------------------------------
20:45:25,249 INFO  [ReactorTag] +----------------------------------------
20:45:25,249 INFO  [ReactorTag] +----------------------------------------
| geronimo and geronimo-plugins Geronimo :: J2EE
20:45:25,250 INFO  [ReactorTag] | geronimo and geronimo-plugins Geronimo :: J2EE
20:45:25,250 INFO  [ReactorTag] | geronimo and geronimo-plugins Geronimo :: J2EE
20:45:25,250 INFO  [ReactorTag] | geronimo and geronimo-plugins Geronimo :: J2EE
| Memory: 17M/33M
20:45:25,250 INFO  [ReactorTag] | Memory: 17M/33M
20:45:25,250 INFO  [ReactorTag] | Memory: 17M/33M
20:45:25,250 INFO  [ReactorTag] | Memory: 17M/33M
+----------------------------------------
20:45:25,250 INFO  [ReactorTag] +----------------------------------------
20:45:25,250 INFO  [ReactorTag] +----------------------------------------
20:45:25,250 INFO  [ReactorTag] +----------------------------------------
DEPRECATED: the default goal should be specified in the <build> section of project.xml instead of maven.xml
20:45:25,289 WARN  [PluginScriptParser] DEPRECATED: the default goal should be specified in the <build> section of project.xml instead of maven.xml
20:45:25,289 WARN  [PluginScriptParser] DEPRECATED: the default goal should be specified in the <build> section of project.xml instead of maven.xml
20:45:25,289 WARN  [PluginScriptParser] DEPRECATED: the default goal should be specified in the <build> section of project.xml instead of maven.xml
DEPRECATED: the default goal should be specified in the <build> section of project.xml instead of maven.xml
20:45:25,292 WARN  [PluginScriptParser] DEPRECATED: the default goal should be specified in the <build> section of project.xml instead of maven.xml
20:45:25,292 WARN  [PluginScriptParser] DEPRECATED: the default goal should be specified in the <build> section of project.xml instead of maven.xml
20:45:25,292 WARN  [PluginScriptParser] DEPRECATED: the default goal should be specified in the <build> section of project.xml instead of maven.xml
Attempting to download geronimo-security-builder-1.1-SNAPSHOT.jar.
20:45:25,620 INFO  [DependencyVerifier] Attempting to download geronimo-security-builder-1.1-SNAPSHOT.jar.
20:45:25,620 INFO  [DependencyVerifier] Attempting to download geronimo-security-builder-1.1-SNAPSHOT.jar.
20:45:25,620 INFO  [DependencyVerifier] Attempting to download geronimo-security-builder-1.1-SNAPSHOT.jar.
build:start:

multiproject:install-callback:
    [echo] Running jar:install for Geronimo :: J2EE
java:prepare-filesystem:

java:compile:
<depend closure="false" srcdir="1.4" dump="false" destdir="/home/continuum/continuum-1.0.2/apps/continuum/work/68/modules/j2ee-builder/target/classes"></depend>    [echo] Compiling to /home/continuum/continuum-1.0.2/apps/continuum/work/68/modules/j2ee-builder/target/classes
    [javac] Compiling 4 source files to /home/continuum/continuum-1.0.2/apps/continuum/work/68/modules/j2ee-builder/target/classes

java:jar-resources:

test:prepare-filesystem:

test:test-resources:

test:compile:
setupEar:

setupEar:

setupUnpackedEar:
setupBaseUnpackedEar:

setupBaseUnpackedEar:

setupBaseUnpackedEar:


    [javac] Compiling 4 source files to /home/continuum/continuum-1.0.2/apps/continuum/work/68/modules/j2ee-builder/target/test-classes

test:test:
    [junit] Running org.apache.geronimo.j2ee.deployment.EARConfigBuilderTest
    [junit] Tests run: 64, Failures: 0, Errors: 0, Time elapsed: 1.785 sec
    [junit] Running org.apache.geronimo.j2ee.deployment.EJBRefContextTest
    [junit] Tests run: 1, Failures: 0, Errors: 0, Time elapsed: 0.055 sec
Running post goal: test:test
20:45:34,324 INFO  [PostGoalTag] Running post goal: test:test
20:45:34,324 INFO  [PostGoalTag] Running post goal: test:test
20:45:34,324 INFO  [PostGoalTag] Running post goal: test:test

jar:jar:
    [jar] Building jar: /home/continuum/continuum-1.0.2/apps/continuum/work/68/modules/j2ee-builder/target/geronimo-j2ee-builder-1.1-SNAPSHOT.jar

jar:install:
    [echo] Installing...
Uploading to geronimo/jars/geronimo-j2ee-builder-1.1-SNAPSHOT.jar: 
.................... (91K)
Uploading to geronimo/poms/geronimo-j2ee-builder-1.1-SNAPSHOT.pom: 
.................... (13K)

+----------------------------------------

build:end:

20:45:34,844 INFO  [ReactorTag] +----------------------------------------
20:45:34,844 INFO  [ReactorTag] +----------------------------------------
20:45:34,844 INFO  [ReactorTag] +----------------------------------------
| geronimo and geronimo-plugins Geronimo :: Naming :: Builder
20:45:34,844 INFO  [ReactorTag] | geronimo and geronimo-plugins Geronimo :: Naming :: Builder
20:45:34,844 INFO  [ReactorTag] | geronimo and geronimo-plugins Geronimo :: Naming :: Builder
20:45:34,844 INFO  [ReactorTag] | geronimo and geronimo-plugins Geronimo :: Naming :: Builder
| Memory: 30M/33M
20:45:34,844 INFO  [ReactorTag] | Memory: 30M/33M
20:45:34,844 INFO  [ReactorTag] | Memory: 30M/33M
20:45:34,844 INFO  [ReactorTag] | Memory: 30M/33M
+----------------------------------------
20:45:34,844 INFO  [ReactorTag] +----------------------------------------
20:45:34,844 INFO  [ReactorTag] +----------------------------------------
20:45:34,844 INFO  [ReactorTag] +----------------------------------------
DEPRECATED: the default goal should be specified in the <build> section of project.xml instead of maven.xml
20:45:34,875 WARN  [PluginScriptParser] DEPRECATED: the default goal should be specified in the <build> section of project.xml instead of maven.xml
20:45:34,875 WARN  [PluginScriptParser] DEPRECATED: the default goal should be specified in the <build> section of project.xml instead of maven.xml
20:45:34,875 WARN  [PluginScriptParser] DEPRECATED: the default goal should be specified in the <build> section of project.xml instead of maven.xml
DEPRECATED: the default goal should be specified in the <build> section of project.xml instead of maven.xml
20:45:34,876 WARN  [PluginScriptParser] DEPRECATED: the default goal should be specified in the <build> section of project.xml instead of maven.xml
20:45:34,876 WARN  [PluginScriptParser] DEPRECATED: the default goal should be specified in the <build> section of project.xml instead of maven.xml
20:45:34,876 WARN  [PluginScriptParser] DEPRECATED: the default goal should be specified in the <build> section of project.xml instead of maven.xml
Attempting to download geronimo-j2ee-builder-1.1-SNAPSHOT.jar.
20:45:35,207 INFO  [DependencyVerifier] Attempting to download geronimo-j2ee-builder-1.1-SNAPSHOT.jar.
20:45:35,207 INFO  [DependencyVerifier] Attempting to download geronimo-j2ee-builder-1.1-SNAPSHOT.jar.
20:45:35,207 INFO  [DependencyVerifier] Attempting to download geronimo-j2ee-builder-1.1-SNAPSHOT.jar.
build:start:

multiproject:install-callback:
    [echo] Running jar:install for Geronimo :: Naming :: Builder
java:prepare-filesystem:

java:compile:
<depend closure="false" srcdir="1.4" dump="false" destdir="/home/continuum/continuum-1.0.2/apps/continuum/work/68/modules/naming-builder/target/classes"></depend>    [echo] Compiling to /home/continuum/continuum-1.0.2/apps/continuum/work/68/modules/naming-builder/target/classes
    [javac] Compiling 1 source file to /home/continuum/continuum-1.0.2/apps/continuum/work/68/modules/naming-builder/target/classes

java:jar-resources:

test:prepare-filesystem:

test:test-resources:

test:compile:

test:test:
    [junit] Running org.apache.geronimo.naming.deployment.MessageDestinationTest
    [junit] Tests run: 3, Failures: 0, Errors: 0, Time elapsed: 0.833 sec
Running post goal: test:test
20:45:39,034 INFO  [PostGoalTag] Running post goal: test:test
20:45:39,034 INFO  [PostGoalTag] Running post goal: test:test
20:45:39,034 INFO  [PostGoalTag] Running post goal: test:test
20:45:39,034 INFO  [PostGoalTag] Running post goal: test:test

jar:jar:
    [jar] Building jar: /home/continuum/continuum-1.0.2/apps/continuum/work/68/modules/naming-builder/target/geronimo-naming-builder-1.1-SNAPSHOT.jar

jar:install:
    [echo] Installing...
Uploading to geronimo/jars/geronimo-naming-builder-1.1-SNAPSHOT.jar: 
.................... (186K)
Uploading to geronimo/poms/geronimo-naming-builder-1.1-SNAPSHOT.pom: 
.................... (13K)

+----------------------------------------

build:end:

20:45:39,895 INFO  [ReactorTag] +----------------------------------------
20:45:39,895 INFO  [ReactorTag] +----------------------------------------
20:45:39,895 INFO  [ReactorTag] +----------------------------------------
20:45:39,895 INFO  [ReactorTag] +----------------------------------------
| geronimo and geronimo-plugins Geronimo :: Connector :: Builder
20:45:39,895 INFO  [ReactorTag] | geronimo and geronimo-plugins Geronimo :: Connector :: Builder
20:45:39,895 INFO  [ReactorTag] | geronimo and geronimo-plugins Geronimo :: Connector :: Builder
20:45:39,895 INFO  [ReactorTag] | geronimo and geronimo-plugins Geronimo :: Connector :: Builder
20:45:39,895 INFO  [ReactorTag] | geronimo and geronimo-plugins Geronimo :: Connector :: Builder
| Memory: 21M/36M
20:45:39,896 INFO  [ReactorTag] | Memory: 21M/36M
20:45:39,896 INFO  [ReactorTag] | Memory: 21M/36M
20:45:39,896 INFO  [ReactorTag] | Memory: 21M/36M
20:45:39,896 INFO  [ReactorTag] | Memory: 21M/36M
+----------------------------------------
20:45:39,896 INFO  [ReactorTag] +----------------------------------------
20:45:39,896 INFO  [ReactorTag] +----------------------------------------
20:45:39,896 INFO  [ReactorTag] +----------------------------------------
20:45:39,896 INFO  [ReactorTag] +----------------------------------------
DEPRECATED: the default goal should be specified in the <build> section of project.xml instead of maven.xml
20:45:39,919 WARN  [PluginScriptParser] DEPRECATED: the default goal should be specified in the <build> section of project.xml instead of maven.xml
20:45:39,919 WARN  [PluginScriptParser] DEPRECATED: the default goal should be specified in the <build> section of project.xml instead of maven.xml
20:45:39,919 WARN  [PluginScriptParser] DEPRECATED: the default goal should be specified in the <build> section of project.xml instead of maven.xml
20:45:39,919 WARN  [PluginScriptParser] DEPRECATED: the default goal should be specified in the <build> section of project.xml instead of maven.xml
DEPRECATED: the default goal should be specified in the <build> section of project.xml instead of maven.xml
20:45:39,920 WARN  [PluginScriptParser] DEPRECATED: the default goal should be specified in the <build> section of project.xml instead of maven.xml
20:45:39,920 WARN  [PluginScriptParser] DEPRECATED: the default goal should be specified in the <build> section of project.xml instead of maven.xml
20:45:39,920 WARN  [PluginScriptParser] DEPRECATED: the default goal should be specified in the <build> section of project.xml instead of maven.xml
20:45:39,920 WARN  [PluginScriptParser] DEPRECATED: the default goal should be specified in the <build> section of project.xml instead of maven.xml
Attempting to download geronimo-test-ddbean-1.1-SNAPSHOT.jar.
20:45:40,251 INFO  [DependencyVerifier] Attempting to download geronimo-test-ddbean-1.1-SNAPSHOT.jar.
20:45:40,251 INFO  [DependencyVerifier] Attempting to download geronimo-test-ddbean-1.1-SNAPSHOT.jar.
20:45:40,251 INFO  [DependencyVerifier] Attempting to download geronimo-test-ddbean-1.1-SNAPSHOT.jar.
20:45:40,251 INFO  [DependencyVerifier] Attempting to download geronimo-test-ddbean-1.1-SNAPSHOT.jar.
Attempting to download geronimo-connector-1.1-SNAPSHOT.jar.
20:45:41,280 INFO  [DependencyVerifier] Attempting to download geronimo-connector-1.1-SNAPSHOT.jar.
20:45:41,280 INFO  [DependencyVerifier] Attempting to download geronimo-connector-1.1-SNAPSHOT.jar.
20:45:41,280 INFO  [DependencyVerifier] Attempting to download geronimo-connector-1.1-SNAPSHOT.jar.
20:45:41,280 INFO  [DependencyVerifier] Attempting to download geronimo-connector-1.1-SNAPSHOT.jar.
Attempting to download geronimo-naming-builder-1.1-SNAPSHOT.jar.
20:45:42,688 INFO  [DependencyVerifier] Attempting to download geronimo-naming-builder-1.1-SNAPSHOT.jar.
20:45:42,688 INFO  [DependencyVerifier] Attempting to download geronimo-naming-builder-1.1-SNAPSHOT.jar.
20:45:42,688 INFO  [DependencyVerifier] Attempting to download geronimo-naming-builder-1.1-SNAPSHOT.jar.
20:45:42,688 INFO  [DependencyVerifier] Attempting to download geronimo-naming-builder-1.1-SNAPSHOT.jar.
build:start:

multiproject:install-callback:
    [echo] Running jar:install for Geronimo :: Connector :: Builder
java:prepare-filesystem:

java:compile:
<depend closure="false" srcdir="1.4" dump="false" destdir="/home/continuum/continuum-1.0.2/apps/continuum/work/68/modules/connector-builder/target/classes"></depend>    [echo] Compiling to /home/continuum/continuum-1.0.2/apps/continuum/work/68/modules/connector-builder/target/classes
    [javac] Compiling 1 source file to /home/continuum/continuum-1.0.2/apps/continuum/work/68/modules/connector-builder/target/classes

java:jar-resources:

test:prepare-filesystem:

test:test-resources:

test:compile:
    [javac] Compiling 1 source file to /home/continuum/continuum-1.0.2/apps/continuum/work/68/modules/connector-builder/target/test-classes

test:test:
    [junit] Running org.apache.geronimo.connector.deployment.ConnectorModuleBuilderTest
    [junit] Tests run: 10, Failures: 0, Errors: 0, Time elapsed: 8.204 sec
    [junit] Running org.apache.geronimo.connector.deployment.PlanParsingTest
    [junit] Tests run: 7, Failures: 0, Errors: 0, Time elapsed: 1.368 sec
    [junit] Running org.apache.geronimo.connector.deployment.RAR_1_0DConfigBeanTest
    [junit] Tests run: 1, Failures: 0, Errors: 0, Time elapsed: 0.35 sec
    [junit] Running org.apache.geronimo.connector.deployment.RAR_1_5DConfigBeanTest
    [junit] Tests run: 1, Failures: 0, Errors: 0, Time elapsed: 0.347 sec
    [junit] Running org.apache.geronimo.connector.deployment.jsr88.Connector15DCBTest
    [junit] Tests run: 4, Failures: 0, Errors: 0, Time elapsed: 2.109 sec
Running post goal: test:test
20:46:02,413 INFO  [PostGoalTag] Running post goal: test:test
20:46:02,413 INFO  [PostGoalTag] Running post goal: test:test
20:46:02,413 INFO  [PostGoalTag] Running post goal: test:test
20:46:02,413 INFO  [PostGoalTag] Running post goal: test:test

jar:jar:
    [jar] Building jar: /home/continuum/continuum-1.0.2/apps/continuum/work/68/modules/connector-builder/target/geronimo-connector-builder-1.1-SNAPSHOT.jar

jar:install:
    [echo] Installing...
Uploading to geronimo/jars/geronimo-connector-builder-1.1-SNAPSHOT.jar: 
.................... (202K)
Uploading to geronimo/poms/geronimo-connector-builder-1.1-SNAPSHOT.pom: 
.................... (15K)

+----------------------------------------

build:end:

20:46:03,079 INFO  [ReactorTag] +----------------------------------------
20:46:03,079 INFO  [ReactorTag] +----------------------------------------
20:46:03,079 INFO  [ReactorTag] +----------------------------------------
20:46:03,079 INFO  [ReactorTag] +----------------------------------------
| geronimo and geronimo-plugins Geronimo :: Axis :: Builder
20:46:03,079 INFO  [ReactorTag] | geronimo and geronimo-plugins Geronimo :: Axis :: Builder
20:46:03,079 INFO  [ReactorTag] | geronimo and geronimo-plugins Geronimo :: Axis :: Builder
20:46:03,079 INFO  [ReactorTag] | geronimo and geronimo-plugins Geronimo :: Axis :: Builder
20:46:03,079 INFO  [ReactorTag] | geronimo and geronimo-plugins Geronimo :: Axis :: Builder
| Memory: 35M/36M
20:46:03,079 INFO  [ReactorTag] | Memory: 35M/36M
20:46:03,079 INFO  [ReactorTag] | Memory: 35M/36M
20:46:03,079 INFO  [ReactorTag] | Memory: 35M/36M
20:46:03,079 INFO  [ReactorTag] | Memory: 35M/36M
+----------------------------------------
20:46:03,079 INFO  [ReactorTag] +----------------------------------------
20:46:03,079 INFO  [ReactorTag] +----------------------------------------
20:46:03,079 INFO  [ReactorTag] +----------------------------------------
20:46:03,079 INFO  [ReactorTag] +----------------------------------------
DEPRECATED: the default goal should be specified in the <build> section of project.xml instead of maven.xml
20:46:03,110 WARN  [PluginScriptParser] DEPRECATED: the default goal should be specified in the <build> section of project.xml instead of maven.xml
20:46:03,110 WARN  [PluginScriptParser] DEPRECATED: the default goal should be specified in the <build> section of project.xml instead of maven.xml
20:46:03,110 WARN  [PluginScriptParser] DEPRECATED: the default goal should be specified in the <build> section of project.xml instead of maven.xml
20:46:03,110 WARN  [PluginScriptParser] DEPRECATED: the default goal should be specified in the <build> section of project.xml instead of maven.xml
DEPRECATED: the default goal should be specified in the <build> section of project.xml instead of maven.xml
20:46:03,111 WARN  [PluginScriptParser] DEPRECATED: the default goal should be specified in the <build> section of project.xml instead of maven.xml
20:46:03,111 WARN  [PluginScriptParser] DEPRECATED: the default goal should be specified in the <build> section of project.xml instead of maven.xml
20:46:03,111 WARN  [PluginScriptParser] DEPRECATED: the default goal should be specified in the <build> section of project.xml instead of maven.xml
20:46:03,111 WARN  [PluginScriptParser] DEPRECATED: the default goal should be specified in the <build> section of project.xml instead of maven.xml
Attempting to download geronimo-axis-1.1-SNAPSHOT.jar.
20:46:03,442 INFO  [DependencyVerifier] Attempting to download geronimo-axis-1.1-SNAPSHOT.jar.
20:46:03,442 INFO  [DependencyVerifier] Attempting to download geronimo-axis-1.1-SNAPSHOT.jar.
20:46:03,442 INFO  [DependencyVerifier] Attempting to download geronimo-axis-1.1-SNAPSHOT.jar.
20:46:03,442 INFO  [DependencyVerifier] Attempting to download geronimo-axis-1.1-SNAPSHOT.jar.
Attempting to download geronimo-connector-builder-1.1-SNAPSHOT.jar.
20:46:04,498 INFO  [DependencyVerifier] Attempting to download geronimo-connector-builder-1.1-SNAPSHOT.jar.
20:46:04,498 INFO  [DependencyVerifier] Attempting to download geronimo-connector-builder-1.1-SNAPSHOT.jar.
20:46:04,498 INFO  [DependencyVerifier] Attempting to download geronimo-connector-builder-1.1-SNAPSHOT.jar.
20:46:04,498 INFO  [DependencyVerifier] Attempting to download geronimo-connector-builder-1.1-SNAPSHOT.jar.
Error retrieving artifact from [http://www.ibiblio.org/maven]: org.apache.maven.wagon.TransferFailedException: Failed to trasfer file: http://www.ibiblio.org/maven//geronimo/jars/geronimo-connector-builder-1.1-SNAPSHOT.jar. Return code is: 503
20:46:09,017 WARN  [DependencyVerifier] Error retrieving artifact from [http://www.ibiblio.org/maven]: org.apache.maven.wagon.TransferFailedException: Failed to trasfer file: http://www.ibiblio.org/maven//geronimo/jars/geronimo-connector-builder-1.1-SNAPSHOT.jar. Return code is: 503
20:46:09,017 WARN  [DependencyVerifier] Error retrieving artifact from [http://www.ibiblio.org/maven]: org.apache.maven.wagon.TransferFailedException: Failed to trasfer file: http://www.ibiblio.org/maven//geronimo/jars/geronimo-connector-builder-1.1-SNAPSHOT.jar. Return code is: 503
20:46:09,017 WARN  [DependencyVerifier] Error retrieving artifact from [http://www.ibiblio.org/maven]: org.apache.maven.wagon.TransferFailedException: Failed to trasfer file: http://www.ibiblio.org/maven//geronimo/jars/geronimo-connector-builder-1.1-SNAPSHOT.jar. Return code is: 503
20:46:09,017 WARN  [DependencyVerifier] Error retrieving artifact from [http://www.ibiblio.org/maven]: org.apache.maven.wagon.TransferFailedException: Failed to trasfer file: http://www.ibiblio.org/maven//geronimo/jars/geronimo-connector-builder-1.1-SNAPSHOT.jar. Return code is: 503
build:start:

multiproject:install-callback:
    [echo] Running jar:install for Geronimo :: Axis :: Builder
java:prepare-filesystem:

java:compile:
<depend closure="false" srcdir="1.4" dump="false" destdir="/home/continuum/continuum-1.0.2/apps/continuum/work/68/modules/axis-builder/target/classes"></depend>    [echo] Compiling to /home/continuum/continuum-1.0.2/apps/continuum/work/68/modules/axis-builder/target/classes

java:jar-resources:

test:prepare-filesystem:

test:test-resources:

test:compile:

test:test:
    [echo] NOTICE: Skipping tests; they seem to have passed already
    [echo] No tests to run.
Running post goal: test:test
20:46:10,567 INFO  [PostGoalTag] Running post goal: test:test
20:46:10,567 INFO  [PostGoalTag] Running post goal: test:test
20:46:10,567 INFO  [PostGoalTag] Running post goal: test:test
20:46:10,567 INFO  [PostGoalTag] Running post goal: test:test

jar:jar:

jar:install:
    [echo] Installing...
Uploading to geronimo/jars/geronimo-axis-builder-1.1-SNAPSHOT.jar: 
.................... (218K)
Uploading to geronimo/poms/geronimo-axis-builder-1.1-SNAPSHOT.pom: 
.................... (15K)

+----------------------------------------

build:end:

20:46:10,939 INFO  [ReactorTag] +----------------------------------------
20:46:10,939 INFO  [ReactorTag] +----------------------------------------
20:46:10,939 INFO  [ReactorTag] +----------------------------------------
20:46:10,939 INFO  [ReactorTag] +----------------------------------------
| geronimo and geronimo-plugins Geronimo :: Client
20:46:10,939 INFO  [ReactorTag] | geronimo and geronimo-plugins Geronimo :: Client
20:46:10,939 INFO  [ReactorTag] | geronimo and geronimo-plugins Geronimo :: Client
20:46:10,939 INFO  [ReactorTag] | geronimo and geronimo-plugins Geronimo :: Client
20:46:10,939 INFO  [ReactorTag] | geronimo and geronimo-plugins Geronimo :: Client
| Memory: 19M/36M
20:46:10,939 INFO  [ReactorTag] | Memory: 19M/36M
20:46:10,939 INFO  [ReactorTag] | Memory: 19M/36M
20:46:10,939 INFO  [ReactorTag] | Memory: 19M/36M
20:46:10,939 INFO  [ReactorTag] | Memory: 19M/36M
+----------------------------------------
20:46:10,939 INFO  [ReactorTag] +----------------------------------------
20:46:10,939 INFO  [ReactorTag] +----------------------------------------
20:46:10,939 INFO  [ReactorTag] +----------------------------------------
20:46:10,939 INFO  [ReactorTag] +----------------------------------------
DEPRECATED: the default goal should be specified in the <build> section of project.xml instead of maven.xml
20:46:10,950 WARN  [PluginScriptParser] DEPRECATED: the default goal should be specified in the <build> section of project.xml instead of maven.xml
20:46:10,950 WARN  [PluginScriptParser] DEPRECATED: the default goal should be specified in the <build> section of project.xml instead of maven.xml
20:46:10,950 WARN  [PluginScriptParser] DEPRECATED: the default goal should be specified in the <build> section of project.xml instead of maven.xml
20:46:10,950 WARN  [PluginScriptParser] DEPRECATED: the default goal should be specified in the <build> section of project.xml instead of maven.xml
build:start:

multiproject:install-callback:
    [echo] Running jar:install for Geronimo :: Client
java:prepare-filesystem:

java:compile:
<depend closure="false" srcdir="1.4" dump="false" destdir="/home/continuum/continuum-1.0.2/apps/continuum/work/68/modules/client/target/classes"></depend>    [echo] Compiling to /home/continuum/continuum-1.0.2/apps/continuum/work/68/modules/client/target/classes

java:jar-resources:

test:prepare-filesystem:

test:test-resources:

test:compile:
    [echo] No test source files to compile.

test:test:
    [echo] NOTICE: Skipping tests; they seem to have passed already
    [echo] No tests to run.
Running post goal: test:test
20:46:12,022 INFO  [PostGoalTag] Running post goal: test:test
20:46:12,022 INFO  [PostGoalTag] Running post goal: test:test
20:46:12,022 INFO  [PostGoalTag] Running post goal: test:test
20:46:12,022 INFO  [PostGoalTag] Running post goal: test:test

jar:jar:

jar:install:
    [echo] Installing...
Uploading to geronimo/jars/geronimo-client-1.1-SNAPSHOT.jar: 
.................... (14K)
Uploading to geronimo/poms/geronimo-client-1.1-SNAPSHOT.pom: 
.................... (12K)

+----------------------------------------

build:end:

20:46:12,292 INFO  [ReactorTag] +----------------------------------------
20:46:12,292 INFO  [ReactorTag] +----------------------------------------
20:46:12,292 INFO  [ReactorTag] +----------------------------------------
20:46:12,292 INFO  [ReactorTag] +----------------------------------------
| geronimo and geronimo-plugins Geronimo :: Client Builder
20:46:12,292 INFO  [ReactorTag] | geronimo and geronimo-plugins Geronimo :: Client Builder
20:46:12,292 INFO  [ReactorTag] | geronimo and geronimo-plugins Geronimo :: Client Builder
20:46:12,292 INFO  [ReactorTag] | geronimo and geronimo-plugins Geronimo :: Client Builder
20:46:12,292 INFO  [ReactorTag] | geronimo and geronimo-plugins Geronimo :: Client Builder
| Memory: 19M/36M
20:46:12,292 INFO  [ReactorTag] | Memory: 19M/36M
20:46:12,292 INFO  [ReactorTag] | Memory: 19M/36M
20:46:12,292 INFO  [ReactorTag] | Memory: 19M/36M
20:46:12,292 INFO  [ReactorTag] | Memory: 19M/36M
+----------------------------------------
20:46:12,292 INFO  [ReactorTag] +----------------------------------------
20:46:12,292 INFO  [ReactorTag] +----------------------------------------
20:46:12,292 INFO  [ReactorTag] +----------------------------------------
20:46:12,292 INFO  [ReactorTag] +----------------------------------------
DEPRECATED: the default goal should be specified in the <build> section of project.xml instead of maven.xml
20:46:12,312 WARN  [PluginScriptParser] DEPRECATED: the default goal should be specified in the <build> section of project.xml instead of maven.xml
20:46:12,312 WARN  [PluginScriptParser] DEPRECATED: the default goal should be specified in the <build> section of project.xml instead of maven.xml
20:46:12,312 WARN  [PluginScriptParser] DEPRECATED: the default goal should be specified in the <build> section of project.xml instead of maven.xml
20:46:12,312 WARN  [PluginScriptParser] DEPRECATED: the default goal should be specified in the <build> section of project.xml instead of maven.xml
DEPRECATED: the default goal should be specified in the <build> section of project.xml instead of maven.xml
20:46:12,313 WARN  [PluginScriptParser] DEPRECATED: the default goal should be specified in the <build> section of project.xml instead of maven.xml
20:46:12,313 WARN  [PluginScriptParser] DEPRECATED: the default goal should be specified in the <build> section of project.xml instead of maven.xml
20:46:12,313 WARN  [PluginScriptParser] DEPRECATED: the default goal should be specified in the <build> section of project.xml instead of maven.xml
20:46:12,313 WARN  [PluginScriptParser] DEPRECATED: the default goal should be specified in the <build> section of project.xml instead of maven.xml
Attempting to download geronimo-client-1.1-SNAPSHOT.jar.
20:46:12,642 INFO  [DependencyVerifier] Attempting to download geronimo-client-1.1-SNAPSHOT.jar.
20:46:12,642 INFO  [DependencyVerifier] Attempting to download geronimo-client-1.1-SNAPSHOT.jar.
20:46:12,642 INFO  [DependencyVerifier] Attempting to download geronimo-client-1.1-SNAPSHOT.jar.
20:46:12,642 INFO  [DependencyVerifier] Attempting to download geronimo-client-1.1-SNAPSHOT.jar.
Error retrieving artifact from [http://www.ibiblio.org/maven]: org.apache.maven.wagon.TransferFailedException: Failed to trasfer file: http://www.ibiblio.org/maven//geronimo/jars/geronimo-client-1.1-SNAPSHOT.jar. Return code is: 503
20:46:13,284 WARN  [DependencyVerifier] Error retrieving artifact from [http://www.ibiblio.org/maven]: org.apache.maven.wagon.TransferFailedException: Failed to trasfer file: http://www.ibiblio.org/maven//geronimo/jars/geronimo-client-1.1-SNAPSHOT.jar. Return code is: 503
20:46:13,284 WARN  [DependencyVerifier] Error retrieving artifact from [http://www.ibiblio.org/maven]: org.apache.maven.wagon.TransferFailedException: Failed to trasfer file: http://www.ibiblio.org/maven//geronimo/jars/geronimo-client-1.1-SNAPSHOT.jar. Return code is: 503
20:46:13,284 WARN  [DependencyVerifier] Error retrieving artifact from [http://www.ibiblio.org/maven]: org.apache.maven.wagon.TransferFailedException: Failed to trasfer file: http://www.ibiblio.org/maven//geronimo/jars/geronimo-client-1.1-SNAPSHOT.jar. Return code is: 503
20:46:13,284 WARN  [DependencyVerifier] Error retrieving artifact from [http://www.ibiblio.org/maven]: org.apache.maven.wagon.TransferFailedException: Failed to trasfer file: http://www.ibiblio.org/maven//geronimo/jars/geronimo-client-1.1-SNAPSHOT.jar. Return code is: 503
build:start:

multiproject:install-callback:
    [echo] Running jar:install for Geronimo :: Client Builder
java:prepare-filesystem:

java:compile:
<depend closure="false" srcdir="1.4" dump="false" destdir="/home/continuum/continuum-1.0.2/apps/continuum/work/68/modules/client-builder/target/classes"></depend>    [echo] Compiling to /home/continuum/continuum-1.0.2/apps/continuum/work/68/modules/client-builder/target/classes
    [javac] Compiling 1 source file to /home/continuum/continuum-1.0.2/apps/continuum/work/68/modules/client-builder/target/classes
Running post goal: java:compile
20:46:14,280 INFO  [PostGoalTag] Running post goal: java:compile
20:46:14,280 INFO  [PostGoalTag] Running post goal: java:compile
20:46:14,280 INFO  [PostGoalTag] Running post goal: java:compile
20:46:14,280 INFO  [PostGoalTag] Running post goal: java:compile
geronimo:dependency:


java:jar-resources:
Copying 1 file to /home/continuum/continuum-1.0.2/apps/continuum/work/68/modules/client-builder/target/classes

test:prepare-filesystem:

test:test-resources:

test:compile:

test:test:
    [junit] Running org.apache.geronimo.client.builder.PlanParsingTest
    [junit] Tests run: 3, Failures: 0, Errors: 0, Time elapsed: 0.814 sec
Running post goal: test:test
20:46:15,811 INFO  [PostGoalTag] Running post goal: test:test
20:46:15,811 INFO  [PostGoalTag] Running post goal: test:test
20:46:15,811 INFO  [PostGoalTag] Running post goal: test:test
20:46:15,811 INFO  [PostGoalTag] Running post goal: test:test

jar:jar:
    [jar] Building jar: /home/continuum/continuum-1.0.2/apps/continuum/work/68/modules/client-builder/target/geronimo-client-builder-1.1-SNAPSHOT.jar

jar:install:
    [echo] Installing...
Uploading to geronimo/jars/geronimo-client-builder-1.1-SNAPSHOT.jar: 
.................... (47K)
Uploading to geronimo/poms/geronimo-client-builder-1.1-SNAPSHOT.pom: 
.................... (15K)

+----------------------------------------

build:end:

20:46:16,185 INFO  [ReactorTag] +----------------------------------------
20:46:16,185 INFO  [ReactorTag] +----------------------------------------
20:46:16,185 INFO  [ReactorTag] +----------------------------------------
20:46:16,185 INFO  [ReactorTag] +----------------------------------------
| geronimo and geronimo-plugins Geronimo :: Console Web
20:46:16,186 INFO  [ReactorTag] | geronimo and geronimo-plugins Geronimo :: Console Web
20:46:16,186 INFO  [ReactorTag] | geronimo and geronimo-plugins Geronimo :: Console Web
20:46:16,186 INFO  [ReactorTag] | geronimo and geronimo-plugins Geronimo :: Console Web
20:46:16,186 INFO  [ReactorTag] | geronimo and geronimo-plugins Geronimo :: Console Web
| Memory: 29M/36M
20:46:16,186 INFO  [ReactorTag] | Memory: 29M/36M
20:46:16,186 INFO  [ReactorTag] | Memory: 29M/36M
20:46:16,186 INFO  [ReactorTag] | Memory: 29M/36M
20:46:16,186 INFO  [ReactorTag] | Memory: 29M/36M
+----------------------------------------
20:46:16,186 INFO  [ReactorTag] +----------------------------------------
20:46:16,186 INFO  [ReactorTag] +----------------------------------------
20:46:16,186 INFO  [ReactorTag] +----------------------------------------
20:46:16,186 INFO  [ReactorTag] +----------------------------------------
DEPRECATED: the default goal should be specified in the <build> section of project.xml instead of maven.xml
20:46:16,210 WARN  [PluginScriptParser] DEPRECATED: the default goal should be specified in the <build> section of project.xml instead of maven.xml
20:46:16,210 WARN  [PluginScriptParser] DEPRECATED: the default goal should be specified in the <build> section of project.xml instead of maven.xml
20:46:16,210 WARN  [PluginScriptParser] DEPRECATED: the default goal should be specified in the <build> section of project.xml instead of maven.xml
20:46:16,210 WARN  [PluginScriptParser] DEPRECATED: the default goal should be specified in the <build> section of project.xml instead of maven.xml
DEPRECATED: the default goal should be specified in the <build> section of project.xml instead of maven.xml
20:46:16,212 WARN  [PluginScriptParser] DEPRECATED: the default goal should be specified in the <build> section of project.xml instead of maven.xml
20:46:16,212 WARN  [PluginScriptParser] DEPRECATED: the default goal should be specified in the <build> section of project.xml instead of maven.xml
20:46:16,212 WARN  [PluginScriptParser] DEPRECATED: the default goal should be specified in the <build> section of project.xml instead of maven.xml
20:46:16,212 WARN  [PluginScriptParser] DEPRECATED: the default goal should be specified in the <build> section of project.xml instead of maven.xml
build:start:

multiproject:install-callback:
    [echo] Running jar:install for Geronimo :: Console Web
java:prepare-filesystem:

java:compile:
<depend closure="false" srcdir="1.4" dump="false" destdir="/home/continuum/continuum-1.0.2/apps/continuum/work/68/modules/console-web/target/classes"></depend>    [echo] Compiling to /home/continuum/continuum-1.0.2/apps/continuum/work/68/modules/console-web/target/classes

java:jar-resources:

test:prepare-filesystem:

test:test-resources:

test:compile:
    [echo] No test source files to compile.

test:test:
    [echo] NOTICE: Skipping tests; they seem to have passed already
    [echo] No tests to run.
Running post goal: test:test
20:46:17,289 INFO  [PostGoalTag] Running post goal: test:test
20:46:17,289 INFO  [PostGoalTag] Running post goal: test:test
20:46:17,289 INFO  [PostGoalTag] Running post goal: test:test
20:46:17,289 INFO  [PostGoalTag] Running post goal: test:test

jar:jar:

jar:install:
    [echo] Installing...
Uploading to geronimo/jars/geronimo-console-web-1.1-SNAPSHOT.jar: 
.................... (17K)
Uploading to geronimo/poms/geronimo-console-web-1.1-SNAPSHOT.pom: 
.................... (11K)

+----------------------------------------

build:end:

20:46:17,560 INFO  [ReactorTag] +----------------------------------------
20:46:17,560 INFO  [ReactorTag] +----------------------------------------
20:46:17,560 INFO  [ReactorTag] +----------------------------------------
20:46:17,560 INFO  [ReactorTag] +----------------------------------------
| geronimo and geronimo-plugins Geronimo :: Configuration Converter
20:46:17,560 INFO  [ReactorTag] | geronimo and geronimo-plugins Geronimo :: Configuration Converter
20:46:17,560 INFO  [ReactorTag] | geronimo and geronimo-plugins Geronimo :: Configuration Converter
20:46:17,560 INFO  [ReactorTag] | geronimo and geronimo-plugins Geronimo :: Configuration Converter
20:46:17,560 INFO  [ReactorTag] | geronimo and geronimo-plugins Geronimo :: Configuration Converter
| Memory: 29M/36M
20:46:17,560 INFO  [ReactorTag] | Memory: 29M/36M
20:46:17,560 INFO  [ReactorTag] | Memory: 29M/36M
20:46:17,560 INFO  [ReactorTag] | Memory: 29M/36M
20:46:17,560 INFO  [ReactorTag] | Memory: 29M/36M
+----------------------------------------
20:46:17,560 INFO  [ReactorTag] +----------------------------------------
20:46:17,560 INFO  [ReactorTag] +----------------------------------------
20:46:17,560 INFO  [ReactorTag] +----------------------------------------
20:46:17,560 INFO  [ReactorTag] +----------------------------------------
DEPRECATED: the default goal should be specified in the <build> section of project.xml instead of maven.xml
20:46:17,588 WARN  [PluginScriptParser] DEPRECATED: the default goal should be specified in the <build> section of project.xml instead of maven.xml
20:46:17,588 WARN  [PluginScriptParser] DEPRECATED: the default goal should be specified in the <build> section of project.xml instead of maven.xml
20:46:17,588 WARN  [PluginScriptParser] DEPRECATED: the default goal should be specified in the <build> section of project.xml instead of maven.xml
20:46:17,588 WARN  [PluginScriptParser] DEPRECATED: the default goal should be specified in the <build> section of project.xml instead of maven.xml
DEPRECATED: the default goal should be specified in the <build> section of project.xml instead of maven.xml
20:46:17,589 WARN  [PluginScriptParser] DEPRECATED: the default goal should be specified in the <build> section of project.xml instead of maven.xml
20:46:17,589 WARN  [PluginScriptParser] DEPRECATED: the default goal should be specified in the <build> section of project.xml instead of maven.xml
20:46:17,589 WARN  [PluginScriptParser] DEPRECATED: the default goal should be specified in the <build> section of project.xml instead of maven.xml
20:46:17,589 WARN  [PluginScriptParser] DEPRECATED: the default goal should be specified in the <build> section of project.xml instead of maven.xml
build:start:

multiproject:install-callback:
    [echo] Running jar:install for Geronimo :: Configuration Converter
java:prepare-filesystem:

java:compile:
<depend closure="false" srcdir="1.4" dump="false" destdir="/home/continuum/continuum-1.0.2/apps/continuum/work/68/modules/converter/target/classes"></depend>    [echo] Compiling to /home/continuum/continuum-1.0.2/apps/continuum/work/68/modules/converter/target/classes

java:jar-resources:

test:prepare-filesystem:

test:test-resources:

test:compile:
    [echo] No test source files to compile.

test:test:
    [echo] NOTICE: Skipping tests; they seem to have passed already
    [echo] No tests to run.
Running post goal: test:test
20:46:18,655 INFO  [PostGoalTag] Running post goal: test:test
20:46:18,655 INFO  [PostGoalTag] Running post goal: test:test
20:46:18,655 INFO  [PostGoalTag] Running post goal: test:test
20:46:18,655 INFO  [PostGoalTag] Running post goal: test:test

jar:jar:

jar:install:
    [echo] Installing...
Uploading to geronimo/jars/geronimo-converter-1.1-SNAPSHOT.jar: 
.................... (25K)
Uploading to geronimo/poms/geronimo-converter-1.1-SNAPSHOT.pom: 
.................... (11K)

+----------------------------------------

build:end:

20:46:18,931 INFO  [ReactorTag] +----------------------------------------
20:46:18,931 INFO  [ReactorTag] +----------------------------------------
20:46:18,931 INFO  [ReactorTag] +----------------------------------------
20:46:18,931 INFO  [ReactorTag] +----------------------------------------
| geronimo and geronimo-plugins Geronimo :: Web :: Builder
20:46:18,931 INFO  [ReactorTag] | geronimo and geronimo-plugins Geronimo :: Web :: Builder
20:46:18,931 INFO  [ReactorTag] | geronimo and geronimo-plugins Geronimo :: Web :: Builder
20:46:18,931 INFO  [ReactorTag] | geronimo and geronimo-plugins Geronimo :: Web :: Builder
20:46:18,931 INFO  [ReactorTag] | geronimo and geronimo-plugins Geronimo :: Web :: Builder
| Memory: 30M/36M
20:46:18,931 INFO  [ReactorTag] | Memory: 30M/36M
20:46:18,931 INFO  [ReactorTag] | Memory: 30M/36M
20:46:18,931 INFO  [ReactorTag] | Memory: 30M/36M
20:46:18,931 INFO  [ReactorTag] | Memory: 30M/36M
+----------------------------------------
20:46:18,931 INFO  [ReactorTag] +----------------------------------------
20:46:18,931 INFO  [ReactorTag] +----------------------------------------
20:46:18,931 INFO  [ReactorTag] +----------------------------------------
20:46:18,931 INFO  [ReactorTag] +----------------------------------------
DEPRECATED: the default goal should be specified in the <build> section of project.xml instead of maven.xml
20:46:18,958 WARN  [PluginScriptParser] DEPRECATED: the default goal should be specified in the <build> section of project.xml instead of maven.xml
20:46:18,958 WARN  [PluginScriptParser] DEPRECATED: the default goal should be specified in the <build> section of project.xml instead of maven.xml
20:46:18,958 WARN  [PluginScriptParser] DEPRECATED: the default goal should be specified in the <build> section of project.xml instead of maven.xml
20:46:18,958 WARN  [PluginScriptParser] DEPRECATED: the default goal should be specified in the <build> section of project.xml instead of maven.xml
DEPRECATED: the default goal should be specified in the <build> section of project.xml instead of maven.xml
20:46:18,959 WARN  [PluginScriptParser] DEPRECATED: the default goal should be specified in the <build> section of project.xml instead of maven.xml
20:46:18,959 WARN  [PluginScriptParser] DEPRECATED: the default goal should be specified in the <build> section of project.xml instead of maven.xml
20:46:18,959 WARN  [PluginScriptParser] DEPRECATED: the default goal should be specified in the <build> section of project.xml instead of maven.xml
20:46:18,959 WARN  [PluginScriptParser] DEPRECATED: the default goal should be specified in the <build> section of project.xml instead of maven.xml
build:start:

multiproject:install-callback:
    [echo] Running jar:install for Geronimo :: Web :: Builder
java:prepare-filesystem:

java:compile:
<depend closure="false" srcdir="1.4" dump="false" destdir="/home/continuum/continuum-1.0.2/apps/continuum/work/68/modules/web-builder/target/classes"></depend>    [echo] Compiling to /home/continuum/continuum-1.0.2/apps/continuum/work/68/modules/web-builder/target/classes
    [javac] Compiling 1 source file to /home/continuum/continuum-1.0.2/apps/continuum/work/68/modules/web-builder/target/classes
    [javac] Note: /home/continuum/continuum-1.0.2/apps/continuum/work/68/modules/web-builder/src/java/org/apache/geronimo/web/deployment/AbstractWebModuleBuilder.java uses or overrides a deprecated API.
    [javac] Note: Recompile with -deprecation for details.

java:jar-resources:

test:prepare-filesystem:

test:test-resources:

test:compile:

test:test:
    [junit] Running org.apache.geronimo.web.deployment.GenericToSpecificPlanConverterTest
    [junit] Tests run: 3, Failures: 0, Errors: 0, Time elapsed: 1.332 sec
    [junit] Running org.apache.geronimo.web.deployment.WebAppDConfigTest
    [junit] Tests run: 2, Failures: 0, Errors: 0, Time elapsed: 1.265 sec
Running post goal: test:test
20:46:24,496 INFO  [PostGoalTag] Running post goal: test:test
20:46:24,496 INFO  [PostGoalTag] Running post goal: test:test
20:46:24,496 INFO  [PostGoalTag] Running post goal: test:test
20:46:24,496 INFO  [PostGoalTag] Running post goal: test:test

jar:jar:
    [jar] Building jar: /home/continuum/continuum-1.0.2/apps/continuum/work/68/modules/web-builder/target/geronimo-web-builder-1.1-SNAPSHOT.jar

jar:install:
    [echo] Installing...
Uploading to geronimo/jars/geronimo-web-builder-1.1-SNAPSHOT.jar: 
.................... (51K)
Uploading to geronimo/poms/geronimo-web-builder-1.1-SNAPSHOT.pom: 
.................... (13K)

+----------------------------------------

build:end:

20:46:25,019 INFO  [ReactorTag] +----------------------------------------
20:46:25,019 INFO  [ReactorTag] +----------------------------------------
20:46:25,019 INFO  [ReactorTag] +----------------------------------------
20:46:25,019 INFO  [ReactorTag] +----------------------------------------
| geronimo and geronimo-plugins Geronimo :: Deploy :: JSR-88
20:46:25,019 INFO  [ReactorTag] | geronimo and geronimo-plugins Geronimo :: Deploy :: JSR-88
20:46:25,019 INFO  [ReactorTag] | geronimo and geronimo-plugins Geronimo :: Deploy :: JSR-88
20:46:25,019 INFO  [ReactorTag] | geronimo and geronimo-plugins Geronimo :: Deploy :: JSR-88
20:46:25,019 INFO  [ReactorTag] | geronimo and geronimo-plugins Geronimo :: Deploy :: JSR-88
| Memory: 36M/36M
20:46:25,019 INFO  [ReactorTag] | Memory: 36M/36M
20:46:25,019 INFO  [ReactorTag] | Memory: 36M/36M
20:46:25,019 INFO  [ReactorTag] | Memory: 36M/36M
20:46:25,019 INFO  [ReactorTag] | Memory: 36M/36M
+----------------------------------------
20:46:25,019 INFO  [ReactorTag] +----------------------------------------
20:46:25,019 INFO  [ReactorTag] +----------------------------------------
20:46:25,019 INFO  [ReactorTag] +----------------------------------------
20:46:25,019 INFO  [ReactorTag] +----------------------------------------
DEPRECATED: the default goal should be specified in the <build> section of project.xml instead of maven.xml
20:46:25,055 WARN  [PluginScriptParser] DEPRECATED: the default goal should be specified in the <build> section of project.xml instead of maven.xml
20:46:25,055 WARN  [PluginScriptParser] DEPRECATED: the default goal should be specified in the <build> section of project.xml instead of maven.xml
20:46:25,055 WARN  [PluginScriptParser] DEPRECATED: the default goal should be specified in the <build> section of project.xml instead of maven.xml
20:46:25,055 WARN  [PluginScriptParser] DEPRECATED: the default goal should be specified in the <build> section of project.xml instead of maven.xml
DEPRECATED: the default goal should be specified in the <build> section of project.xml instead of maven.xml
20:46:25,057 WARN  [PluginScriptParser] DEPRECATED: the default goal should be specified in the <build> section of project.xml instead of maven.xml
20:46:25,057 WARN  [PluginScriptParser] DEPRECATED: the default goal should be specified in the <build> section of project.xml instead of maven.xml
20:46:25,057 WARN  [PluginScriptParser] DEPRECATED: the default goal should be specified in the <build> section of project.xml instead of maven.xml
20:46:25,057 WARN  [PluginScriptParser] DEPRECATED: the default goal should be specified in the <build> section of project.xml instead of maven.xml
Attempting to download geronimo-web-builder-1.1-SNAPSHOT.jar.
20:46:25,739 INFO  [DependencyVerifier] Attempting to download geronimo-web-builder-1.1-SNAPSHOT.jar.
20:46:25,739 INFO  [DependencyVerifier] Attempting to download geronimo-web-builder-1.1-SNAPSHOT.jar.
20:46:25,739 INFO  [DependencyVerifier] Attempting to download geronimo-web-builder-1.1-SNAPSHOT.jar.
20:46:25,739 INFO  [DependencyVerifier] Attempting to download geronimo-web-builder-1.1-SNAPSHOT.jar.
build:start:

multiproject:install-callback:
    [echo] Running jar:install for Geronimo :: Deploy :: JSR-88
java:prepare-filesystem:

java:compile:
<depend closure="false" srcdir="1.4" dump="false" destdir="/home/continuum/continuum-1.0.2/apps/continuum/work/68/modules/deploy-jsr88/target/classes"></depend>    [echo] Compiling to /home/continuum/continuum-1.0.2/apps/continuum/work/68/modules/deploy-jsr88/target/classes

java:jar-resources:

test:prepare-filesystem:

test:test-resources:

test:compile:

test:test:
    [echo] NOTICE: Skipping tests; they seem to have passed already
    [echo] No tests to run.
Running post goal: test:test
20:46:27,907 INFO  [PostGoalTag] Running post goal: test:test
20:46:27,907 INFO  [PostGoalTag] Running post goal: test:test
20:46:27,907 INFO  [PostGoalTag] Running post goal: test:test
20:46:27,907 INFO  [PostGoalTag] Running post goal: test:test

jar:jar:
    [echo] Generating Manifest file for JSR88-Deployer

jar:install:
    [echo] Installing...
Uploading to geronimo/jars/geronimo-deploy-jsr88-1.1-SNAPSHOT.jar: 
.................... (64K)
Uploading to geronimo/poms/geronimo-deploy-jsr88-1.1-SNAPSHOT.pom: 
.................... (13K)

+----------------------------------------

build:end:

20:46:28,750 INFO  [ReactorTag] +----------------------------------------
20:46:28,750 INFO  [ReactorTag] +----------------------------------------
20:46:28,750 INFO  [ReactorTag] +----------------------------------------
20:46:28,750 INFO  [ReactorTag] +----------------------------------------
| geronimo and geronimo-plugins Geronimo :: Deploy :: CLI Tool
20:46:28,750 INFO  [ReactorTag] | geronimo and geronimo-plugins Geronimo :: Deploy :: CLI Tool
20:46:28,750 INFO  [ReactorTag] | geronimo and geronimo-plugins Geronimo :: Deploy :: CLI Tool
20:46:28,750 INFO  [ReactorTag] | geronimo and geronimo-plugins Geronimo :: Deploy :: CLI Tool
20:46:28,750 INFO  [ReactorTag] | geronimo and geronimo-plugins Geronimo :: Deploy :: CLI Tool
| Memory: 20M/36M
20:46:28,750 INFO  [ReactorTag] | Memory: 20M/36M
20:46:28,750 INFO  [ReactorTag] | Memory: 20M/36M
20:46:28,750 INFO  [ReactorTag] | Memory: 20M/36M
20:46:28,750 INFO  [ReactorTag] | Memory: 20M/36M
+----------------------------------------
20:46:28,750 INFO  [ReactorTag] +----------------------------------------
20:46:28,750 INFO  [ReactorTag] +----------------------------------------
20:46:28,750 INFO  [ReactorTag] +----------------------------------------
20:46:28,750 INFO  [ReactorTag] +----------------------------------------
DEPRECATED: the default goal should be specified in the <build> section of project.xml instead of maven.xml
20:46:28,780 WARN  [PluginScriptParser] DEPRECATED: the default goal should be specified in the <build> section of project.xml instead of maven.xml
20:46:28,780 WARN  [PluginScriptParser] DEPRECATED: the default goal should be specified in the <build> section of project.xml instead of maven.xml
20:46:28,780 WARN  [PluginScriptParser] DEPRECATED: the default goal should be specified in the <build> section of project.xml instead of maven.xml
20:46:28,780 WARN  [PluginScriptParser] DEPRECATED: the default goal should be specified in the <build> section of project.xml instead of maven.xml
DEPRECATED: the default goal should be specified in the <build> section of project.xml instead of maven.xml
20:46:28,781 WARN  [PluginScriptParser] DEPRECATED: the default goal should be specified in the <build> section of project.xml instead of maven.xml
20:46:28,781 WARN  [PluginScriptParser] DEPRECATED: the default goal should be specified in the <build> section of project.xml instead of maven.xml
20:46:28,781 WARN  [PluginScriptParser] DEPRECATED: the default goal should be specified in the <build> section of project.xml instead of maven.xml
20:46:28,781 WARN  [PluginScriptParser] DEPRECATED: the default goal should be specified in the <build> section of project.xml instead of maven.xml
Attempting to download geronimo-deploy-jsr88-1.1-SNAPSHOT.jar.
20:46:29,113 INFO  [DependencyVerifier] Attempting to download geronimo-deploy-jsr88-1.1-SNAPSHOT.jar.
20:46:29,113 INFO  [DependencyVerifier] Attempting to download geronimo-deploy-jsr88-1.1-SNAPSHOT.jar.
20:46:29,113 INFO  [DependencyVerifier] Attempting to download geronimo-deploy-jsr88-1.1-SNAPSHOT.jar.
20:46:29,113 INFO  [DependencyVerifier] Attempting to download geronimo-deploy-jsr88-1.1-SNAPSHOT.jar.
build:start:

multiproject:install-callback:
    [echo] Running jar:install for Geronimo :: Deploy :: CLI Tool
java:prepare-filesystem:

java:compile:
<depend closure="false" srcdir="1.4" dump="false" destdir="/home/continuum/continuum-1.0.2/apps/continuum/work/68/modules/deploy-tool/target/classes"></depend>    [echo] Compiling to /home/continuum/continuum-1.0.2/apps/continuum/work/68/modules/deploy-tool/target/classes
    [javac] Compiling 1 source file to /home/continuum/continuum-1.0.2/apps/continuum/work/68/modules/deploy-tool/target/classes

java:jar-resources:

test:prepare-filesystem:

test:test-resources:

test:compile:

test:test:
Running post goal: test:test
20:46:31,383 INFO  [PostGoalTag] Running post goal: test:test
20:46:31,383 INFO  [PostGoalTag] Running post goal: test:test
20:46:31,383 INFO  [PostGoalTag] Running post goal: test:test
20:46:31,383 INFO  [PostGoalTag] Running post goal: test:test

jar:jar:
    [jar] Building jar: /home/continuum/continuum-1.0.2/apps/continuum/work/68/modules/deploy-tool/target/geronimo-deploy-tool-1.1-SNAPSHOT.jar

jar:install:
    [echo] Installing...
Uploading to geronimo/jars/geronimo-deploy-tool-1.1-SNAPSHOT.jar: 
.................... (56K)
Uploading to geronimo/poms/geronimo-deploy-tool-1.1-SNAPSHOT.pom: 
.................... (12K)

+----------------------------------------

build:end:

20:46:31,825 INFO  [ReactorTag] +----------------------------------------
20:46:31,825 INFO  [ReactorTag] +----------------------------------------
20:46:31,825 INFO  [ReactorTag] +----------------------------------------
20:46:31,825 INFO  [ReactorTag] +----------------------------------------
| geronimo and geronimo-plugins Geronimo :: Derby
20:46:31,826 INFO  [ReactorTag] | geronimo and geronimo-plugins Geronimo :: Derby
20:46:31,826 INFO  [ReactorTag] | geronimo and geronimo-plugins Geronimo :: Derby
20:46:31,826 INFO  [ReactorTag] | geronimo and geronimo-plugins Geronimo :: Derby
20:46:31,826 INFO  [ReactorTag] | geronimo and geronimo-plugins Geronimo :: Derby
| Memory: 24M/36M
20:46:31,826 INFO  [ReactorTag] | Memory: 24M/36M
20:46:31,826 INFO  [ReactorTag] | Memory: 24M/36M
20:46:31,826 INFO  [ReactorTag] | Memory: 24M/36M
20:46:31,826 INFO  [ReactorTag] | Memory: 24M/36M
+----------------------------------------
20:46:31,826 INFO  [ReactorTag] +----------------------------------------
20:46:31,826 INFO  [ReactorTag] +----------------------------------------
20:46:31,826 INFO  [ReactorTag] +----------------------------------------
20:46:31,826 INFO  [ReactorTag] +----------------------------------------
DEPRECATED: the default goal should be specified in the <build> section of project.xml instead of maven.xml
20:46:31,836 WARN  [PluginScriptParser] DEPRECATED: the default goal should be specified in the <build> section of project.xml instead of maven.xml
20:46:31,836 WARN  [PluginScriptParser] DEPRECATED: the default goal should be specified in the <build> section of project.xml instead of maven.xml
20:46:31,836 WARN  [PluginScriptParser] DEPRECATED: the default goal should be specified in the <build> section of project.xml instead of maven.xml
20:46:31,836 WARN  [PluginScriptParser] DEPRECATED: the default goal should be specified in the <build> section of project.xml instead of maven.xml
build:start:

multiproject:install-callback:
    [echo] Running jar:install for Geronimo :: Derby
java:prepare-filesystem:

java:compile:
<depend closure="false" srcdir="1.4" dump="false" destdir="/home/continuum/continuum-1.0.2/apps/continuum/work/68/modules/derby/target/classes"></depend>    [echo] Compiling to /home/continuum/continuum-1.0.2/apps/continuum/work/68/modules/derby/target/classes

java:jar-resources:

test:prepare-filesystem:

test:test-resources:

test:compile:

test:test:
    [echo] NOTICE: Skipping tests; they seem to have passed already
    [echo] No tests to run.
Running post goal: test:test
20:46:33,001 INFO  [PostGoalTag] Running post goal: test:test
20:46:33,001 INFO  [PostGoalTag] Running post goal: test:test
20:46:33,001 INFO  [PostGoalTag] Running post goal: test:test
20:46:33,001 INFO  [PostGoalTag] Running post goal: test:test

jar:jar:

jar:install:
    [echo] Installing...
Uploading to geronimo/jars/geronimo-derby-1.1-SNAPSHOT.jar: 
.................... (12K)
Uploading to geronimo/poms/geronimo-derby-1.1-SNAPSHOT.pom: 
.................... (11K)

+----------------------------------------

build:end:

20:46:33,860 INFO  [ReactorTag] +----------------------------------------
20:46:33,860 INFO  [ReactorTag] +----------------------------------------
20:46:33,860 INFO  [ReactorTag] +----------------------------------------
20:46:33,860 INFO  [ReactorTag] +----------------------------------------
| geronimo and geronimo-plugins Geronimo :: Directory
20:46:33,860 INFO  [ReactorTag] | geronimo and geronimo-plugins Geronimo :: Directory
20:46:33,860 INFO  [ReactorTag] | geronimo and geronimo-plugins Geronimo :: Directory
20:46:33,860 INFO  [ReactorTag] | geronimo and geronimo-plugins Geronimo :: Directory
20:46:33,860 INFO  [ReactorTag] | geronimo and geronimo-plugins Geronimo :: Directory
| Memory: 25M/36M
20:46:33,860 INFO  [ReactorTag] | Memory: 25M/36M
20:46:33,860 INFO  [ReactorTag] | Memory: 25M/36M
20:46:33,860 INFO  [ReactorTag] | Memory: 25M/36M
20:46:33,860 INFO  [ReactorTag] | Memory: 25M/36M
+----------------------------------------
20:46:33,861 INFO  [ReactorTag] +----------------------------------------
20:46:33,861 INFO  [ReactorTag] +----------------------------------------
20:46:33,861 INFO  [ReactorTag] +----------------------------------------
20:46:33,861 INFO  [ReactorTag] +----------------------------------------
DEPRECATED: the default goal should be specified in the <build> section of project.xml instead of maven.xml
20:46:33,914 WARN  [PluginScriptParser] DEPRECATED: the default goal should be specified in the <build> section of project.xml instead of maven.xml
20:46:33,914 WARN  [PluginScriptParser] DEPRECATED: the default goal should be specified in the <build> section of project.xml instead of maven.xml
20:46:33,914 WARN  [PluginScriptParser] DEPRECATED: the default goal should be specified in the <build> section of project.xml instead of maven.xml
20:46:33,914 WARN  [PluginScriptParser] DEPRECATED: the default goal should be specified in the <build> section of project.xml instead of maven.xml
DEPRECATED: the default goal should be specified in the <build> section of project.xml instead of maven.xml
20:46:33,916 WARN  [PluginScriptParser] DEPRECATED: the default goal should be specified in the <build> section of project.xml instead of maven.xml
20:46:33,916 WARN  [PluginScriptParser] DEPRECATED: the default goal should be specified in the <build> section of project.xml instead of maven.xml
20:46:33,916 WARN  [PluginScriptParser] DEPRECATED: the default goal should be specified in the <build> section of project.xml instead of maven.xml
20:46:33,916 WARN  [PluginScriptParser] DEPRECATED: the default goal should be specified in the <build> section of project.xml instead of maven.xml
build:start:

multiproject:install-callback:
    [echo] Running jar:install for Geronimo :: Directory
java:prepare-filesystem:

java:compile:
<depend closure="false" srcdir="1.4" dump="false" destdir="/home/continuum/continuum-1.0.2/apps/continuum/work/68/modules/directory/target/classes"></depend>    [echo] Compiling to /home/continuum/continuum-1.0.2/apps/continuum/work/68/modules/directory/target/classes
Running post goal: java:compile
20:46:34,926 INFO  [PostGoalTag] Running post goal: java:compile
20:46:34,926 INFO  [PostGoalTag] Running post goal: java:compile
20:46:34,926 INFO  [PostGoalTag] Running post goal: java:compile
20:46:34,926 INFO  [PostGoalTag] Running post goal: java:compile
geronimo:dependency:


java:jar-resources:
Copying 1 file to /home/continuum/continuum-1.0.2/apps/continuum/work/68/modules/directory/target/classes

test:prepare-filesystem:

test:test-resources:

test:compile:

test:test:
    [echo] NOTICE: Skipping tests; they seem to have passed already
    [echo] No tests to run.
Running post goal: test:test
20:46:35,590 INFO  [PostGoalTag] Running post goal: test:test
20:46:35,590 INFO  [PostGoalTag] Running post goal: test:test
20:46:35,590 INFO  [PostGoalTag] Running post goal: test:test
20:46:35,590 INFO  [PostGoalTag] Running post goal: test:test

jar:jar:
    [jar] Building jar: /home/continuum/continuum-1.0.2/apps/continuum/work/68/modules/directory/target/geronimo-directory-1.1-SNAPSHOT.jar

jar:install:
    [echo] Installing...
Uploading to geronimo/jars/geronimo-directory-1.1-SNAPSHOT.jar: 
.................... (113K)
Uploading to geronimo/poms/geronimo-directory-1.1-SNAPSHOT.pom: 
.................... (18K)

+----------------------------------------

build:end:

20:46:36,103 INFO  [ReactorTag] +----------------------------------------
20:46:36,103 INFO  [ReactorTag] +----------------------------------------
20:46:36,103 INFO  [ReactorTag] +----------------------------------------
20:46:36,103 INFO  [ReactorTag] +----------------------------------------
| geronimo and geronimo-plugins Geronimo :: Deploy :: Hot Deployer
20:46:36,103 INFO  [ReactorTag] | geronimo and geronimo-plugins Geronimo :: Deploy :: Hot Deployer
20:46:36,103 INFO  [ReactorTag] | geronimo and geronimo-plugins Geronimo :: Deploy :: Hot Deployer
20:46:36,103 INFO  [ReactorTag] | geronimo and geronimo-plugins Geronimo :: Deploy :: Hot Deployer
20:46:36,103 INFO  [ReactorTag] | geronimo and geronimo-plugins Geronimo :: Deploy :: Hot Deployer
| Memory: 25M/36M
20:46:36,103 INFO  [ReactorTag] | Memory: 25M/36M
20:46:36,103 INFO  [ReactorTag] | Memory: 25M/36M
20:46:36,103 INFO  [ReactorTag] | Memory: 25M/36M
20:46:36,103 INFO  [ReactorTag] | Memory: 25M/36M
+----------------------------------------
20:46:36,104 INFO  [ReactorTag] +----------------------------------------
20:46:36,104 INFO  [ReactorTag] +----------------------------------------
20:46:36,104 INFO  [ReactorTag] +----------------------------------------
20:46:36,104 INFO  [ReactorTag] +----------------------------------------
DEPRECATED: the default goal should be specified in the <build> section of project.xml instead of maven.xml
20:46:36,134 WARN  [PluginScriptParser] DEPRECATED: the default goal should be specified in the <build> section of project.xml instead of maven.xml
20:46:36,134 WARN  [PluginScriptParser] DEPRECATED: the default goal should be specified in the <build> section of project.xml instead of maven.xml
20:46:36,134 WARN  [PluginScriptParser] DEPRECATED: the default goal should be specified in the <build> section of project.xml instead of maven.xml
20:46:36,134 WARN  [PluginScriptParser] DEPRECATED: the default goal should be specified in the <build> section of project.xml instead of maven.xml
DEPRECATED: the default goal should be specified in the <build> section of project.xml instead of maven.xml
20:46:36,135 WARN  [PluginScriptParser] DEPRECATED: the default goal should be specified in the <build> section of project.xml instead of maven.xml
20:46:36,135 WARN  [PluginScriptParser] DEPRECATED: the default goal should be specified in the <build> section of project.xml instead of maven.xml
20:46:36,135 WARN  [PluginScriptParser] DEPRECATED: the default goal should be specified in the <build> section of project.xml instead of maven.xml
20:46:36,135 WARN  [PluginScriptParser] DEPRECATED: the default goal should be specified in the <build> section of project.xml instead of maven.xml
Attempting to download geronimo-deploy-tool-1.1-SNAPSHOT.jar.
20:46:36,419 INFO  [DependencyVerifier] Attempting to download geronimo-deploy-tool-1.1-SNAPSHOT.jar.
20:46:36,419 INFO  [DependencyVerifier] Attempting to download geronimo-deploy-tool-1.1-SNAPSHOT.jar.
20:46:36,419 INFO  [DependencyVerifier] Attempting to download geronimo-deploy-tool-1.1-SNAPSHOT.jar.
20:46:36,419 INFO  [DependencyVerifier] Attempting to download geronimo-deploy-tool-1.1-SNAPSHOT.jar.
build:start:

multiproject:install-callback:
    [echo] Running jar:install for Geronimo :: Deploy :: Hot Deployer
java:prepare-filesystem:

java:compile:
<depend closure="false" srcdir="1.4" dump="false" destdir="/home/continuum/continuum-1.0.2/apps/continuum/work/68/modules/hot-deploy/target/classes"></depend>    [echo] Compiling to /home/continuum/continuum-1.0.2/apps/continuum/work/68/modules/hot-deploy/target/classes

java:jar-resources:

test:prepare-filesystem:

test:test-resources:

test:compile:
    [echo] No test source files to compile.

test:test:
    [echo] NOTICE: Skipping tests; they seem to have passed already
    [echo] No tests to run.
Running post goal: test:test
20:46:39,483 INFO  [PostGoalTag] Running post goal: test:test
20:46:39,483 INFO  [PostGoalTag] Running post goal: test:test
20:46:39,483 INFO  [PostGoalTag] Running post goal: test:test
20:46:39,483 INFO  [PostGoalTag] Running post goal: test:test

jar:jar:

jar:install:
    [echo] Installing...
Uploading to geronimo/jars/geronimo-hot-deploy-1.1-SNAPSHOT.jar: 
.................... (19K)
Uploading to geronimo/poms/geronimo-hot-deploy-1.1-SNAPSHOT.pom: 
.................... (12K)

+----------------------------------------

build:end:

20:46:39,773 INFO  [ReactorTag] +----------------------------------------
20:46:39,773 INFO  [ReactorTag] +----------------------------------------
20:46:39,773 INFO  [ReactorTag] +----------------------------------------
20:46:39,773 INFO  [ReactorTag] +----------------------------------------
| geronimo and geronimo-plugins Geronimo :: Installer Processing
20:46:39,773 INFO  [ReactorTag] | geronimo and geronimo-plugins Geronimo :: Installer Processing
20:46:39,773 INFO  [ReactorTag] | geronimo and geronimo-plugins Geronimo :: Installer Processing
20:46:39,773 INFO  [ReactorTag] | geronimo and geronimo-plugins Geronimo :: Installer Processing
20:46:39,773 INFO  [ReactorTag] | geronimo and geronimo-plugins Geronimo :: Installer Processing
| Memory: 25M/36M
20:46:39,773 INFO  [ReactorTag] | Memory: 25M/36M
20:46:39,773 INFO  [ReactorTag] | Memory: 25M/36M
20:46:39,773 INFO  [ReactorTag] | Memory: 25M/36M
20:46:39,773 INFO  [ReactorTag] | Memory: 25M/36M
+----------------------------------------
20:46:39,773 INFO  [ReactorTag] +----------------------------------------
20:46:39,773 INFO  [ReactorTag] +----------------------------------------
20:46:39,773 INFO  [ReactorTag] +----------------------------------------
20:46:39,773 INFO  [ReactorTag] +----------------------------------------
DEPRECATED: the default goal should be specified in the <build> section of project.xml instead of maven.xml
20:46:39,797 WARN  [PluginScriptParser] DEPRECATED: the default goal should be specified in the <build> section of project.xml instead of maven.xml
20:46:39,797 WARN  [PluginScriptParser] DEPRECATED: the default goal should be specified in the <build> section of project.xml instead of maven.xml
20:46:39,797 WARN  [PluginScriptParser] DEPRECATED: the default goal should be specified in the <build> section of project.xml instead of maven.xml
20:46:39,797 WARN  [PluginScriptParser] DEPRECATED: the default goal should be specified in the <build> section of project.xml instead of maven.xml
DEPRECATED: the default goal should be specified in the <build> section of project.xml instead of maven.xml
20:46:39,799 WARN  [PluginScriptParser] DEPRECATED: the default goal should be specified in the <build> section of project.xml instead of maven.xml
20:46:39,799 WARN  [PluginScriptParser] DEPRECATED: the default goal should be specified in the <build> section of project.xml instead of maven.xml
20:46:39,799 WARN  [PluginScriptParser] DEPRECATED: the default goal should be specified in the <build> section of project.xml instead of maven.xml
20:46:39,799 WARN  [PluginScriptParser] DEPRECATED: the default goal should be specified in the <build> section of project.xml instead of maven.xml
build:start:

multiproject:install-callback:
    [echo] Running jar:install for Geronimo :: Installer Processing
java:prepare-filesystem:

java:compile:
<depend closure="false" srcdir="1.4" dump="false" destdir="/home/continuum/continuum-1.0.2/apps/continuum/work/68/modules/installer-processing/target/classes"></depend>    [echo] Compiling to /home/continuum/continuum-1.0.2/apps/continuum/work/68/modules/installer-processing/target/classes
Running post goal: java:compile
20:46:40,414 INFO  [PostGoalTag] Running post goal: java:compile
20:46:40,414 INFO  [PostGoalTag] Running post goal: java:compile
20:46:40,414 INFO  [PostGoalTag] Running post goal: java:compile
20:46:40,414 INFO  [PostGoalTag] Running post goal: java:compile
geronimo:dependency:

    [echo] Maven local repo is: /home/continuum/.geronimo-1.1-maven/repository
    [echo] Maven build dir is: /home/continuum/continuum-1.0.2/apps/continuum/work/68/modules/installer-processing/target

java:jar-resources:

test:prepare-filesystem:

test:test-resources:

test:compile:
    [echo] No test source files to compile.

test:test:
    [echo] NOTICE: Skipping tests; they seem to have passed already
    [echo] No tests to run.
Running post goal: test:test
20:46:40,944 INFO  [PostGoalTag] Running post goal: test:test
20:46:40,944 INFO  [PostGoalTag] Running post goal: test:test
20:46:40,944 INFO  [PostGoalTag] Running post goal: test:test
20:46:40,944 INFO  [PostGoalTag] Running post goal: test:test

jar:jar:

jar:install:
    [echo] Installing...
Uploading to geronimo/jars/geronimo-installer-processing-1.1-SNAPSHOT.jar: 
.................... (15K)
Uploading to geronimo/poms/geronimo-installer-processing-1.1-SNAPSHOT.pom: 
.................... (10K)

+----------------------------------------

build:end:

20:46:41,178 INFO  [ReactorTag] +----------------------------------------
20:46:41,178 INFO  [ReactorTag] +----------------------------------------
20:46:41,178 INFO  [ReactorTag] +----------------------------------------
20:46:41,178 INFO  [ReactorTag] +----------------------------------------
| geronimo and geronimo-plugins Geronimo :: Installer Support
20:46:41,178 INFO  [ReactorTag] | geronimo and geronimo-plugins Geronimo :: Installer Support
20:46:41,178 INFO  [ReactorTag] | geronimo and geronimo-plugins Geronimo :: Installer Support
20:46:41,178 INFO  [ReactorTag] | geronimo and geronimo-plugins Geronimo :: Installer Support
20:46:41,178 INFO  [ReactorTag] | geronimo and geronimo-plugins Geronimo :: Installer Support
| Memory: 26M/36M
20:46:41,178 INFO  [ReactorTag] | Memory: 26M/36M
20:46:41,178 INFO  [ReactorTag] | Memory: 26M/36M
20:46:41,178 INFO  [ReactorTag] | Memory: 26M/36M
20:46:41,178 INFO  [ReactorTag] | Memory: 26M/36M
+----------------------------------------
20:46:41,178 INFO  [ReactorTag] +----------------------------------------
20:46:41,178 INFO  [ReactorTag] +----------------------------------------
20:46:41,178 INFO  [ReactorTag] +----------------------------------------
20:46:41,178 INFO  [ReactorTag] +----------------------------------------
DEPRECATED: the default goal should be specified in the <build> section of project.xml instead of maven.xml
20:46:41,195 WARN  [PluginScriptParser] DEPRECATED: the default goal should be specified in the <build> section of project.xml instead of maven.xml
20:46:41,195 WARN  [PluginScriptParser] DEPRECATED: the default goal should be specified in the <build> section of project.xml instead of maven.xml
20:46:41,195 WARN  [PluginScriptParser] DEPRECATED: the default goal should be specified in the <build> section of project.xml instead of maven.xml
20:46:41,195 WARN  [PluginScriptParser] DEPRECATED: the default goal should be specified in the <build> section of project.xml instead of maven.xml
DEPRECATED: the default goal should be specified in the <build> section of project.xml instead of maven.xml
20:46:41,196 WARN  [PluginScriptParser] DEPRECATED: the default goal should be specified in the <build> section of project.xml instead of maven.xml
20:46:41,196 WARN  [PluginScriptParser] DEPRECATED: the default goal should be specified in the <build> section of project.xml instead of maven.xml
20:46:41,196 WARN  [PluginScriptParser] DEPRECATED: the default goal should be specified in the <build> section of project.xml instead of maven.xml
20:46:41,196 WARN  [PluginScriptParser] DEPRECATED: the default goal should be specified in the <build> section of project.xml instead of maven.xml
build:start:

multiproject:install-callback:
    [echo] Running jar:install for Geronimo :: Installer Support
java:prepare-filesystem:

java:compile:
<depend closure="false" srcdir="1.4" dump="false" destdir="/home/continuum/continuum-1.0.2/apps/continuum/work/68/modules/installer-support/target/classes"></depend>    [echo] Compiling to /home/continuum/continuum-1.0.2/apps/continuum/work/68/modules/installer-support/target/classes
Running post goal: java:compile
20:46:41,802 INFO  [PostGoalTag] Running post goal: java:compile
20:46:41,802 INFO  [PostGoalTag] Running post goal: java:compile
20:46:41,802 INFO  [PostGoalTag] Running post goal: java:compile
20:46:41,802 INFO  [PostGoalTag] Running post goal: java:compile
geronimo:dependency:

    [echo] Maven local repo is: /home/continuum/.geronimo-1.1-maven/repository
    [echo] Maven build dir is: /home/continuum/continuum-1.0.2/apps/continuum/work/68/modules/installer-support/target
    [unjar] Expanding: /home/continuum/continuum-1.0.2/apps/continuum/work/68/modules/installer-support/target/standalone-compiler-custom-3.8.0.jar into /home/continuum/continuum-1.0.2/apps/continuum/work/68/modules/installer-support/target/tmp
    [echo] Built Geronimo custom IzPack installer jar
    [echo] Copying standalone-compiler-custom-3.8.0 to local repo

java:jar-resources:

test:prepare-filesystem:

test:test-resources:

test:compile:
    [echo] No test source files to compile.

test:test:
    [echo] NOTICE: Skipping tests; they seem to have passed already
    [echo] No tests to run.
Running post goal: test:test
20:46:43,782 INFO  [PostGoalTag] Running post goal: test:test
20:46:43,782 INFO  [PostGoalTag] Running post goal: test:test
20:46:43,782 INFO  [PostGoalTag] Running post goal: test:test
20:46:43,782 INFO  [PostGoalTag] Running post goal: test:test

jar:jar:

jar:install:
    [echo] Installing...
Uploading to geronimo/jars/geronimo-installer-support-1.1-SNAPSHOT.jar: 
.................... (50K)
Uploading to geronimo/poms/geronimo-installer-support-1.1-SNAPSHOT.pom: 
.................... (10K)

+----------------------------------------

build:end:

20:46:44,047 INFO  [ReactorTag] +----------------------------------------
20:46:44,047 INFO  [ReactorTag] +----------------------------------------
20:46:44,047 INFO  [ReactorTag] +----------------------------------------
20:46:44,047 INFO  [ReactorTag] +----------------------------------------
| geronimo and geronimo-plugins Geronimo :: JavaMail Transport
20:46:44,047 INFO  [ReactorTag] | geronimo and geronimo-plugins Geronimo :: JavaMail Transport
20:46:44,047 INFO  [ReactorTag] | geronimo and geronimo-plugins Geronimo :: JavaMail Transport
20:46:44,047 INFO  [ReactorTag] | geronimo and geronimo-plugins Geronimo :: JavaMail Transport
20:46:44,047 INFO  [ReactorTag] | geronimo and geronimo-plugins Geronimo :: JavaMail Transport
| Memory: 29M/36M
20:46:44,047 INFO  [ReactorTag] | Memory: 29M/36M
20:46:44,047 INFO  [ReactorTag] | Memory: 29M/36M
20:46:44,047 INFO  [ReactorTag] | Memory: 29M/36M
20:46:44,047 INFO  [ReactorTag] | Memory: 29M/36M
+----------------------------------------
20:46:44,048 INFO  [ReactorTag] +----------------------------------------
20:46:44,048 INFO  [ReactorTag] +----------------------------------------
20:46:44,048 INFO  [ReactorTag] +----------------------------------------
20:46:44,048 INFO  [ReactorTag] +----------------------------------------
DEPRECATED: the default goal should be specified in the <build> section of project.xml instead of maven.xml
20:46:44,060 WARN  [PluginScriptParser] DEPRECATED: the default goal should be specified in the <build> section of project.xml instead of maven.xml
20:46:44,060 WARN  [PluginScriptParser] DEPRECATED: the default goal should be specified in the <build> section of project.xml instead of maven.xml
20:46:44,060 WARN  [PluginScriptParser] DEPRECATED: the default goal should be specified in the <build> section of project.xml instead of maven.xml
20:46:44,060 WARN  [PluginScriptParser] DEPRECATED: the default goal should be specified in the <build> section of project.xml instead of maven.xml
build:start:

multiproject:install-callback:
    [echo] Running jar:install for Geronimo :: JavaMail Transport
java:prepare-filesystem:

java:compile:
<depend closure="false" srcdir="1.4" dump="false" destdir="/home/continuum/continuum-1.0.2/apps/continuum/work/68/modules/javamail-transport/target/classes"></depend>    [echo] Compiling to /home/continuum/continuum-1.0.2/apps/continuum/work/68/modules/javamail-transport/target/classes

java:jar-resources:

test:prepare-filesystem:

test:test-resources:

test:compile:
    [echo] No test source files to compile.

test:test:
    [echo] NOTICE: Skipping tests; they seem to have passed already
    [echo] No tests to run.
Running post goal: test:test
20:46:45,151 INFO  [PostGoalTag] Running post goal: test:test
20:46:45,151 INFO  [PostGoalTag] Running post goal: test:test
20:46:45,151 INFO  [PostGoalTag] Running post goal: test:test
20:46:45,151 INFO  [PostGoalTag] Running post goal: test:test

jar:jar:

jar:install:
    [echo] Installing...
Uploading to geronimo/jars/geronimo-javamail-transport-1.1-SNAPSHOT.jar: 
.................... (13K)
Uploading to geronimo/poms/geronimo-javamail-transport-1.1-SNAPSHOT.pom: 
.................... (10K)

+----------------------------------------

build:end:

20:46:45,391 INFO  [ReactorTag] +----------------------------------------
20:46:45,391 INFO  [ReactorTag] +----------------------------------------
20:46:45,391 INFO  [ReactorTag] +----------------------------------------
20:46:45,391 INFO  [ReactorTag] +----------------------------------------
| geronimo and geronimo-plugins Geronimo :: Jetty
20:46:45,391 INFO  [ReactorTag] | geronimo and geronimo-plugins Geronimo :: Jetty
20:46:45,391 INFO  [ReactorTag] | geronimo and geronimo-plugins Geronimo :: Jetty
20:46:45,391 INFO  [ReactorTag] | geronimo and geronimo-plugins Geronimo :: Jetty
20:46:45,391 INFO  [ReactorTag] | geronimo and geronimo-plugins Geronimo :: Jetty
| Memory: 29M/36M
20:46:45,391 INFO  [ReactorTag] | Memory: 29M/36M
20:46:45,391 INFO  [ReactorTag] | Memory: 29M/36M
20:46:45,391 INFO  [ReactorTag] | Memory: 29M/36M
20:46:45,391 INFO  [ReactorTag] | Memory: 29M/36M
+----------------------------------------
20:46:45,392 INFO  [ReactorTag] +----------------------------------------
20:46:45,392 INFO  [ReactorTag] +----------------------------------------
20:46:45,392 INFO  [ReactorTag] +----------------------------------------
20:46:45,392 INFO  [ReactorTag] +----------------------------------------
DEPRECATED: the default goal should be specified in the <build> section of project.xml instead of maven.xml
20:46:45,403 WARN  [PluginScriptParser] DEPRECATED: the default goal should be specified in the <build> section of project.xml instead of maven.xml
20:46:45,403 WARN  [PluginScriptParser] DEPRECATED: the default goal should be specified in the <build> section of project.xml instead of maven.xml
20:46:45,403 WARN  [PluginScriptParser] DEPRECATED: the default goal should be specified in the <build> section of project.xml instead of maven.xml
20:46:45,403 WARN  [PluginScriptParser] DEPRECATED: the default goal should be specified in the <build> section of project.xml instead of maven.xml
DEPRECATED: the default goal should be specified in the <build> section of project.xml instead of maven.xml
20:46:45,404 WARN  [PluginScriptParser] DEPRECATED: the default goal should be specified in the <build> section of project.xml instead of maven.xml
20:46:45,404 WARN  [PluginScriptParser] DEPRECATED: the default goal should be specified in the <build> section of project.xml instead of maven.xml
20:46:45,404 WARN  [PluginScriptParser] DEPRECATED: the default goal should be specified in the <build> section of project.xml instead of maven.xml
20:46:45,404 WARN  [PluginScriptParser] DEPRECATED: the default goal should be specified in the <build> section of project.xml instead of maven.xml
build:start:

multiproject:install-callback:
    [echo] Running jar:install for Geronimo :: Jetty
java:prepare-filesystem:

java:compile:
<depend closure="false" srcdir="1.4" dump="false" destdir="/home/continuum/continuum-1.0.2/apps/continuum/work/68/modules/jetty/target/classes"></depend>    [echo] Compiling to /home/continuum/continuum-1.0.2/apps/continuum/work/68/modules/jetty/target/classes
Running post goal: java:compile
20:46:46,128 INFO  [PostGoalTag] Running post goal: java:compile
20:46:46,128 INFO  [PostGoalTag] Running post goal: java:compile
20:46:46,128 INFO  [PostGoalTag] Running post goal: java:compile
20:46:46,128 INFO  [PostGoalTag] Running post goal: java:compile
geronimo:dependency:


java:jar-resources:
Copying 1 file to /home/continuum/continuum-1.0.2/apps/continuum/work/68/modules/jetty/target/classes

test:prepare-filesystem:

test:test-resources:

test:compile:

test:test:
    [echo] NOTICE: Skipping tests; they seem to have passed already
    [echo] No tests to run.
Running post goal: test:test
20:46:46,771 INFO  [PostGoalTag] Running post goal: test:test
20:46:46,771 INFO  [PostGoalTag] Running post goal: test:test
20:46:46,771 INFO  [PostGoalTag] Running post goal: test:test
20:46:46,771 INFO  [PostGoalTag] Running post goal: test:test

jar:jar:
    [jar] Building jar: /home/continuum/continuum-1.0.2/apps/continuum/work/68/modules/jetty/target/geronimo-jetty-1.1-SNAPSHOT.jar

jar:install:
    [echo] Installing...
Uploading to geronimo/jars/geronimo-jetty-1.1-SNAPSHOT.jar: 
.................... (84K)
Uploading to geronimo/poms/geronimo-jetty-1.1-SNAPSHOT.pom: 
.................... (16K)

+----------------------------------------

build:end:

20:46:47,240 INFO  [ReactorTag] +----------------------------------------
20:46:47,240 INFO  [ReactorTag] +----------------------------------------
20:46:47,240 INFO  [ReactorTag] +----------------------------------------
20:46:47,240 INFO  [ReactorTag] +----------------------------------------
| geronimo and geronimo-plugins Geronimo :: Jetty :: Builder
20:46:47,240 INFO  [ReactorTag] | geronimo and geronimo-plugins Geronimo :: Jetty :: Builder
20:46:47,240 INFO  [ReactorTag] | geronimo and geronimo-plugins Geronimo :: Jetty :: Builder
20:46:47,240 INFO  [ReactorTag] | geronimo and geronimo-plugins Geronimo :: Jetty :: Builder
20:46:47,240 INFO  [ReactorTag] | geronimo and geronimo-plugins Geronimo :: Jetty :: Builder
| Memory: 29M/36M
20:46:47,240 INFO  [ReactorTag] | Memory: 29M/36M
20:46:47,240 INFO  [ReactorTag] | Memory: 29M/36M
20:46:47,240 INFO  [ReactorTag] | Memory: 29M/36M
20:46:47,240 INFO  [ReactorTag] | Memory: 29M/36M
+----------------------------------------
20:46:47,240 INFO  [ReactorTag] +----------------------------------------
20:46:47,240 INFO  [ReactorTag] +----------------------------------------
20:46:47,240 INFO  [ReactorTag] +----------------------------------------
20:46:47,240 INFO  [ReactorTag] +----------------------------------------
DEPRECATED: the default goal should be specified in the <build> section of project.xml instead of maven.xml
20:46:47,266 WARN  [PluginScriptParser] DEPRECATED: the default goal should be specified in the <build> section of project.xml instead of maven.xml
20:46:47,266 WARN  [PluginScriptParser] DEPRECATED: the default goal should be specified in the <build> section of project.xml instead of maven.xml
20:46:47,266 WARN  [PluginScriptParser] DEPRECATED: the default goal should be specified in the <build> section of project.xml instead of maven.xml
20:46:47,266 WARN  [PluginScriptParser] DEPRECATED: the default goal should be specified in the <build> section of project.xml instead of maven.xml
DEPRECATED: the default goal should be specified in the <build> section of project.xml instead of maven.xml
20:46:47,267 WARN  [PluginScriptParser] DEPRECATED: the default goal should be specified in the <build> section of project.xml instead of maven.xml
20:46:47,267 WARN  [PluginScriptParser] DEPRECATED: the default goal should be specified in the <build> section of project.xml instead of maven.xml
20:46:47,267 WARN  [PluginScriptParser] DEPRECATED: the default goal should be specified in the <build> section of project.xml instead of maven.xml
20:46:47,267 WARN  [PluginScriptParser] DEPRECATED: the default goal should be specified in the <build> section of project.xml instead of maven.xml
Attempting to download geronimo-jetty-1.1-SNAPSHOT.jar.
20:46:47,604 INFO  [DependencyVerifier] Attempting to download geronimo-jetty-1.1-SNAPSHOT.jar.
20:46:47,604 INFO  [DependencyVerifier] Attempting to download geronimo-jetty-1.1-SNAPSHOT.jar.
20:46:47,604 INFO  [DependencyVerifier] Attempting to download geronimo-jetty-1.1-SNAPSHOT.jar.
20:46:47,604 INFO  [DependencyVerifier] Attempting to download geronimo-jetty-1.1-SNAPSHOT.jar.
build:start:

multiproject:install-callback:
    [echo] Running jar:install for Geronimo :: Jetty :: Builder
java:prepare-filesystem:

java:compile:
<depend closure="false" srcdir="1.4" dump="false" destdir="/home/continuum/continuum-1.0.2/apps/continuum/work/68/modules/jetty-builder/target/classes"></depend>    [echo] Compiling to /home/continuum/continuum-1.0.2/apps/continuum/work/68/modules/jetty-builder/target/classes
    [javac] Compiling 1 source file to /home/continuum/continuum-1.0.2/apps/continuum/work/68/modules/jetty-builder/target/classes

java:jar-resources:

test:prepare-filesystem:

test:test-resources:

test:compile:
    [javac] Compiling 1 source file to /home/continuum/continuum-1.0.2/apps/continuum/work/68/modules/jetty-builder/target/test-classes

test:test:
    [junit] Running org.apache.geronimo.jetty.deployment.JettyModuleBuilderTest
    [junit] Tests run: 1, Failures: 0, Errors: 0, Time elapsed: 4.152 sec
    [junit] Running org.apache.geronimo.jetty.deployment.PlanParsingTest
    [junit] Tests run: 15, Failures: 0, Errors: 0, Time elapsed: 1.098 sec
    [junit] Running org.apache.geronimo.jetty.deployment.StartupOrderComparatorTest
    [junit] Tests run: 5, Failures: 0, Errors: 0, Time elapsed: 0.799 sec
Running post goal: test:test
20:46:59,525 INFO  [PostGoalTag] Running post goal: test:test
20:46:59,525 INFO  [PostGoalTag] Running post goal: test:test
20:46:59,525 INFO  [PostGoalTag] Running post goal: test:test
20:46:59,525 INFO  [PostGoalTag] Running post goal: test:test

jar:jar:
    [jar] Building jar: /home/continuum/continuum-1.0.2/apps/continuum/work/68/modules/jetty-builder/target/geronimo-jetty-builder-1.1-SNAPSHOT.jar

jar:install:
    [echo] Installing...
Uploading to geronimo/jars/geronimo-jetty-builder-1.1-SNAPSHOT.jar: 
.................... (77K)
Uploading to geronimo/poms/geronimo-jetty-builder-1.1-SNAPSHOT.pom: 
.................... (18K)

+----------------------------------------

build:end:

20:47:00,044 INFO  [ReactorTag] +----------------------------------------
20:47:00,044 INFO  [ReactorTag] +----------------------------------------
20:47:00,044 INFO  [ReactorTag] +----------------------------------------
20:47:00,044 INFO  [ReactorTag] +----------------------------------------
| geronimo and geronimo-plugins Geronimo :: JMX Remoting
20:47:00,044 INFO  [ReactorTag] | geronimo and geronimo-plugins Geronimo :: JMX Remoting
20:47:00,044 INFO  [ReactorTag] | geronimo and geronimo-plugins Geronimo :: JMX Remoting
20:47:00,044 INFO  [ReactorTag] | geronimo and geronimo-plugins Geronimo :: JMX Remoting
20:47:00,044 INFO  [ReactorTag] | geronimo and geronimo-plugins Geronimo :: JMX Remoting
| Memory: 37M/47M
20:47:00,044 INFO  [ReactorTag] | Memory: 37M/47M
20:47:00,044 INFO  [ReactorTag] | Memory: 37M/47M
20:47:00,044 INFO  [ReactorTag] | Memory: 37M/47M
20:47:00,044 INFO  [ReactorTag] | Memory: 37M/47M
+----------------------------------------
20:47:00,045 INFO  [ReactorTag] +----------------------------------------
20:47:00,045 INFO  [ReactorTag] +----------------------------------------
20:47:00,045 INFO  [ReactorTag] +----------------------------------------
20:47:00,045 INFO  [ReactorTag] +----------------------------------------
DEPRECATED: the default goal should be specified in the <build> section of project.xml instead of maven.xml
20:47:00,058 WARN  [PluginScriptParser] DEPRECATED: the default goal should be specified in the <build> section of project.xml instead of maven.xml
20:47:00,058 WARN  [PluginScriptParser] DEPRECATED: the default goal should be specified in the <build> section of project.xml instead of maven.xml
20:47:00,058 WARN  [PluginScriptParser] DEPRECATED: the default goal should be specified in the <build> section of project.xml instead of maven.xml
20:47:00,058 WARN  [PluginScriptParser] DEPRECATED: the default goal should be specified in the <build> section of project.xml instead of maven.xml
build:start:

multiproject:install-callback:
    [echo] Running jar:install for Geronimo :: JMX Remoting
java:prepare-filesystem:

java:compile:
<depend closure="false" srcdir="1.4" dump="false" destdir="/home/continuum/continuum-1.0.2/apps/continuum/work/68/modules/jmx-remoting/target/classes"></depend>    [echo] Compiling to /home/continuum/continuum-1.0.2/apps/continuum/work/68/modules/jmx-remoting/target/classes

java:jar-resources:

test:prepare-filesystem:

test:test-resources:

test:compile:

test:test:
    [echo] NOTICE: Skipping tests; they seem to have passed already
    [echo] No tests to run.
Running post goal: test:test
20:47:01,209 INFO  [PostGoalTag] Running post goal: test:test
20:47:01,209 INFO  [PostGoalTag] Running post goal: test:test
20:47:01,209 INFO  [PostGoalTag] Running post goal: test:test
20:47:01,209 INFO  [PostGoalTag] Running post goal: test:test

jar:jar:

jar:install:
    [echo] Installing...
Uploading to geronimo/jars/geronimo-jmxremoting-1.1-SNAPSHOT.jar: 
.................... (10K)
Uploading to geronimo/poms/geronimo-jmxremoting-1.1-SNAPSHOT.pom: 
.................... (11K)

+----------------------------------------

build:end:

20:47:01,467 INFO  [ReactorTag] +----------------------------------------
20:47:01,467 INFO  [ReactorTag] +----------------------------------------
20:47:01,467 INFO  [ReactorTag] +----------------------------------------
20:47:01,467 INFO  [ReactorTag] +----------------------------------------
| geronimo and geronimo-plugins Geronimo :: Mail
20:47:01,467 INFO  [ReactorTag] | geronimo and geronimo-plugins Geronimo :: Mail
20:47:01,467 INFO  [ReactorTag] | geronimo and geronimo-plugins Geronimo :: Mail
20:47:01,467 INFO  [ReactorTag] | geronimo and geronimo-plugins Geronimo :: Mail
20:47:01,467 INFO  [ReactorTag] | geronimo and geronimo-plugins Geronimo :: Mail
| Memory: 36M/47M
20:47:01,467 INFO  [ReactorTag] | Memory: 36M/47M
20:47:01,467 INFO  [ReactorTag] | Memory: 36M/47M
20:47:01,467 INFO  [ReactorTag] | Memory: 36M/47M
20:47:01,467 INFO  [ReactorTag] | Memory: 36M/47M
+----------------------------------------
20:47:01,468 INFO  [ReactorTag] +----------------------------------------
20:47:01,468 INFO  [ReactorTag] +----------------------------------------
20:47:01,468 INFO  [ReactorTag] +----------------------------------------
20:47:01,468 INFO  [ReactorTag] +----------------------------------------
DEPRECATED: the default goal should be specified in the <build> section of project.xml instead of maven.xml
20:47:01,478 WARN  [PluginScriptParser] DEPRECATED: the default goal should be specified in the <build> section of project.xml instead of maven.xml
20:47:01,478 WARN  [PluginScriptParser] DEPRECATED: the default goal should be specified in the <build> section of project.xml instead of maven.xml
20:47:01,478 WARN  [PluginScriptParser] DEPRECATED: the default goal should be specified in the <build> section of project.xml instead of maven.xml
20:47:01,478 WARN  [PluginScriptParser] DEPRECATED: the default goal should be specified in the <build> section of project.xml instead of maven.xml
build:start:

multiproject:install-callback:
    [echo] Running jar:install for Geronimo :: Mail
java:prepare-filesystem:

java:compile:
<depend closure="false" srcdir="1.4" dump="false" destdir="/home/continuum/continuum-1.0.2/apps/continuum/work/68/modules/mail/target/classes"></depend>    [echo] Compiling to /home/continuum/continuum-1.0.2/apps/continuum/work/68/modules/mail/target/classes

java:jar-resources:

test:prepare-filesystem:

test:test-resources:

test:compile:

test:test:
    [echo] NOTICE: Skipping tests; they seem to have passed already
    [echo] No tests to run.
Running post goal: test:test
20:47:02,559 INFO  [PostGoalTag] Running post goal: test:test
20:47:02,559 INFO  [PostGoalTag] Running post goal: test:test
20:47:02,559 INFO  [PostGoalTag] Running post goal: test:test
20:47:02,559 INFO  [PostGoalTag] Running post goal: test:test

jar:jar:

jar:install:
    [echo] Installing...
Uploading to geronimo/jars/geronimo-mail-1.1-SNAPSHOT.jar: 
.................... (21K)
Uploading to geronimo/poms/geronimo-mail-1.1-SNAPSHOT.pom: 
.................... (11K)

+----------------------------------------

build:end:

20:47:02,808 INFO  [ReactorTag] +----------------------------------------
20:47:02,808 INFO  [ReactorTag] +----------------------------------------
20:47:02,808 INFO  [ReactorTag] +----------------------------------------
20:47:02,808 INFO  [ReactorTag] +----------------------------------------
| geronimo and geronimo-plugins Geronimo :: Scripts
20:47:02,808 INFO  [ReactorTag] | geronimo and geronimo-plugins Geronimo :: Scripts
20:47:02,808 INFO  [ReactorTag] | geronimo and geronimo-plugins Geronimo :: Scripts
20:47:02,808 INFO  [ReactorTag] | geronimo and geronimo-plugins Geronimo :: Scripts
20:47:02,808 INFO  [ReactorTag] | geronimo and geronimo-plugins Geronimo :: Scripts
| Memory: 36M/47M
20:47:02,808 INFO  [ReactorTag] | Memory: 36M/47M
20:47:02,808 INFO  [ReactorTag] | Memory: 36M/47M
20:47:02,808 INFO  [ReactorTag] | Memory: 36M/47M
20:47:02,808 INFO  [ReactorTag] | Memory: 36M/47M
+----------------------------------------
20:47:02,808 INFO  [ReactorTag] +----------------------------------------
20:47:02,808 INFO  [ReactorTag] +----------------------------------------
20:47:02,808 INFO  [ReactorTag] +----------------------------------------
20:47:02,808 INFO  [ReactorTag] +----------------------------------------
DEPRECATED: the default goal should be specified in the <build> section of project.xml instead of maven.xml
20:47:02,821 WARN  [PluginScriptParser] DEPRECATED: the default goal should be specified in the <build> section of project.xml instead of maven.xml
20:47:02,821 WARN  [PluginScriptParser] DEPRECATED: the default goal should be specified in the <build> section of project.xml instead of maven.xml
20:47:02,821 WARN  [PluginScriptParser] DEPRECATED: the default goal should be specified in the <build> section of project.xml instead of maven.xml
20:47:02,821 WARN  [PluginScriptParser] DEPRECATED: the default goal should be specified in the <build> section of project.xml instead of maven.xml
build:start:

multiproject:install-callback:
    [echo] Running jar:install for Geronimo :: Scripts
java:prepare-filesystem:

java:compile:
    [echo] Compiling to /home/continuum/continuum-1.0.2/apps/continuum/work/68/modules/scripts/target/classes
    [echo] No java source files to compile.

java:jar-resources:

test:prepare-filesystem:

test:test-resources:

test:compile:
    [echo] No test source files to compile.

test:test:
    [echo] NOTICE: Skipping tests; they seem to have passed already
    [echo] No tests to run.
Running post goal: test:test
20:47:03,899 INFO  [PostGoalTag] Running post goal: test:test
20:47:03,899 INFO  [PostGoalTag] Running post goal: test:test
20:47:03,899 INFO  [PostGoalTag] Running post goal: test:test
20:47:03,899 INFO  [PostGoalTag] Running post goal: test:test

jar:jar:

jar:install:
    [echo] Installing...
Uploading to geronimo/jars/geronimo-scripts-1.1-SNAPSHOT.jar: 
.................... (3214K)
Uploading to geronimo/poms/geronimo-scripts-1.1-SNAPSHOT.pom: 
.................... (10K)

+----------------------------------------

build:end:

20:47:04,898 INFO  [ReactorTag] +----------------------------------------
20:47:04,898 INFO  [ReactorTag] +----------------------------------------
20:47:04,898 INFO  [ReactorTag] +----------------------------------------
20:47:04,898 INFO  [ReactorTag] +----------------------------------------
| geronimo and geronimo-plugins Geronimo :: Timer
20:47:04,898 INFO  [ReactorTag] | geronimo and geronimo-plugins Geronimo :: Timer
20:47:04,898 INFO  [ReactorTag] | geronimo and geronimo-plugins Geronimo :: Timer
20:47:04,898 INFO  [ReactorTag] | geronimo and geronimo-plugins Geronimo :: Timer
20:47:04,898 INFO  [ReactorTag] | geronimo and geronimo-plugins Geronimo :: Timer
| Memory: 35M/47M
20:47:04,898 INFO  [ReactorTag] | Memory: 35M/47M
20:47:04,898 INFO  [ReactorTag] | Memory: 35M/47M
20:47:04,898 INFO  [ReactorTag] | Memory: 35M/47M
20:47:04,898 INFO  [ReactorTag] | Memory: 35M/47M
+----------------------------------------
20:47:04,899 INFO  [ReactorTag] +----------------------------------------
20:47:04,899 INFO  [ReactorTag] +----------------------------------------
20:47:04,899 INFO  [ReactorTag] +----------------------------------------
20:47:04,899 INFO  [ReactorTag] +----------------------------------------
DEPRECATED: the default goal should be specified in the <build> section of project.xml instead of maven.xml
20:47:04,909 WARN  [PluginScriptParser] DEPRECATED: the default goal should be specified in the <build> section of project.xml instead of maven.xml
20:47:04,909 WARN  [PluginScriptParser] DEPRECATED: the default goal should be specified in the <build> section of project.xml instead of maven.xml
20:47:04,909 WARN  [PluginScriptParser] DEPRECATED: the default goal should be specified in the <build> section of project.xml instead of maven.xml
20:47:04,909 WARN  [PluginScriptParser] DEPRECATED: the default goal should be specified in the <build> section of project.xml instead of maven.xml
build:start:

multiproject:install-callback:
    [echo] Running jar:install for Geronimo :: Timer
java:prepare-filesystem:

java:compile:
<depend closure="false" srcdir="1.4" dump="false" destdir="/home/continuum/continuum-1.0.2/apps/continuum/work/68/modules/timer/target/classes"></depend>    [echo] Compiling to /home/continuum/continuum-1.0.2/apps/continuum/work/68/modules/timer/target/classes

java:jar-resources:

test:prepare-filesystem:

test:test-resources:

test:compile:

test:test:
    [echo] NOTICE: Skipping tests; they seem to have passed already
    [echo] No tests to run.
Running post goal: test:test
20:47:06,012 INFO  [PostGoalTag] Running post goal: test:test
20:47:06,012 INFO  [PostGoalTag] Running post goal: test:test
20:47:06,012 INFO  [PostGoalTag] Running post goal: test:test
20:47:06,012 INFO  [PostGoalTag] Running post goal: test:test

jar:jar:

jar:install:
    [echo] Installing...
Uploading to geronimo/jars/geronimo-timer-1.1-SNAPSHOT.jar: 
.................... (38K)
Uploading to geronimo/poms/geronimo-timer-1.1-SNAPSHOT.pom: 
.................... (12K)

+----------------------------------------

build:end:

20:47:06,294 INFO  [ReactorTag] +----------------------------------------
20:47:06,294 INFO  [ReactorTag] +----------------------------------------
20:47:06,294 INFO  [ReactorTag] +----------------------------------------
20:47:06,294 INFO  [ReactorTag] +----------------------------------------
| geronimo and geronimo-plugins Geronimo :: Tomcat
20:47:06,294 INFO  [ReactorTag] | geronimo and geronimo-plugins Geronimo :: Tomcat
20:47:06,294 INFO  [ReactorTag] | geronimo and geronimo-plugins Geronimo :: Tomcat
20:47:06,294 INFO  [ReactorTag] | geronimo and geronimo-plugins Geronimo :: Tomcat
20:47:06,294 INFO  [ReactorTag] | geronimo and geronimo-plugins Geronimo :: Tomcat
| Memory: 38M/47M
20:47:06,294 INFO  [ReactorTag] | Memory: 38M/47M
20:47:06,294 INFO  [ReactorTag] | Memory: 38M/47M
20:47:06,294 INFO  [ReactorTag] | Memory: 38M/47M
20:47:06,294 INFO  [ReactorTag] | Memory: 38M/47M
+----------------------------------------
20:47:06,295 INFO  [ReactorTag] +----------------------------------------
20:47:06,295 INFO  [ReactorTag] +----------------------------------------
20:47:06,295 INFO  [ReactorTag] +----------------------------------------
20:47:06,295 INFO  [ReactorTag] +----------------------------------------
DEPRECATED: the default goal should be specified in the <build> section of project.xml instead of maven.xml
20:47:06,327 WARN  [PluginScriptParser] DEPRECATED: the default goal should be specified in the <build> section of project.xml instead of maven.xml
20:47:06,327 WARN  [PluginScriptParser] DEPRECATED: the default goal should be specified in the <build> section of project.xml instead of maven.xml
20:47:06,327 WARN  [PluginScriptParser] DEPRECATED: the default goal should be specified in the <build> section of project.xml instead of maven.xml
20:47:06,327 WARN  [PluginScriptParser] DEPRECATED: the default goal should be specified in the <build> section of project.xml instead of maven.xml
DEPRECATED: the default goal should be specified in the <build> section of project.xml instead of maven.xml
20:47:06,329 WARN  [PluginScriptParser] DEPRECATED: the default goal should be specified in the <build> section of project.xml instead of maven.xml
20:47:06,329 WARN  [PluginScriptParser] DEPRECATED: the default goal should be specified in the <build> section of project.xml instead of maven.xml
20:47:06,329 WARN  [PluginScriptParser] DEPRECATED: the default goal should be specified in the <build> section of project.xml instead of maven.xml
20:47:06,329 WARN  [PluginScriptParser] DEPRECATED: the default goal should be specified in the <build> section of project.xml instead of maven.xml
build:start:

multiproject:install-callback:
    [echo] Running jar:install for Geronimo :: Tomcat
java:prepare-filesystem:

java:compile:
<depend closure="false" srcdir="1.4" dump="false" destdir="/home/continuum/continuum-1.0.2/apps/continuum/work/68/modules/tomcat/target/classes"></depend>    [echo] Compiling to /home/continuum/continuum-1.0.2/apps/continuum/work/68/modules/tomcat/target/classes
Running post goal: java:compile
20:47:07,061 INFO  [PostGoalTag] Running post goal: java:compile
20:47:07,061 INFO  [PostGoalTag] Running post goal: java:compile
20:47:07,061 INFO  [PostGoalTag] Running post goal: java:compile
20:47:07,061 INFO  [PostGoalTag] Running post goal: java:compile
geronimo:dependency:


java:jar-resources:
Copying 1 file to /home/continuum/continuum-1.0.2/apps/continuum/work/68/modules/tomcat/target/classes

test:prepare-filesystem:

test:test-resources:

test:compile:

test:test:
    [echo] NOTICE: Skipping tests; they seem to have passed already
    [echo] No tests to run.
Running post goal: test:test
20:47:08,414 INFO  [PostGoalTag] Running post goal: test:test
20:47:08,414 INFO  [PostGoalTag] Running post goal: test:test
20:47:08,414 INFO  [PostGoalTag] Running post goal: test:test
20:47:08,414 INFO  [PostGoalTag] Running post goal: test:test

jar:jar:
    [jar] Building jar: /home/continuum/continuum-1.0.2/apps/continuum/work/68/modules/tomcat/target/geronimo-tomcat-1.1-SNAPSHOT.jar

jar:install:
    [echo] Installing...
Uploading to geronimo/jars/geronimo-tomcat-1.1-SNAPSHOT.jar: 
.................... (132K)
Uploading to geronimo/poms/geronimo-tomcat-1.1-SNAPSHOT.pom: 
.................... (20K)

+----------------------------------------

build:end:

20:47:08,995 INFO  [ReactorTag] +----------------------------------------
20:47:08,995 INFO  [ReactorTag] +----------------------------------------
20:47:08,995 INFO  [ReactorTag] +----------------------------------------
20:47:08,995 INFO  [ReactorTag] +----------------------------------------
| geronimo and geronimo-plugins Geronimo :: Tomcat :: Builder
20:47:08,995 INFO  [ReactorTag] | geronimo and geronimo-plugins Geronimo :: Tomcat :: Builder
20:47:08,995 INFO  [ReactorTag] | geronimo and geronimo-plugins Geronimo :: Tomcat :: Builder
20:47:08,995 INFO  [ReactorTag] | geronimo and geronimo-plugins Geronimo :: Tomcat :: Builder
20:47:08,995 INFO  [ReactorTag] | geronimo and geronimo-plugins Geronimo :: Tomcat :: Builder
| Memory: 39M/47M
20:47:08,995 INFO  [ReactorTag] | Memory: 39M/47M
20:47:08,995 INFO  [ReactorTag] | Memory: 39M/47M
20:47:08,995 INFO  [ReactorTag] | Memory: 39M/47M
20:47:08,995 INFO  [ReactorTag] | Memory: 39M/47M
+----------------------------------------
20:47:08,996 INFO  [ReactorTag] +----------------------------------------
20:47:08,996 INFO  [ReactorTag] +----------------------------------------
20:47:08,996 INFO  [ReactorTag] +----------------------------------------
20:47:08,996 INFO  [ReactorTag] +----------------------------------------
DEPRECATED: the default goal should be specified in the <build> section of project.xml instead of maven.xml
20:47:09,037 WARN  [PluginScriptParser] DEPRECATED: the default goal should be specified in the <build> section of project.xml instead of maven.xml
20:47:09,037 WARN  [PluginScriptParser] DEPRECATED: the default goal should be specified in the <build> section of project.xml instead of maven.xml
20:47:09,037 WARN  [PluginScriptParser] DEPRECATED: the default goal should be specified in the <build> section of project.xml instead of maven.xml
20:47:09,037 WARN  [PluginScriptParser] DEPRECATED: the default goal should be specified in the <build> section of project.xml instead of maven.xml
DEPRECATED: the default goal should be specified in the <build> section of project.xml instead of maven.xml
20:47:09,039 WARN  [PluginScriptParser] DEPRECATED: the default goal should be specified in the <build> section of project.xml instead of maven.xml
20:47:09,039 WARN  [PluginScriptParser] DEPRECATED: the default goal should be specified in the <build> section of project.xml instead of maven.xml
20:47:09,039 WARN  [PluginScriptParser] DEPRECATED: the default goal should be specified in the <build> section of project.xml instead of maven.xml
20:47:09,039 WARN  [PluginScriptParser] DEPRECATED: the default goal should be specified in the <build> section of project.xml instead of maven.xml
Attempting to download geronimo-tomcat-1.1-SNAPSHOT.jar.
20:47:09,370 INFO  [DependencyVerifier] Attempting to download geronimo-tomcat-1.1-SNAPSHOT.jar.
20:47:09,370 INFO  [DependencyVerifier] Attempting to download geronimo-tomcat-1.1-SNAPSHOT.jar.
20:47:09,370 INFO  [DependencyVerifier] Attempting to download geronimo-tomcat-1.1-SNAPSHOT.jar.
20:47:09,370 INFO  [DependencyVerifier] Attempting to download geronimo-tomcat-1.1-SNAPSHOT.jar.
Attempting to download geronimo-axis-builder-1.1-SNAPSHOT.jar.
20:47:10,625 INFO  [DependencyVerifier] Attempting to download geronimo-axis-builder-1.1-SNAPSHOT.jar.
20:47:10,625 INFO  [DependencyVerifier] Attempting to download geronimo-axis-builder-1.1-SNAPSHOT.jar.
20:47:10,625 INFO  [DependencyVerifier] Attempting to download geronimo-axis-builder-1.1-SNAPSHOT.jar.
20:47:10,625 INFO  [DependencyVerifier] Attempting to download geronimo-axis-builder-1.1-SNAPSHOT.jar.
build:start:

multiproject:install-callback:
    [echo] Running jar:install for Geronimo :: Tomcat :: Builder
java:prepare-filesystem:

java:compile:
<depend closure="false" srcdir="1.4" dump="false" destdir="/home/continuum/continuum-1.0.2/apps/continuum/work/68/modules/tomcat-builder/target/classes"></depend>    [echo] Compiling to /home/continuum/continuum-1.0.2/apps/continuum/work/68/modules/tomcat-builder/target/classes
    [javac] Compiling 1 source file to /home/continuum/continuum-1.0.2/apps/continuum/work/68/modules/tomcat-builder/target/classes

java:jar-resources:

test:prepare-filesystem:

test:test-resources:

test:compile:
    [javac] Compiling 1 source file to /home/continuum/continuum-1.0.2/apps/continuum/work/68/modules/tomcat-builder/target/test-classes

test:test:
    [junit] Running org.apache.geronimo.tomcat.deployment.PlanParsingTest
    [junit] Tests run: 2, Failures: 0, Errors: 0, Time elapsed: 1.3 sec
    [junit] Running org.apache.geronimo.tomcat.deployment.TomcatModuleBuilderTest
    [junit] Tests run: 2, Failures: 0, Errors: 0, Time elapsed: 7.617 sec
Running post goal: test:test
20:47:26,696 INFO  [PostGoalTag] Running post goal: test:test
20:47:26,696 INFO  [PostGoalTag] Running post goal: test:test
20:47:26,696 INFO  [PostGoalTag] Running post goal: test:test
20:47:26,696 INFO  [PostGoalTag] Running post goal: test:test

jar:jar:
    [jar] Building jar: /home/continuum/continuum-1.0.2/apps/continuum/work/68/modules/tomcat-builder/target/geronimo-tomcat-builder-1.1-SNAPSHOT.jar

jar:install:
    [echo] Installing...
Uploading to geronimo/jars/geronimo-tomcat-builder-1.1-SNAPSHOT.jar: 
.................... (73K)
Uploading to geronimo/poms/geronimo-tomcat-builder-1.1-SNAPSHOT.pom: 
.................... (20K)

+----------------------------------------

build:end:

20:47:27,502 INFO  [ReactorTag] +----------------------------------------
20:47:27,502 INFO  [ReactorTag] +----------------------------------------
20:47:27,502 INFO  [ReactorTag] +----------------------------------------
20:47:27,502 INFO  [ReactorTag] +----------------------------------------
| geronimo and geronimo-plugins Geronimo :: Upgrade
20:47:27,503 INFO  [ReactorTag] | geronimo and geronimo-plugins Geronimo :: Upgrade
20:47:27,503 INFO  [ReactorTag] | geronimo and geronimo-plugins Geronimo :: Upgrade
20:47:27,503 INFO  [ReactorTag] | geronimo and geronimo-plugins Geronimo :: Upgrade
20:47:27,503 INFO  [ReactorTag] | geronimo and geronimo-plugins Geronimo :: Upgrade
| Memory: 38M/50M
20:47:27,503 INFO  [ReactorTag] | Memory: 38M/50M
20:47:27,503 INFO  [ReactorTag] | Memory: 38M/50M
20:47:27,503 INFO  [ReactorTag] | Memory: 38M/50M
20:47:27,503 INFO  [ReactorTag] | Memory: 38M/50M
+----------------------------------------
20:47:27,503 INFO  [ReactorTag] +----------------------------------------
20:47:27,503 INFO  [ReactorTag] +----------------------------------------
20:47:27,503 INFO  [ReactorTag] +----------------------------------------
20:47:27,503 INFO  [ReactorTag] +----------------------------------------
DEPRECATED: the default goal should be specified in the <build> section of project.xml instead of maven.xml
20:47:27,514 WARN  [PluginScriptParser] DEPRECATED: the default goal should be specified in the <build> section of project.xml instead of maven.xml
20:47:27,514 WARN  [PluginScriptParser] DEPRECATED: the default goal should be specified in the <build> section of project.xml instead of maven.xml
20:47:27,514 WARN  [PluginScriptParser] DEPRECATED: the default goal should be specified in the <build> section of project.xml instead of maven.xml
20:47:27,514 WARN  [PluginScriptParser] DEPRECATED: the default goal should be specified in the <build> section of project.xml instead of maven.xml
Attempting to download geronimo-client-builder-1.1-SNAPSHOT.jar.
20:47:27,847 INFO  [DependencyVerifier] Attempting to download geronimo-client-builder-1.1-SNAPSHOT.jar.
20:47:27,847 INFO  [DependencyVerifier] Attempting to download geronimo-client-builder-1.1-SNAPSHOT.jar.
20:47:27,847 INFO  [DependencyVerifier] Attempting to download geronimo-client-builder-1.1-SNAPSHOT.jar.
20:47:27,847 INFO  [DependencyVerifier] Attempting to download geronimo-client-builder-1.1-SNAPSHOT.jar.
Attempting to download geronimo-jetty-builder-1.1-SNAPSHOT.jar.
20:47:29,102 INFO  [DependencyVerifier] Attempting to download geronimo-jetty-builder-1.1-SNAPSHOT.jar.
20:47:29,102 INFO  [DependencyVerifier] Attempting to download geronimo-jetty-builder-1.1-SNAPSHOT.jar.
20:47:29,102 INFO  [DependencyVerifier] Attempting to download geronimo-jetty-builder-1.1-SNAPSHOT.jar.
20:47:29,102 INFO  [DependencyVerifier] Attempting to download geronimo-jetty-builder-1.1-SNAPSHOT.jar.
Attempting to download geronimo-tomcat-builder-1.1-SNAPSHOT.jar.
20:47:31,757 INFO  [DependencyVerifier] Attempting to download geronimo-tomcat-builder-1.1-SNAPSHOT.jar.
20:47:31,757 INFO  [DependencyVerifier] Attempting to download geronimo-tomcat-builder-1.1-SNAPSHOT.jar.
20:47:31,757 INFO  [DependencyVerifier] Attempting to download geronimo-tomcat-builder-1.1-SNAPSHOT.jar.
20:47:31,757 INFO  [DependencyVerifier] Attempting to download geronimo-tomcat-builder-1.1-SNAPSHOT.jar.
Attempting to download openejb-builder-2.1-SNAPSHOT.jar.
20:47:32,919 INFO  [DependencyVerifier] Attempting to download openejb-builder-2.1-SNAPSHOT.jar.
20:47:32,919 INFO  [DependencyVerifier] Attempting to download openejb-builder-2.1-SNAPSHOT.jar.
20:47:32,919 INFO  [DependencyVerifier] Attempting to download openejb-builder-2.1-SNAPSHOT.jar.
20:47:32,919 INFO  [DependencyVerifier] Attempting to download openejb-builder-2.1-SNAPSHOT.jar.
build:start:

multiproject:install-callback:
    [echo] Running jar:install for Geronimo :: Upgrade
java:prepare-filesystem:

java:compile:
<depend closure="false" srcdir="1.4" dump="false" destdir="/home/continuum/continuum-1.0.2/apps/continuum/work/68/modules/upgrade/target/classes"></depend>    [echo] Compiling to /home/continuum/continuum-1.0.2/apps/continuum/work/68/modules/upgrade/target/classes

java:jar-resources:

test:prepare-filesystem:

test:test-resources:

test:compile:

test:test:
    [echo] NOTICE: Skipping tests; they seem to have passed already
    [echo] No tests to run.
Running post goal: test:test
20:47:34,958 INFO  [PostGoalTag] Running post goal: test:test
20:47:34,958 INFO  [PostGoalTag] Running post goal: test:test
20:47:34,958 INFO  [PostGoalTag] Running post goal: test:test
20:47:34,958 INFO  [PostGoalTag] Running post goal: test:test

jar:jar:

jar:install:
    [echo] Installing...
Uploading to geronimo/jars/geronimo-upgrade-1.1-SNAPSHOT.jar: 
.................... (10K)
Uploading to geronimo/poms/geronimo-upgrade-1.1-SNAPSHOT.pom: 
.................... (11K)

+----------------------------------------

build:end:

20:47:35,214 INFO  [ReactorTag] +----------------------------------------
20:47:35,214 INFO  [ReactorTag] +----------------------------------------
20:47:35,214 INFO  [ReactorTag] +----------------------------------------
20:47:35,214 INFO  [ReactorTag] +----------------------------------------
| geronimo and geronimo-plugins Geronimo :: Maven Assembly Plugin
20:47:35,215 INFO  [ReactorTag] | geronimo and geronimo-plugins Geronimo :: Maven Assembly Plugin
20:47:35,215 INFO  [ReactorTag] | geronimo and geronimo-plugins Geronimo :: Maven Assembly Plugin
20:47:35,215 INFO  [ReactorTag] | geronimo and geronimo-plugins Geronimo :: Maven Assembly Plugin
20:47:35,215 INFO  [ReactorTag] | geronimo and geronimo-plugins Geronimo :: Maven Assembly Plugin
| Memory: 39M/50M
20:47:35,215 INFO  [ReactorTag] | Memory: 39M/50M
20:47:35,215 INFO  [ReactorTag] | Memory: 39M/50M
20:47:35,215 INFO  [ReactorTag] | Memory: 39M/50M
20:47:35,215 INFO  [ReactorTag] | Memory: 39M/50M
+----------------------------------------
20:47:35,215 INFO  [ReactorTag] +----------------------------------------
20:47:35,215 INFO  [ReactorTag] +----------------------------------------
20:47:35,215 INFO  [ReactorTag] +----------------------------------------
20:47:35,215 INFO  [ReactorTag] +----------------------------------------
DEPRECATED: the default goal should be specified in the <build> section of project.xml instead of maven.xml
20:47:35,256 WARN  [PluginScriptParser] DEPRECATED: the default goal should be specified in the <build> section of project.xml instead of maven.xml
20:47:35,256 WARN  [PluginScriptParser] DEPRECATED: the default goal should be specified in the <build> section of project.xml instead of maven.xml
20:47:35,256 WARN  [PluginScriptParser] DEPRECATED: the default goal should be specified in the <build> section of project.xml instead of maven.xml
20:47:35,256 WARN  [PluginScriptParser] DEPRECATED: the default goal should be specified in the <build> section of project.xml instead of maven.xml
build:start:

multiproject:install-callback:
    [echo] Running plugin:repository-install for Geronimo :: Maven Assembly Plugin
plugin:plugin:
java:prepare-filesystem:

java:compile:
    [echo] Compiling to /home/continuum/continuum-1.0.2/apps/continuum/work/68/plugins/geronimo-assembly-plugin/target/classes

java:jar-resources:

test:prepare-filesystem:

test:test-resources:

test:compile:
    [echo] No test source files to compile.

test:test:
    [echo] No tests to run.

jar:jar:


plugin:repository-install:
    [echo] Installing...
Uploading to geronimo/plugins/geronimo-assembly-plugin-1.1.0-11.jar: 
.................... (17K)
Uploading to geronimo/poms/geronimo-assembly-plugin-1.1.0-11.pom: 
.................... (1K)

+----------------------------------------

build:end:

20:47:36,263 INFO  [ReactorTag] +----------------------------------------
20:47:36,263 INFO  [ReactorTag] +----------------------------------------
20:47:36,263 INFO  [ReactorTag] +----------------------------------------
20:47:36,263 INFO  [ReactorTag] +----------------------------------------
| geronimo and geronimo-plugins Geronimo :: Maven Deployment Plugin
20:47:36,263 INFO  [ReactorTag] | geronimo and geronimo-plugins Geronimo :: Maven Deployment Plugin
20:47:36,263 INFO  [ReactorTag] | geronimo and geronimo-plugins Geronimo :: Maven Deployment Plugin
20:47:36,263 INFO  [ReactorTag] | geronimo and geronimo-plugins Geronimo :: Maven Deployment Plugin
20:47:36,263 INFO  [ReactorTag] | geronimo and geronimo-plugins Geronimo :: Maven Deployment Plugin
| Memory: 39M/50M
20:47:36,263 INFO  [ReactorTag] | Memory: 39M/50M
20:47:36,263 INFO  [ReactorTag] | Memory: 39M/50M
20:47:36,263 INFO  [ReactorTag] | Memory: 39M/50M
20:47:36,263 INFO  [ReactorTag] | Memory: 39M/50M
+----------------------------------------
20:47:36,263 INFO  [ReactorTag] +----------------------------------------
20:47:36,263 INFO  [ReactorTag] +----------------------------------------
20:47:36,263 INFO  [ReactorTag] +----------------------------------------
20:47:36,263 INFO  [ReactorTag] +----------------------------------------
DEPRECATED: the default goal should be specified in the <build> section of project.xml instead of maven.xml
20:47:36,285 WARN  [PluginScriptParser] DEPRECATED: the default goal should be specified in the <build> section of project.xml instead of maven.xml
20:47:36,285 WARN  [PluginScriptParser] DEPRECATED: the default goal should be specified in the <build> section of project.xml instead of maven.xml
20:47:36,285 WARN  [PluginScriptParser] DEPRECATED: the default goal should be specified in the <build> section of project.xml instead of maven.xml
20:47:36,285 WARN  [PluginScriptParser] DEPRECATED: the default goal should be specified in the <build> section of project.xml instead of maven.xml
build:start:

multiproject:install-callback:
    [echo] Running plugin:repository-install for Geronimo :: Maven Deployment Plugin
plugin:plugin:
java:prepare-filesystem:

java:compile:
    [echo] Compiling to /home/continuum/continuum-1.0.2/apps/continuum/work/68/plugins/geronimo-deployment-plugin/target/classes

java:jar-resources:

test:prepare-filesystem:

test:test-resources:

test:compile:
    [echo] No test source files to compile.

test:test:
    [echo] No tests to run.

jar:jar:


plugin:repository-install:
    [echo] Installing...
Uploading to geronimo/plugins/geronimo-deployment-plugin-1.1.0-2.jar: 
.................... (33K)
Uploading to geronimo/poms/geronimo-deployment-plugin-1.1.0-2.pom: 
.................... (3K)

+----------------------------------------

build:end:

20:47:37,313 INFO  [ReactorTag] +----------------------------------------
20:47:37,313 INFO  [ReactorTag] +----------------------------------------
20:47:37,313 INFO  [ReactorTag] +----------------------------------------
20:47:37,313 INFO  [ReactorTag] +----------------------------------------
| geronimo and geronimo-plugins Geronimo :: IZPack Installer Build Plugin
20:47:37,313 INFO  [ReactorTag] | geronimo and geronimo-plugins Geronimo :: IZPack Installer Build Plugin
20:47:37,313 INFO  [ReactorTag] | geronimo and geronimo-plugins Geronimo :: IZPack Installer Build Plugin
20:47:37,313 INFO  [ReactorTag] | geronimo and geronimo-plugins Geronimo :: IZPack Installer Build Plugin
20:47:37,313 INFO  [ReactorTag] | geronimo and geronimo-plugins Geronimo :: IZPack Installer Build Plugin
| Memory: 40M/50M
20:47:37,313 INFO  [ReactorTag] | Memory: 40M/50M
20:47:37,313 INFO  [ReactorTag] | Memory: 40M/50M
20:47:37,313 INFO  [ReactorTag] | Memory: 40M/50M
20:47:37,313 INFO  [ReactorTag] | Memory: 40M/50M
+----------------------------------------
20:47:37,313 INFO  [ReactorTag] +----------------------------------------
20:47:37,313 INFO  [ReactorTag] +----------------------------------------
20:47:37,313 INFO  [ReactorTag] +----------------------------------------
20:47:37,313 INFO  [ReactorTag] +----------------------------------------
DEPRECATED: the default goal should be specified in the <build> section of project.xml instead of maven.xml
20:47:37,352 WARN  [PluginScriptParser] DEPRECATED: the default goal should be specified in the <build> section of project.xml instead of maven.xml
20:47:37,352 WARN  [PluginScriptParser] DEPRECATED: the default goal should be specified in the <build> section of project.xml instead of maven.xml
20:47:37,352 WARN  [PluginScriptParser] DEPRECATED: the default goal should be specified in the <build> section of project.xml instead of maven.xml
20:47:37,352 WARN  [PluginScriptParser] DEPRECATED: the default goal should be specified in the <build> section of project.xml instead of maven.xml
build:start:

multiproject:install-callback:
    [echo] Running plugin:repository-install for Geronimo :: IZPack Installer Build Plugin
plugin:plugin:
java:prepare-filesystem:

java:compile:
    [echo] Compiling to /home/continuum/continuum-1.0.2/apps/continuum/work/68/plugins/geronimo-izpack-plugin/target/classes
    [echo] No java source files to compile.

java:jar-resources:

test:prepare-filesystem:

test:test-resources:

test:compile:
    [echo] No test source files to compile.

test:test:
    [echo] No tests to run.

jar:jar:


plugin:repository-install:
    [echo] Installing...
Uploading to geronimo/plugins/geronimo-izpack-plugin-1.1-SNAPSHOT.jar: 
.................... (7K)
Uploading to geronimo/poms/geronimo-izpack-plugin-1.1-SNAPSHOT.pom: 
.................... (1K)

+----------------------------------------

build:end:

20:47:38,218 INFO  [ReactorTag] +----------------------------------------
20:47:38,218 INFO  [ReactorTag] +----------------------------------------
20:47:38,218 INFO  [ReactorTag] +----------------------------------------
20:47:38,218 INFO  [ReactorTag] +----------------------------------------
| geronimo and geronimo-plugins Geronimo :: Maven Packaging Plugin
20:47:38,218 INFO  [ReactorTag] | geronimo and geronimo-plugins Geronimo :: Maven Packaging Plugin
20:47:38,218 INFO  [ReactorTag] | geronimo and geronimo-plugins Geronimo :: Maven Packaging Plugin
20:47:38,218 INFO  [ReactorTag] | geronimo and geronimo-plugins Geronimo :: Maven Packaging Plugin
20:47:38,218 INFO  [ReactorTag] | geronimo and geronimo-plugins Geronimo :: Maven Packaging Plugin
| Memory: 39M/50M
20:47:38,218 INFO  [ReactorTag] | Memory: 39M/50M
20:47:38,218 INFO  [ReactorTag] | Memory: 39M/50M
20:47:38,218 INFO  [ReactorTag] | Memory: 39M/50M
20:47:38,218 INFO  [ReactorTag] | Memory: 39M/50M
+----------------------------------------
20:47:38,218 INFO  [ReactorTag] +----------------------------------------
20:47:38,218 INFO  [ReactorTag] +----------------------------------------
20:47:38,218 INFO  [ReactorTag] +----------------------------------------
20:47:38,218 INFO  [ReactorTag] +----------------------------------------
DEPRECATED: the default goal should be specified in the <build> section of project.xml instead of maven.xml
20:47:38,248 WARN  [PluginScriptParser] DEPRECATED: the default goal should be specified in the <build> section of project.xml instead of maven.xml
20:47:38,248 WARN  [PluginScriptParser] DEPRECATED: the default goal should be specified in the <build> section of project.xml instead of maven.xml
20:47:38,248 WARN  [PluginScriptParser] DEPRECATED: the default goal should be specified in the <build> section of project.xml instead of maven.xml
20:47:38,248 WARN  [PluginScriptParser] DEPRECATED: the default goal should be specified in the <build> section of project.xml instead of maven.xml
build:start:

multiproject:install-callback:
    [echo] Running plugin:repository-install for Geronimo :: Maven Packaging Plugin
plugin:plugin:
java:prepare-filesystem:

java:compile:
    [echo] Compiling to /home/continuum/continuum-1.0.2/apps/continuum/work/68/plugins/geronimo-packaging-plugin/target/classes

java:jar-resources:

test:prepare-filesystem:

test:test-resources:

test:compile:

test:test:
    [junit] Running org.apache.geronimo.plugin.packaging.PlanProcessorTest
    [junit] Tests run: 1, Failures: 0, Errors: 0, Time elapsed: 0.889 sec

jar:jar:


plugin:repository-install:
    [echo] Installing...
Uploading to geronimo/plugins/geronimo-packaging-plugin-1.1.0-7.jar: 
.................... (32K)
Uploading to geronimo/poms/geronimo-packaging-plugin-1.1.0-7.pom: 
.................... (4K)


build:end:


Starting the reactor...
new2:
20:47:40,777 INFO  [ReactorTag] Starting the reactor...
20:47:40,777 INFO  [ReactorTag] Starting the reactor...
20:47:40,777 INFO  [ReactorTag] Starting the reactor...
20:47:40,777 INFO  [ReactorTag] Starting the reactor...
Our processing order:
20:47:41,003 INFO  [ReactorTag] Our processing order:
20:47:41,003 INFO  [ReactorTag] Our processing order:
20:47:41,003 INFO  [ReactorTag] Our processing order:
20:47:41,003 INFO  [ReactorTag] Our processing order:
OpenEJB :: Core
20:47:41,004 INFO  [ReactorTag] OpenEJB :: Core
20:47:41,004 INFO  [ReactorTag] OpenEJB :: Core
20:47:41,004 INFO  [ReactorTag] OpenEJB :: Core
20:47:41,004 INFO  [ReactorTag] OpenEJB :: Core
OpenEJB :: PK Generation :: Builder
20:47:41,004 INFO  [ReactorTag] OpenEJB :: PK Generation :: Builder
20:47:41,004 INFO  [ReactorTag] OpenEJB :: PK Generation :: Builder
20:47:41,004 INFO  [ReactorTag] OpenEJB :: PK Generation :: Builder
20:47:41,004 INFO  [ReactorTag] OpenEJB :: PK Generation :: Builder
OpenEJB :: Builder
20:47:41,004 INFO  [ReactorTag] OpenEJB :: Builder
20:47:41,004 INFO  [ReactorTag] OpenEJB :: Builder
20:47:41,004 INFO  [ReactorTag] OpenEJB :: Builder
20:47:41,004 INFO  [ReactorTag] OpenEJB :: Builder
+----------------------------------------
20:47:41,004 INFO  [ReactorTag] +----------------------------------------
20:47:41,004 INFO  [ReactorTag] +----------------------------------------
20:47:41,004 INFO  [ReactorTag] +----------------------------------------
20:47:41,004 INFO  [ReactorTag] +----------------------------------------
| openejb OpenEJB :: Core
20:47:41,004 INFO  [ReactorTag] | openejb OpenEJB :: Core
20:47:41,004 INFO  [ReactorTag] | openejb OpenEJB :: Core
20:47:41,004 INFO  [ReactorTag] | openejb OpenEJB :: Core
20:47:41,004 INFO  [ReactorTag] | openejb OpenEJB :: Core
| Memory: 40M/50M
20:47:41,005 INFO  [ReactorTag] | Memory: 40M/50M
20:47:41,005 INFO  [ReactorTag] | Memory: 40M/50M
20:47:41,005 INFO  [ReactorTag] | Memory: 40M/50M
20:47:41,005 INFO  [ReactorTag] | Memory: 40M/50M
+----------------------------------------
20:47:41,005 INFO  [ReactorTag] +----------------------------------------
20:47:41,005 INFO  [ReactorTag] +----------------------------------------
20:47:41,005 INFO  [ReactorTag] +----------------------------------------
20:47:41,005 INFO  [ReactorTag] +----------------------------------------
DEPRECATED: the default goal should be specified in the <build> section of project.xml instead of maven.xml
20:47:41,016 WARN  [PluginScriptParser] DEPRECATED: the default goal should be specified in the <build> section of project.xml instead of maven.xml
20:47:41,016 WARN  [PluginScriptParser] DEPRECATED: the default goal should be specified in the <build> section of project.xml instead of maven.xml
20:47:41,016 WARN  [PluginScriptParser] DEPRECATED: the default goal should be specified in the <build> section of project.xml instead of maven.xml
20:47:41,016 WARN  [PluginScriptParser] DEPRECATED: the default goal should be specified in the <build> section of project.xml instead of maven.xml
DEPRECATED: the default goal should be specified in the <build> section of project.xml instead of maven.xml
20:47:41,027 WARN  [PluginScriptParser] DEPRECATED: the default goal should be specified in the <build> section of project.xml instead of maven.xml
20:47:41,027 WARN  [PluginScriptParser] DEPRECATED: the default goal should be specified in the <build> section of project.xml instead of maven.xml
20:47:41,027 WARN  [PluginScriptParser] DEPRECATED: the default goal should be specified in the <build> section of project.xml instead of maven.xml
20:47:41,027 WARN  [PluginScriptParser] DEPRECATED: the default goal should be specified in the <build> section of project.xml instead of maven.xml
Attempting to download geronimo-timer-1.1-SNAPSHOT.jar.
20:47:41,368 INFO  [DependencyVerifier] Attempting to download geronimo-timer-1.1-SNAPSHOT.jar.
20:47:41,368 INFO  [DependencyVerifier] Attempting to download geronimo-timer-1.1-SNAPSHOT.jar.
20:47:41,368 INFO  [DependencyVerifier] Attempting to download geronimo-timer-1.1-SNAPSHOT.jar.
20:47:41,368 INFO  [DependencyVerifier] Attempting to download geronimo-timer-1.1-SNAPSHOT.jar.
Attempting to download geronimo-spec-corba-1.0-SNAPSHOT.jar.
20:47:42,400 INFO  [DependencyVerifier] Attempting to download geronimo-spec-corba-1.0-SNAPSHOT.jar.
20:47:42,400 INFO  [DependencyVerifier] Attempting to download geronimo-spec-corba-1.0-SNAPSHOT.jar.
20:47:42,400 INFO  [DependencyVerifier] Attempting to download geronimo-spec-corba-1.0-SNAPSHOT.jar.
20:47:42,400 INFO  [DependencyVerifier] Attempting to download geronimo-spec-corba-1.0-SNAPSHOT.jar.
build:start:

multiproject:install-callback:
    [echo] Running jar:install for OpenEJB :: Core
java:prepare-filesystem:

java:compile:
<depend closure="false" srcdir="1.4" dump="false" destdir="/home/continuum/continuum-1.0.2/apps/continuum/work/68/openejb/modules/core/target/classes"></depend>    [echo] Compiling to /home/continuum/continuum-1.0.2/apps/continuum/work/68/openejb/modules/core/target/classes
    [javac] Compiling 1 source file to /home/continuum/continuum-1.0.2/apps/continuum/work/68/openejb/modules/core/target/classes
Running post goal: java:compile
20:47:44,906 INFO  [PostGoalTag] Running post goal: java:compile
20:47:44,906 INFO  [PostGoalTag] Running post goal: java:compile
20:47:44,906 INFO  [PostGoalTag] Running post goal: java:compile
20:47:44,906 INFO  [PostGoalTag] Running post goal: java:compile
geronimo:dependency:


java:jar-resources:
Copying 1 file to /home/continuum/continuum-1.0.2/apps/continuum/work/68/openejb/modules/core/target/classes

test:prepare-filesystem:

test:test-resources:

test:compile:

test:test:
    [junit] Running org.openejb.client.EJBRequestTest
    [junit] Tests run: 12, Failures: 0, Errors: 0, Time elapsed: 0.406 sec
    [junit] Running org.openejb.client.JNDIRequestTest
    [junit] Tests run: 2, Failures: 0, Errors: 0, Time elapsed: 0.358 sec
    [junit] Running org.openejb.client.JNDIResponseTest
    [junit] Tests run: 1, Failures: 0, Errors: 0, Time elapsed: 0.391 sec
    [junit] Running org.openejb.client.ProtocolMetaDataTest
    [junit] Tests run: 6, Failures: 0, Errors: 0, Time elapsed: 0.332 sec
    [junit] Running org.openejb.corba.SunNameServiceTest
    [junit] Tests run: 1, Failures: 0, Errors: 0, Time elapsed: 0.689 sec
    [junit] Running org.openejb.corba.compiler.PortableStubCompilerTest
    [junit] Tests run: 3, Failures: 0, Errors: 0, Time elapsed: 0.576 sec
    [junit] Running org.openejb.corba.util.DynamicStubClassLoaderTest
    [junit] Tests run: 1, Failures: 0, Errors: 0, Time elapsed: 1.085 sec
    [junit] Running org.openejb.server.httpd.HttpServerTest
    [junit] Tests run: 3, Failures: 0, Errors: 0, Time elapsed: 0.741 sec
    [junit] Running org.openejb.slsb.InvocationTest
    [junit] Tests run: 5, Failures: 0, Errors: 0, Time elapsed: 3.905 sec
    [junit] Running org.openejb.slsb.StatelessInstanceInterceptorTest
    [junit] Tests run: 2, Failures: 0, Errors: 0, Time elapsed: 0.473 sec
    [junit] Running org.openejb.timer.TimerServiceImplTest
    [junit] Tests run: 6, Failures: 0, Errors: 0, Time elapsed: 9.379 sec
Running post goal: test:test
20:48:11,771 INFO  [PostGoalTag] Running post goal: test:test
20:48:11,771 INFO  [PostGoalTag] Running post goal: test:test
20:48:11,771 INFO  [PostGoalTag] Running post goal: test:test
20:48:11,771 INFO  [PostGoalTag] Running post goal: test:test

jar:jar:
    [jar] Building jar: /home/continuum/continuum-1.0.2/apps/continuum/work/68/openejb/modules/core/target/openejb-core-2.1-SNAPSHOT.jar

jar:install:
    [echo] Installing...
Uploading to openejb/jars/openejb-core-2.1-SNAPSHOT.jar: 
.................... (1186K)
Uploading to openejb/poms/openejb-core-2.1-SNAPSHOT.pom: 
.................... (14K)

+----------------------------------------

build:end:

20:48:14,989 INFO  [ReactorTag] +----------------------------------------
20:48:14,989 INFO  [ReactorTag] +----------------------------------------
20:48:14,989 INFO  [ReactorTag] +----------------------------------------
20:48:14,989 INFO  [ReactorTag] +----------------------------------------
| openejb OpenEJB :: PK Generation :: Builder
20:48:14,989 INFO  [ReactorTag] | openejb OpenEJB :: PK Generation :: Builder
20:48:14,989 INFO  [ReactorTag] | openejb OpenEJB :: PK Generation :: Builder
20:48:14,989 INFO  [ReactorTag] | openejb OpenEJB :: PK Generation :: Builder
20:48:14,989 INFO  [ReactorTag] | openejb OpenEJB :: PK Generation :: Builder
| Memory: 21M/50M
20:48:14,989 INFO  [ReactorTag] | Memory: 21M/50M
20:48:14,989 INFO  [ReactorTag] | Memory: 21M/50M
20:48:14,989 INFO  [ReactorTag] | Memory: 21M/50M
20:48:14,989 INFO  [ReactorTag] | Memory: 21M/50M
+----------------------------------------
20:48:14,989 INFO  [ReactorTag] +----------------------------------------
20:48:14,989 INFO  [ReactorTag] +----------------------------------------
20:48:14,989 INFO  [ReactorTag] +----------------------------------------
20:48:14,989 INFO  [ReactorTag] +----------------------------------------
DEPRECATED: the default goal should be specified in the <build> section of project.xml instead of maven.xml
20:48:15,012 WARN  [PluginScriptParser] DEPRECATED: the default goal should be specified in the <build> section of project.xml instead of maven.xml
20:48:15,012 WARN  [PluginScriptParser] DEPRECATED: the default goal should be specified in the <build> section of project.xml instead of maven.xml
20:48:15,012 WARN  [PluginScriptParser] DEPRECATED: the default goal should be specified in the <build> section of project.xml instead of maven.xml
20:48:15,012 WARN  [PluginScriptParser] DEPRECATED: the default goal should be specified in the <build> section of project.xml instead of maven.xml
DEPRECATED: the default goal should be specified in the <build> section of project.xml instead of maven.xml
20:48:15,013 WARN  [PluginScriptParser] DEPRECATED: the default goal should be specified in the <build> section of project.xml instead of maven.xml
20:48:15,013 WARN  [PluginScriptParser] DEPRECATED: the default goal should be specified in the <build> section of project.xml instead of maven.xml
20:48:15,013 WARN  [PluginScriptParser] DEPRECATED: the default goal should be specified in the <build> section of project.xml instead of maven.xml
20:48:15,013 WARN  [PluginScriptParser] DEPRECATED: the default goal should be specified in the <build> section of project.xml instead of maven.xml
Attempting to download openejb-core-2.1-SNAPSHOT.jar.
20:48:15,315 INFO  [DependencyVerifier] Attempting to download openejb-core-2.1-SNAPSHOT.jar.
20:48:15,315 INFO  [DependencyVerifier] Attempting to download openejb-core-2.1-SNAPSHOT.jar.
20:48:15,315 INFO  [DependencyVerifier] Attempting to download openejb-core-2.1-SNAPSHOT.jar.
20:48:15,315 INFO  [DependencyVerifier] Attempting to download openejb-core-2.1-SNAPSHOT.jar.
build:start:

multiproject:install-callback:
    [echo] Running jar:install for OpenEJB :: PK Generation :: Builder
java:prepare-filesystem:

java:compile:
<depend closure="false" srcdir="1.4" dump="false" destdir="/home/continuum/continuum-1.0.2/apps/continuum/work/68/openejb/modules/pkgen-builder/target/classes"></depend>    [echo] Compiling to /home/continuum/continuum-1.0.2/apps/continuum/work/68/openejb/modules/pkgen-builder/target/classes

java:jar-resources:

test:prepare-filesystem:

test:test-resources:

test:compile:
    [echo] No test source files to compile.

test:test:
    [echo] NOTICE: Skipping tests; they seem to have passed already
    [echo] No tests to run.
Running post goal: test:test
20:48:18,123 INFO  [PostGoalTag] Running post goal: test:test
20:48:18,123 INFO  [PostGoalTag] Running post goal: test:test
20:48:18,123 INFO  [PostGoalTag] Running post goal: test:test
20:48:18,123 INFO  [PostGoalTag] Running post goal: test:test

jar:jar:

jar:install:
    [echo] Installing...
Uploading to openejb/jars/openejb-pkgen-builder-2.1-SNAPSHOT.jar: 
.................... (52K)
Uploading to openejb/poms/openejb-pkgen-builder-2.1-SNAPSHOT.pom: 
.................... (6K)

+----------------------------------------

build:end:

20:48:18,409 INFO  [ReactorTag] +----------------------------------------
20:48:18,409 INFO  [ReactorTag] +----------------------------------------
20:48:18,409 INFO  [ReactorTag] +----------------------------------------
20:48:18,409 INFO  [ReactorTag] +----------------------------------------
| openejb OpenEJB :: Builder
20:48:18,409 INFO  [ReactorTag] | openejb OpenEJB :: Builder
20:48:18,409 INFO  [ReactorTag] | openejb OpenEJB :: Builder
20:48:18,409 INFO  [ReactorTag] | openejb OpenEJB :: Builder
20:48:18,409 INFO  [ReactorTag] | openejb OpenEJB :: Builder
| Memory: 24M/50M
20:48:18,409 INFO  [ReactorTag] | Memory: 24M/50M
20:48:18,409 INFO  [ReactorTag] | Memory: 24M/50M
20:48:18,409 INFO  [ReactorTag] | Memory: 24M/50M
20:48:18,409 INFO  [ReactorTag] | Memory: 24M/50M
+----------------------------------------
20:48:18,409 INFO  [ReactorTag] +----------------------------------------
20:48:18,409 INFO  [ReactorTag] +----------------------------------------
20:48:18,409 INFO  [ReactorTag] +----------------------------------------
20:48:18,409 INFO  [ReactorTag] +----------------------------------------
DEPRECATED: the default goal should be specified in the <build> section of project.xml instead of maven.xml
20:48:18,424 WARN  [PluginScriptParser] DEPRECATED: the default goal should be specified in the <build> section of project.xml instead of maven.xml
20:48:18,424 WARN  [PluginScriptParser] DEPRECATED: the default goal should be specified in the <build> section of project.xml instead of maven.xml
20:48:18,424 WARN  [PluginScriptParser] DEPRECATED: the default goal should be specified in the <build> section of project.xml instead of maven.xml
20:48:18,424 WARN  [PluginScriptParser] DEPRECATED: the default goal should be specified in the <build> section of project.xml instead of maven.xml
DEPRECATED: the default goal should be specified in the <build> section of project.xml instead of maven.xml
20:48:18,425 WARN  [PluginScriptParser] DEPRECATED: the default goal should be specified in the <build> section of project.xml instead of maven.xml
20:48:18,425 WARN  [PluginScriptParser] DEPRECATED: the default goal should be specified in the <build> section of project.xml instead of maven.xml
20:48:18,425 WARN  [PluginScriptParser] DEPRECATED: the default goal should be specified in the <build> section of project.xml instead of maven.xml
20:48:18,425 WARN  [PluginScriptParser] DEPRECATED: the default goal should be specified in the <build> section of project.xml instead of maven.xml
Attempting to download openejb-pkgen-builder-2.1-SNAPSHOT.jar.
20:48:18,766 INFO  [DependencyVerifier] Attempting to download openejb-pkgen-builder-2.1-SNAPSHOT.jar.
20:48:18,766 INFO  [DependencyVerifier] Attempting to download openejb-pkgen-builder-2.1-SNAPSHOT.jar.
20:48:18,766 INFO  [DependencyVerifier] Attempting to download openejb-pkgen-builder-2.1-SNAPSHOT.jar.
20:48:18,766 INFO  [DependencyVerifier] Attempting to download openejb-pkgen-builder-2.1-SNAPSHOT.jar.
build:start:

multiproject:install-callback:
    [echo] Running jar:install for OpenEJB :: Builder
java:prepare-filesystem:

java:compile:
<depend closure="false" srcdir="1.4" dump="false" destdir="/home/continuum/continuum-1.0.2/apps/continuum/work/68/openejb/modules/openejb-builder/target/classes"></depend>    [echo] Compiling to /home/continuum/continuum-1.0.2/apps/continuum/work/68/openejb/modules/openejb-builder/target/classes
    [javac] Compiling 1 source file to /home/continuum/continuum-1.0.2/apps/continuum/work/68/openejb/modules/openejb-builder/target/classes
Running post goal: java:compile
20:48:21,472 INFO  [PostGoalTag] Running post goal: java:compile
20:48:21,472 INFO  [PostGoalTag] Running post goal: java:compile
20:48:21,472 INFO  [PostGoalTag] Running post goal: java:compile
20:48:21,472 INFO  [PostGoalTag] Running post goal: java:compile
geronimo:dependency:


java:jar-resources:
Copying 1 file to /home/continuum/continuum-1.0.2/apps/continuum/work/68/openejb/modules/openejb-builder/target/classes

test:prepare-filesystem:

test:test-resources:

test:compile:

test:test:
    [junit] Running org.openejb.corba.security.config.tss.TSSConfigEditorTest
    [junit] Tests run: 3, Failures: 0, Errors: 0, Time elapsed: 2.589 sec
    [junit] Running org.openejb.deployment.BMPSystemMethodIndicesTest
    [junit] Tests run: 1, Failures: 0, Errors: 0, Time elapsed: 0.589 sec
    [junit] Running org.openejb.deployment.CMPEntityBuilderTest
    [junit] Tests run: 1, Failures: 0, Errors: 0, Time elapsed: 0.334 sec
    [junit] Running org.openejb.deployment.CMPSystemMethodIndicesTest
    [junit] Tests run: 1, Failures: 0, Errors: 0, Time elapsed: 0.643 sec
    [junit] Running org.openejb.deployment.EarDeploymentTest
    [junit] Tests run: 0, Failures: 0, Errors: 1, Time elapsed: 2.557 sec
    [junit] [ERROR] Test org.openejb.deployment.EarDeploymentTest FAILED
    [junit] Running org.openejb.deployment.EjbJarModuleDeploymentTest
    [junit] Tests run: 0, Failures: 0, Errors: 1, Time elapsed: 2.524 sec
    [junit] [ERROR] Test org.openejb.deployment.EjbJarModuleDeploymentTest FAILED
    [junit] Running org.openejb.deployment.MessageDrivenSystemMethodIndicesTest
    [junit] Tests run: 1, Failures: 0, Errors: 0, Time elapsed: 0.564 sec
    [junit] Running org.openejb.deployment.PlanParsingTest
    [junit] Tests run: 1, Failures: 0, Errors: 0, Time elapsed: 1.979 sec
    [junit] Running org.openejb.deployment.StatelessSystemMethodIndicesTest
    [junit] Tests run: 1, Failures: 0, Errors: 0, Time elapsed: 0.559 sec
    [junit] Running org.openejb.deployment.StatelfulSystemMethodIndicesTest
    [junit] Tests run: 1, Failures: 0, Errors: 0, Time elapsed: 0.543 sec
    [junit] Running org.openejb.deployment.TransactionPolicyHelperTest
    [junit] Tests run: 5, Failures: 0, Errors: 0, Time elapsed: 0.965 sec
    [junit] Running org.openejb.deployment.UnpackedModuleDeploymentTest
    [junit] Tests run: 0, Failures: 0, Errors: 1, Time elapsed: 2.5 sec
    [junit] [ERROR] Test org.openejb.deployment.UnpackedModuleDeploymentTest FAILED
    [junit] Running org.openejb.deployment.ant.EjbJarLocationTest
    [junit] Tests run: 3, Failures: 0, Errors: 0, Time elapsed: 0.372 sec
    [junit] Running org.openejb.deployment.ant.OpenejbJarLocationTest
    [junit] Tests run: 5, Failures: 0, Errors: 0, Time elapsed: 0.956 sec
    [junit] Running org.openejb.deployment.entity.BasicBMPEntityContainerTest
    [junit] Tests run: 6, Failures: 0, Errors: 0, Time elapsed: 6.022 sec
    [junit] Running org.openejb.deployment.entity.BasicCMPEntityContainerTest
    [junit] Tests run: 7, Failures: 0, Errors: 0, Time elapsed: 7.493 sec
    [junit] Running org.openejb.deployment.entity.cmp.cmr.manytomany.ManyToManyCompoundPKTest
    [junit] Tests run: 11, Failures: 0, Errors: 0, Time elapsed: 11.469 sec
    [junit] Running org.openejb.deployment.entity.cmp.cmr.manytomany.ManyToManyTest
    [junit] Tests run: 11, Failures: 0, Errors: 0, Time elapsed: 10.901 sec
    [junit] Running org.openejb.deployment.entity.cmp.cmr.onetomany.OneToManyCascadeDeleteTest
    [junit] Tests run: 1, Failures: 0, Errors: 0, Time elapsed: 4.499 sec
    [junit] Running org.openejb.deployment.entity.cmp.cmr.onetomany.OneToManyCompoundPKCascadeDeleteTest
    [junit] Tests run: 1, Failures: 0, Errors: 0, Time elapsed: 4.4 sec
    [junit] Running org.openejb.deployment.entity.cmp.cmr.onetomany.OneToManyCompoundPKTest
    [junit] Tests run: 10, Failures: 0, Errors: 0, Time elapsed: 10.289 sec
    [junit] Running org.openejb.deployment.entity.cmp.cmr.onetomany.OneToManyTest
    [junit] Tests run: 10, Failures: 0, Errors: 0, Time elapsed: 10.332 sec
    [junit] Running org.openejb.deployment.entity.cmp.cmr.onetoone.OneToOneCompoundPKTest
    [junit] Tests run: 9, Failures: 0, Errors: 0, Time elapsed: 10.058 sec
    [junit] Running org.openejb.deployment.entity.cmp.cmr.onetoone.OneToOneTest
    [junit] Tests run: 9, Failures: 0, Errors: 0, Time elapsed: 10.144 sec
    [junit] Running org.openejb.deployment.entity.cmp.ejbql.EJBQLTest
    [junit] Tests run: 3, Failures: 0, Errors: 0, Time elapsed: 6.368 sec
    [junit] Running org.openejb.deployment.mdb.BasicMDBContainerTest
    [junit] Tests run: 1, Failures: 0, Errors: 0, Time elapsed: 7.003 sec
    [junit] Running org.openejb.deployment.slsb.BasicStatelessContainerTest
    [junit] Tests run: 6, Failures: 0, Errors: 0, Time elapsed: 6.983 sec
    [junit] Running org.openejb.deployment.slsb.StatelessClientContainerTest
    [junit] Tests run: 7, Failures: 0, Errors: 0, Time elapsed: 1.289 sec
    [junit] Running org.openejb.transaction.ContainerPolicyTest
    [junit] Tests run: 3, Failures: 0, Errors: 0, Time elapsed: 0.493 sec

BUILD FAILED
File...... /home/continuum/continuum-1.0.2/apps/continuum/work/68/maven.xml
Element... maven:reactor
Line...... 48
Column.... -1
Unable to obtain goal [multiproject:install-callback] -- /home/continuum/.geronimo-1.1-maven/cache/maven-test-plugin-1.7/plugin.jelly:183:-1: <fail> There were test failures.
Total time   : 7 minutes 35 seconds 
20:50:44,684 INFO  [App] Total time   : 7 minutes 35 seconds 
20:50:44,684 INFO  [App] Total time   : 7 minutes 35 seconds 
20:50:44,684 INFO  [App] Total time   : 7 minutes 35 seconds 
20:50:44,684 INFO  [App] Total time   : 7 minutes 35 seconds 
Finished at  : Friday, April 28, 2006 8:50:44 PM PDT
20:50:44,684 INFO  [App] Finished at  : Friday, April 28, 2006 8:50:44 PM PDT
20:50:44,684 INFO  [App] Finished at  : Friday, April 28, 2006 8:50:44 PM PDT
20:50:44,684 INFO  [App] Finished at  : Friday, April 28, 2006 8:50:44 PM PDT
20:50:44,684 INFO  [App] Finished at  : Friday, April 28, 2006 8:50:44 PM PDT

20:50:44,684 INFO  [App] 
20:50:44,684 INFO  [App] 
20:50:44,684 INFO  [App] 
20:50:44,684 INFO  [App] 

****************************************************************************



Mime
View raw message