geronimo-scm mailing list archives

Site index · List index
Message view « Date » · « Thread »
Top « Date » · « Thread »
From continuum <contin...@stan.gbuild.org>
Subject [continuum] BUILD FAILURE: Geronimo 1.1
Date Tue, 18 Apr 2006 07:10:16 GMT
Online report : http://ci.gbuild.org/continuum/servlet/continuum/target/ProjectBuild.vm/view/ProjectBuild/id/68/buildId/2403
Build statistics:
  State: Failed
  Previous State: Ok
  Started at: Tue, 18 Apr 2006 00:01:52 -0700
  Finished at: Tue, 18 Apr 2006 00:10:14 -0700
  Total time: 8m 22s
  Build Trigger: Schedule
  Exit code: 70
  Building machine hostname: stan.gbuild.org
  Operating system : Linux(unknown)
  Java version : 1.4.2_08(Sun Microsystems Inc.)

Changes
                            applications/console-standard/src/java/org/apache/geronimo/console/configmanager/ConfigManagerPortlet.java
            modules/kernel/src/test/org/apache/geronimo/kernel/repository/ArtifactResolverTest.java
            modules/kernel/src/test/org/apache/geronimo/kernel/ConfigTest.java
            modules/kernel/src/test/org/apache/geronimo/kernel/config/ConfigurationManagerTest.java
            modules/kernel/src/test/org/apache/geronimo/kernel/config/ConfigurationModelTest.java
            modules/kernel/src/test/org/apache/geronimo/kernel/SimpleGBeanTest.java
            modules/kernel/src/java/org/apache/geronimo/kernel/config/NullLifecycleMonitor.java
            modules/kernel/src/java/org/apache/geronimo/kernel/config/ConfigurationManager.java
            modules/kernel/src/java/org/apache/geronimo/kernel/config/KernelConfigurationManager.java
            modules/kernel/src/java/org/apache/geronimo/kernel/config/LifecycleMonitor.java
            modules/kernel/src/java/org/apache/geronimo/kernel/config/Configuration.java
            modules/kernel/src/java/org/apache/geronimo/kernel/config/LifecycleException.java
            modules/kernel/src/java/org/apache/geronimo/kernel/config/ConfigurationModel.java
            modules/kernel/src/java/org/apache/geronimo/kernel/config/ConfigurationResolver.java
            modules/kernel/src/java/org/apache/geronimo/kernel/config/SelectorUtils.java
            modules/kernel/src/java/org/apache/geronimo/kernel/config/IOUtil.java
            modules/kernel/src/java/org/apache/geronimo/kernel/config/ConfigurationUtil.java
            modules/kernel/src/java/org/apache/geronimo/kernel/config/ConfigurationStatus.java
            modules/kernel/src/java/org/apache/geronimo/kernel/config/SimpleConfigurationManager.java
            modules/kernel/src/java/org/apache/geronimo/kernel/config/NullConfigurationStore.java
            modules/kernel/src/java/org/apache/geronimo/kernel/config/Os.java
            modules/kernel/src/java/org/apache/geronimo/kernel/config/LifecycleResults.java
            modules/kernel/src/java/org/apache/geronimo/kernel/config/ConfigurationStore.java
            modules/kernel/src/java/org/apache/geronimo/gbean/runtime/GBeanInstance.java
            modules/deployment/src/java/org/apache/geronimo/deployment/DeploymentContext.java
            modules/deployment/src/java/org/apache/geronimo/deployment/CopyResourceContext.java
            modules/deployment/src/java/org/apache/geronimo/deployment/InPlaceResourceContext.java
            modules/jetty-builder/src/test/org/apache/geronimo/jetty/deployment/JettyModuleBuilderTest.java
            modules/system/src/test/org/apache/geronimo/system/configuration/ConfigInstallerTest.java
            modules/system/src/java/org/apache/geronimo/system/repository/UnpackArtifactTypeHandler.java
            modules/system/src/java/org/apache/geronimo/system/configuration/RepositoryConfigurationStore.java
            modules/web-builder/src/java/org/apache/geronimo/web/deployment/AbstractWebModuleBuilder.java
            modules/deploy-tool/src/java/org/apache/geronimo/deployment/PluginBootstrap.java
            modules/connector-builder/src/test/org/apache/geronimo/connector/deployment/ConnectorModuleBuilderTest.java
            modules/j2ee-builder/src/test/org/apache/geronimo/j2ee/deployment/EARConfigBuilderTest.java
            modules/tomcat-builder/src/test/org/apache/geronimo/tomcat/deployment/TomcatModuleBuilderTest.java
        
****************************************************************************
Output:
****************************************************************************
 __  __
|  \/  |__ _Apache__ ___
| |\/| / _` \ V / -_) ' \  ~ intelligent projects ~
|_|  |_\__,_|\_/\___|_||_|  v. 1.1-beta-2

DEPRECATED: the default goal should be specified in the <build> section of project.xml instead of maven.xml
DEPRECATED: the default goal should be specified in the <build> section of project.xml instead of maven.xml
build:start:

m:checkout:
    [exec] U    openejb/modules/openejb-builder/src/test/org/openejb/deployment/DeploymentHelper.java
    [exec] U    openejb/modules/openejb-builder/src/test/org/openejb/deployment/mdb/BasicMDBContainerTest.java
    [exec] U    openejb/modules/openejb-builder/src/test/org/openejb/deployment/slsb/BasicStatelessContainerTest.java
    [exec] U    openejb/modules/openejb-builder/src/test/org/openejb/deployment/DeploymentTestSuite.java
    [exec] U    openejb/modules/openejb-builder/src/test/org/openejb/deployment/entity/cmp/cmr/AbstractCMRTest.java
    [exec] U    openejb/modules/openejb-builder/src/test/org/openejb/deployment/entity/cmp/ejbql/EJBQLTest.java
    [exec] U    openejb/modules/openejb-builder/src/test/org/openejb/deployment/entity/BasicBMPEntityContainerTest.java
    [exec] U    openejb/modules/openejb-builder/src/test/org/openejb/deployment/entity/BasicCMPEntityContainerTest.java
    [exec] Checked out revision 2610.
Starting the reactor...
Our processing order:

new:
new0:

Starting the reactor...
Our processing order:
new00:

Starting the reactor...
Our processing order:
Geronimo :: Activation
Geronimo :: Kernel
Geronimo :: Common
Geronimo :: Util
Geronimo :: System
Geronimo :: Deployment
Geronimo :: Deploy :: Common Config
Geronimo :: Management API
Geronimo :: Core
Geronimo :: J2EE
Geronimo :: J2EE Schema
Geronimo :: Service :: Builder
Geronimo :: Maven Dependency Plugin
Geronimo :: Naming
Geronimo :: Security
Geronimo :: Web Services
Geronimo :: Axis
Geronimo :: Test :: DDBeans
Geronimo :: Transaction
Geronimo :: Connector
Geronimo :: Security :: Builder
Geronimo :: J2EE
Geronimo :: Naming :: Builder
Geronimo :: Connector :: Builder
Geronimo :: Axis :: Builder
Geronimo :: Client
Geronimo :: Client Builder
Geronimo :: Console Web
Geronimo :: Configuration Converter
Geronimo :: Web :: Builder
Geronimo :: Deploy :: JSR-88
Geronimo :: Deploy :: CLI Tool
Geronimo :: Derby
Geronimo :: Directory
Geronimo :: Deploy :: Hot Deployer
Geronimo :: Installer Processing
Geronimo :: Installer Support
Geronimo :: JavaMail Transport
Geronimo :: Jetty
Geronimo :: Jetty :: Builder
Geronimo :: JMX Remoting
Geronimo :: Mail
Geronimo :: Scripts
Geronimo :: Timer
Geronimo :: Tomcat
Geronimo :: Tomcat :: Builder
Geronimo :: Upgrade
Geronimo :: Maven Assembly Plugin
Geronimo :: Maven Deployment Plugin
Geronimo :: IZPack Installer Build Plugin
Geronimo :: Maven Packaging Plugin
+----------------------------------------
| geronimo and geronimo-plugins Geronimo :: Activation
| Memory: 7M/8M
+----------------------------------------
DEPRECATED: the default goal should be specified in the <build> section of project.xml instead of maven.xml
new1:
Attempting to download geronimo-javamail_1.3.1_spec-1.1-SNAPSHOT.jar.
build:start:

multiproject:install-callback:
    [echo] Running jar:install for Geronimo :: Activation
java:prepare-filesystem:

java:compile:
<depend closure="false" srcdir="1.4" dump="false" destdir="/home/continuum/continuum-1.0.2/apps/continuum/work/68/modules/activation/target/classes"></depend>    [echo] Compiling to /home/continuum/continuum-1.0.2/apps/continuum/work/68/modules/activation/target/classes

java:jar-resources:

test:prepare-filesystem:

test:test-resources:

test:compile:

test:test:
    [echo] NOTICE: Skipping tests; they seem to have passed already
    [echo] No tests to run.
Running post goal: test:test

jar:jar:

jar:install:
    [echo] Installing...
Uploading to geronimo/jars/geronimo-activation-1.1-SNAPSHOT.jar: 
.................... (13K)
Uploading to geronimo/poms/geronimo-activation-1.1-SNAPSHOT.pom: 
.................... (10K)

+----------------------------------------
| geronimo and geronimo-plugins Geronimo :: Kernel
| Memory: 8M/11M
+----------------------------------------
DEPRECATED: the default goal should be specified in the <build> section of project.xml instead of maven.xml
DEPRECATED: the default goal should be specified in the <build> section of project.xml instead of maven.xml

build:end:

build:start:

multiproject:install-callback:
    [echo] Running jar:install for Geronimo :: Kernel
Tag library requested that is not present: 'xmlbeans2:maven' in plugin: 'null'
java:prepare-filesystem:

java:compile:
<depend closure="false" srcdir="1.4" dump="false" destdir="/home/continuum/continuum-1.0.2/apps/continuum/work/68/modules/kernel/target/classes"></depend>    [echo] Compiling to /home/continuum/continuum-1.0.2/apps/continuum/work/68/modules/kernel/target/classes
    [javac] Compiling 18 source files to /home/continuum/continuum-1.0.2/apps/continuum/work/68/modules/kernel/target/classes
    [javac] Note: Some input files use or override a deprecated API.
    [javac] Note: Recompile with -deprecation for details.

java:jar-resources:

test:prepare-filesystem:

test:test-resources:

test:compile:
    [javac] Compiling 5 source files to /home/continuum/continuum-1.0.2/apps/continuum/work/68/modules/kernel/target/test-classes

test:test:
    [junit] Running org.apache.geronimo.gbean.GBeanInfoFactoryTest
    [junit] Tests run: 4, Failures: 0, Errors: 0, Time elapsed: 0.457 sec
    [junit] Running org.apache.geronimo.gbean.GBeanInfoTest
    [junit] Tests run: 9, Failures: 0, Errors: 0, Time elapsed: 0.038 sec
    [junit] Running org.apache.geronimo.gbean.GBeanNameTest
    [junit] Tests run: 7, Failures: 0, Errors: 0, Time elapsed: 0.074 sec
    [junit] Running org.apache.geronimo.gbean.runtime.GBeanAttributeTest
    [junit] Tests run: 4, Failures: 0, Errors: 0, Time elapsed: 0.66 sec
    [junit] Running org.apache.geronimo.gbean.runtime.GBeanDependencyTest
    [junit] Tests run: 1, Failures: 0, Errors: 0, Time elapsed: 0.444 sec
    [junit] Running org.apache.geronimo.kernel.BootstrapTest
    [junit] Tests run: 1, Failures: 0, Errors: 0, Time elapsed: 0.377 sec
    [junit] Running org.apache.geronimo.kernel.ClassloadingTest
    [junit] Tests run: 10, Failures: 0, Errors: 0, Time elapsed: 0.076 sec
    [junit] Running org.apache.geronimo.kernel.ConfigTest
    [junit] Tests run: 3, Failures: 0, Errors: 0, Time elapsed: 1.328 sec
    [junit] Running org.apache.geronimo.kernel.GBeanTest
    [junit] Tests run: 27, Failures: 0, Errors: 0, Time elapsed: 2.458 sec
    [junit] Running org.apache.geronimo.kernel.SimpleGBeanTest
    [junit] Tests run: 1, Failures: 0, Errors: 0, Time elapsed: 0.806 sec
    [junit] Running org.apache.geronimo.kernel.basic.BasicProxyMapTest
    [junit] Tests run: 7, Failures: 0, Errors: 0, Time elapsed: 1.174 sec
    [junit] Running org.apache.geronimo.kernel.config.ConfigurationManagerTest
    [junit] Tests run: 4, Failures: 0, Errors: 0, Time elapsed: 0.832 sec
    [junit] Running org.apache.geronimo.kernel.config.ConfigurationModelTest
    [junit] Tests run: 4, Failures: 0, Errors: 0, Time elapsed: 0.016 sec
    [junit] Running org.apache.geronimo.kernel.config.ConfigurationUtilTest
    [junit] Tests run: 1, Failures: 0, Errors: 0, Time elapsed: 0.49 sec
    [junit] Running org.apache.geronimo.kernel.config.MultiParentClassLoaderTest
    [junit] Tests run: 14, Failures: 0, Errors: 0, Time elapsed: 0.797 sec
    [junit] Running org.apache.geronimo.kernel.management.StateTest
    [junit] Tests run: 5, Failures: 0, Errors: 0, Time elapsed: 0.008 sec
    [junit] Running org.apache.geronimo.kernel.repository.ArtifactManagerTest
    [junit] Tests run: 3, Failures: 0, Errors: 0, Time elapsed: 0.03 sec
    [junit] Running org.apache.geronimo.kernel.repository.ArtifactResolverTest
    [junit] Tests run: 4, Failures: 0, Errors: 0, Time elapsed: 0.154 sec
Running post goal: test:test

jar:jar:
    [jar] Building jar: /home/continuum/continuum-1.0.2/apps/continuum/work/68/modules/kernel/target/geronimo-kernel-1.1-SNAPSHOT.jar

jar:install:
    [echo] Installing...
Uploading to geronimo/jars/geronimo-kernel-1.1-SNAPSHOT.jar: 
.................... (330K)
Uploading to geronimo/poms/geronimo-kernel-1.1-SNAPSHOT.pom: 
.................... (11K)

+----------------------------------------
| geronimo and geronimo-plugins Geronimo :: Common
| Memory: 16M/20M
+----------------------------------------
DEPRECATED: the default goal should be specified in the <build> section of project.xml instead of maven.xml

build:end:

Attempting to download geronimo-kernel-1.1-SNAPSHOT.jar.
build:start:

multiproject:install-callback:
    [echo] Running jar:install for Geronimo :: Common
java:prepare-filesystem:

java:compile:
<depend closure="false" srcdir="1.4" dump="false" destdir="/home/continuum/continuum-1.0.2/apps/continuum/work/68/modules/common/target/classes"></depend>    [echo] Compiling to /home/continuum/continuum-1.0.2/apps/continuum/work/68/modules/common/target/classes

java:jar-resources:

test:prepare-filesystem:

test:test-resources:

test:compile:

test:test:
    [echo] NOTICE: Skipping tests; they seem to have passed already
    [echo] No tests to run.
Running post goal: test:test

jar:jar:

jar:install:
    [echo] Installing...
Uploading to geronimo/jars/geronimo-common-1.1-SNAPSHOT.jar: 
.................... (36K)
Uploading to geronimo/poms/geronimo-common-1.1-SNAPSHOT.pom: 
.................... (10K)

+----------------------------------------
| geronimo and geronimo-plugins Geronimo :: Util
| Memory: 16M/20M
+----------------------------------------
DEPRECATED: the default goal should be specified in the <build> section of project.xml instead of maven.xml

build:end:

build:start:

multiproject:install-callback:
    [echo] Running jar:install for Geronimo :: Util
java:prepare-filesystem:

java:compile:
<depend closure="false" srcdir="1.4" dump="false" destdir="/home/continuum/continuum-1.0.2/apps/continuum/work/68/modules/util/target/classes"></depend>    [echo] Compiling to /home/continuum/continuum-1.0.2/apps/continuum/work/68/modules/util/target/classes

java:jar-resources:

test:prepare-filesystem:

test:test-resources:

test:compile:

test:test:
    [echo] NOTICE: Skipping tests; they seem to have passed already
    [echo] No tests to run.
Running post goal: test:test

jar:jar:

jar:install:
    [echo] Installing...
Uploading to geronimo/jars/geronimo-util-1.1-SNAPSHOT.jar: 
.................... (243K)
Uploading to geronimo/poms/geronimo-util-1.1-SNAPSHOT.pom: 
.................... (10K)

+----------------------------------------
| geronimo and geronimo-plugins Geronimo :: System
| Memory: 17M/20M
+----------------------------------------
DEPRECATED: the default goal should be specified in the <build> section of project.xml instead of maven.xml
DEPRECATED: the default goal should be specified in the <build> section of project.xml instead of maven.xml

build:end:

Attempting to download geronimo-common-1.1-SNAPSHOT.jar.
Attempting to download geronimo-util-1.1-SNAPSHOT.jar.
build:start:

multiproject:install-callback:
    [echo] Running jar:install for Geronimo :: System
java:prepare-filesystem:

java:compile:
<depend closure="false" srcdir="1.4" dump="false" destdir="/home/continuum/continuum-1.0.2/apps/continuum/work/68/modules/system/target/classes"></depend>    [echo] Compiling to /home/continuum/continuum-1.0.2/apps/continuum/work/68/modules/system/target/classes
    [javac] Compiling 2 source files to /home/continuum/continuum-1.0.2/apps/continuum/work/68/modules/system/target/classes
Running post goal: java:compile

java:jar-resources:

test:prepare-filesystem:

test:test-resources:
Running post goal: test:test-resources
    [delete] Deleting directory /home/continuum/continuum-1.0.2/apps/continuum/work/68/modules/system/target/tmp
    [mkdir] Created dir: /home/continuum/continuum-1.0.2/apps/continuum/work/68/modules/system/target/tmp

test:compile:
    [javac] Compiling 1 source file to /home/continuum/continuum-1.0.2/apps/continuum/work/68/modules/system/target/test-classes

test:test:
    [junit] Running org.apache.geronimo.system.configuration.ConfigInstallerTest
    [junit] Tests run: 1, Failures: 0, Errors: 0, Time elapsed: 0.609 sec
    [junit] Running org.apache.geronimo.system.configuration.ConfigurationStoreUtilTest
    [junit] Tests run: 4, Failures: 0, Errors: 0, Time elapsed: 0.453 sec
    [junit] Running org.apache.geronimo.system.configuration.InPlaceConfigurationUtilTest
    [junit] Tests run: 3, Failures: 0, Errors: 0, Time elapsed: 0.448 sec
    [junit] Running org.apache.geronimo.system.configuration.LocalAttributeManagerTest
    [junit] Tests run: 6, Failures: 0, Errors: 0, Time elapsed: 0.509 sec
    [junit] Running org.apache.geronimo.system.configuration.ServerOverrideTest
    [junit] Tests run: 4, Failures: 0, Errors: 0, Time elapsed: 0.511 sec
    [junit] Running org.apache.geronimo.system.logging.log4j.XLevelTest
    [junit] Tests run: 4, Failures: 0, Errors: 0, Time elapsed: 0.331 sec
    [junit] Running org.apache.geronimo.system.properties.NamingPropertiesTest
    [junit] Tests run: 1, Failures: 0, Errors: 0, Time elapsed: 0.408 sec
    [junit] Running org.apache.geronimo.system.repository.Maven1RepositoryTest
    [junit] Tests run: 10, Failures: 0, Errors: 0, Time elapsed: 0.552 sec
    [junit] Running org.apache.geronimo.system.repository.Maven2RepositoryTest
    [junit] Tests run: 10, Failures: 0, Errors: 0, Time elapsed: 0.564 sec
    [junit] Running org.apache.geronimo.system.rmi.RMIClassLoaderSpiImplTest
    [junit] Tests run: 3, Failures: 0, Errors: 0, Time elapsed: 0.35 sec
    [junit] Running org.apache.geronimo.system.serverinfo.ServerInfoTest
    [junit] Tests run: 2, Failures: 0, Errors: 0, Time elapsed: 0.376 sec
Running post goal: test:test

jar:jar:
    [jar] Building jar: /home/continuum/continuum-1.0.2/apps/continuum/work/68/modules/system/target/geronimo-system-1.1-SNAPSHOT.jar

jar:install:
    [echo] Installing...
Uploading to geronimo/jars/geronimo-system-1.1-SNAPSHOT.jar: 
.................... (202K)
Uploading to geronimo/poms/geronimo-system-1.1-SNAPSHOT.pom: 
.................... (11K)

+----------------------------------------
| geronimo and geronimo-plugins Geronimo :: Deployment
| Memory: 20M/27M
+----------------------------------------
DEPRECATED: the default goal should be specified in the <build> section of project.xml instead of maven.xml
DEPRECATED: the default goal should be specified in the <build> section of project.xml instead of maven.xml

build:end:

Attempting to download geronimo-system-1.1-SNAPSHOT.jar.
build:start:

multiproject:install-callback:
    [echo] Running jar:install for Geronimo :: Deployment
java:prepare-filesystem:

java:compile:
<depend closure="false" srcdir="1.4" dump="false" destdir="/home/continuum/continuum-1.0.2/apps/continuum/work/68/modules/deployment/target/classes"></depend>    [echo] Compiling to /home/continuum/continuum-1.0.2/apps/continuum/work/68/modules/deployment/target/classes
    [javac] Compiling 3 source files to /home/continuum/continuum-1.0.2/apps/continuum/work/68/modules/deployment/target/classes

java:jar-resources:

test:prepare-filesystem:

test:test-resources:

test:compile:

test:test:
    [junit] Running org.apache.geronimo.deployment.DeploymentContextTest
    [junit] Tests run: 1, Failures: 0, Errors: 0, Time elapsed: 0.334 sec
Running post goal: test:test
00:03:28,443 INFO  [PostGoalTag] Running post goal: test:test

jar:jar:
    [jar] Building jar: /home/continuum/continuum-1.0.2/apps/continuum/work/68/modules/deployment/target/geronimo-deployment-1.1-SNAPSHOT.jar

jar:install:
    [echo] Installing...
Uploading to geronimo/jars/geronimo-deployment-1.1-SNAPSHOT.jar: 
.................... (51K)
Uploading to geronimo/poms/geronimo-deployment-1.1-SNAPSHOT.pom: 
.................... (11K)

+----------------------------------------

build:end:

00:03:28,842 INFO  [ReactorTag] +----------------------------------------
| geronimo and geronimo-plugins Geronimo :: Deploy :: Common Config
00:03:28,842 INFO  [ReactorTag] | geronimo and geronimo-plugins Geronimo :: Deploy :: Common Config
| Memory: 25M/27M
00:03:28,842 INFO  [ReactorTag] | Memory: 25M/27M
+----------------------------------------
00:03:28,842 INFO  [ReactorTag] +----------------------------------------
DEPRECATED: the default goal should be specified in the <build> section of project.xml instead of maven.xml
00:03:28,867 WARN  [PluginScriptParser] DEPRECATED: the default goal should be specified in the <build> section of project.xml instead of maven.xml
DEPRECATED: the default goal should be specified in the <build> section of project.xml instead of maven.xml
00:03:28,868 WARN  [PluginScriptParser] DEPRECATED: the default goal should be specified in the <build> section of project.xml instead of maven.xml
build:start:

multiproject:install-callback:
    [echo] Running jar:install for Geronimo :: Deploy :: Common Config
java:prepare-filesystem:

java:compile:
<depend closure="false" srcdir="1.4" dump="false" destdir="/home/continuum/continuum-1.0.2/apps/continuum/work/68/modules/deploy-config/target/classes"></depend>    [echo] Compiling to /home/continuum/continuum-1.0.2/apps/continuum/work/68/modules/deploy-config/target/classes

java:jar-resources:

test:prepare-filesystem:

test:test-resources:

test:compile:

test:test:
    [echo] NOTICE: Skipping tests; they seem to have passed already
    [echo] No tests to run.
Running post goal: test:test
00:03:30,031 INFO  [PostGoalTag] Running post goal: test:test

jar:jar:

jar:install:
    [echo] Installing...
Uploading to geronimo/jars/geronimo-deploy-config-1.1-SNAPSHOT.jar: 
.................... (10K)
Uploading to geronimo/poms/geronimo-deploy-config-1.1-SNAPSHOT.pom: 
.................... (11K)

+----------------------------------------

build:end:

00:03:30,303 INFO  [ReactorTag] +----------------------------------------
| geronimo and geronimo-plugins Geronimo :: Management API
00:03:30,303 INFO  [ReactorTag] | geronimo and geronimo-plugins Geronimo :: Management API
| Memory: 26M/27M
00:03:30,303 INFO  [ReactorTag] | Memory: 26M/27M
+----------------------------------------
00:03:30,303 INFO  [ReactorTag] +----------------------------------------
DEPRECATED: the default goal should be specified in the <build> section of project.xml instead of maven.xml
00:03:30,336 WARN  [PluginScriptParser] DEPRECATED: the default goal should be specified in the <build> section of project.xml instead of maven.xml
DEPRECATED: the default goal should be specified in the <build> section of project.xml instead of maven.xml
00:03:30,337 WARN  [PluginScriptParser] DEPRECATED: the default goal should be specified in the <build> section of project.xml instead of maven.xml
build:start:

multiproject:install-callback:
    [echo] Running jar:install for Geronimo :: Management API
java:prepare-filesystem:

java:compile:
<depend closure="false" srcdir="1.4" dump="false" destdir="/home/continuum/continuum-1.0.2/apps/continuum/work/68/modules/management/target/classes"></depend>    [echo] Compiling to /home/continuum/continuum-1.0.2/apps/continuum/work/68/modules/management/target/classes

java:jar-resources:

test:prepare-filesystem:

test:test-resources:

test:compile:
    [echo] No test source files to compile.

test:test:
    [echo] NOTICE: Skipping tests; they seem to have passed already
    [echo] No tests to run.
Running post goal: test:test
00:03:31,838 INFO  [PostGoalTag] Running post goal: test:test

jar:jar:

jar:install:
    [echo] Installing...
Uploading to geronimo/jars/geronimo-management-1.1-SNAPSHOT.jar: 
.................... (39K)
Uploading to geronimo/poms/geronimo-management-1.1-SNAPSHOT.pom: 
.................... (10K)

+----------------------------------------

build:end:

00:03:32,175 INFO  [ReactorTag] +----------------------------------------
| geronimo and geronimo-plugins Geronimo :: Core
00:03:32,175 INFO  [ReactorTag] | geronimo and geronimo-plugins Geronimo :: Core
| Memory: 15M/27M
00:03:32,175 INFO  [ReactorTag] | Memory: 15M/27M
+----------------------------------------
00:03:32,175 INFO  [ReactorTag] +----------------------------------------
DEPRECATED: the default goal should be specified in the <build> section of project.xml instead of maven.xml
00:03:32,208 WARN  [PluginScriptParser] DEPRECATED: the default goal should be specified in the <build> section of project.xml instead of maven.xml
DEPRECATED: the default goal should be specified in the <build> section of project.xml instead of maven.xml
00:03:32,209 WARN  [PluginScriptParser] DEPRECATED: the default goal should be specified in the <build> section of project.xml instead of maven.xml
Attempting to download geronimo-management-1.1-SNAPSHOT.jar.
00:03:32,538 INFO  [DependencyVerifier] Attempting to download geronimo-management-1.1-SNAPSHOT.jar.
build:start:

multiproject:install-callback:
    [echo] Running jar:install for Geronimo :: Core
java:prepare-filesystem:

java:compile:
<depend closure="false" srcdir="1.4" dump="false" destdir="/home/continuum/continuum-1.0.2/apps/continuum/work/68/modules/core/target/classes"></depend>    [echo] Compiling to /home/continuum/continuum-1.0.2/apps/continuum/work/68/modules/core/target/classes

java:jar-resources:

test:prepare-filesystem:

test:test-resources:

test:compile:

test:test:
    [echo] NOTICE: Skipping tests; they seem to have passed already
    [echo] No tests to run.
Running post goal: test:test
00:03:34,289 INFO  [PostGoalTag] Running post goal: test:test

jar:jar:

jar:install:
    [echo] Installing...
Uploading to geronimo/jars/geronimo-core-1.1-SNAPSHOT.jar: 
.................... (39K)
Uploading to geronimo/poms/geronimo-core-1.1-SNAPSHOT.pom: 
.................... (11K)

+----------------------------------------

build:end:

00:03:34,560 INFO  [ReactorTag] +----------------------------------------
| geronimo and geronimo-plugins Geronimo :: J2EE
00:03:34,560 INFO  [ReactorTag] | geronimo and geronimo-plugins Geronimo :: J2EE
| Memory: 14M/27M
00:03:34,560 INFO  [ReactorTag] | Memory: 14M/27M
+----------------------------------------
00:03:34,560 INFO  [ReactorTag] +----------------------------------------
DEPRECATED: the default goal should be specified in the <build> section of project.xml instead of maven.xml
00:03:34,590 WARN  [PluginScriptParser] DEPRECATED: the default goal should be specified in the <build> section of project.xml instead of maven.xml
DEPRECATED: the default goal should be specified in the <build> section of project.xml instead of maven.xml
00:03:34,591 WARN  [PluginScriptParser] DEPRECATED: the default goal should be specified in the <build> section of project.xml instead of maven.xml
Attempting to download geronimo-core-1.1-SNAPSHOT.jar.
00:03:34,919 INFO  [DependencyVerifier] Attempting to download geronimo-core-1.1-SNAPSHOT.jar.
build:start:

multiproject:install-callback:
    [echo] Running jar:install for Geronimo :: J2EE
java:prepare-filesystem:

java:compile:
<depend closure="false" srcdir="1.4" dump="false" destdir="/home/continuum/continuum-1.0.2/apps/continuum/work/68/modules/j2ee/target/classes"></depend>    [echo] Compiling to /home/continuum/continuum-1.0.2/apps/continuum/work/68/modules/j2ee/target/classes

java:jar-resources:

test:prepare-filesystem:

test:test-resources:

test:compile:

test:test:
    [echo] NOTICE: Skipping tests; they seem to have passed already
    [echo] No tests to run.
Running post goal: test:test
00:03:36,678 INFO  [PostGoalTag] Running post goal: test:test

jar:jar:

jar:install:
    [echo] Installing...
Uploading to geronimo/jars/geronimo-j2ee-1.1-SNAPSHOT.jar: 
.................... (29K)
Uploading to geronimo/poms/geronimo-j2ee-1.1-SNAPSHOT.pom: 
.................... (12K)

+----------------------------------------

build:end:

00:03:36,964 INFO  [ReactorTag] +----------------------------------------
| geronimo and geronimo-plugins Geronimo :: J2EE Schema
00:03:36,964 INFO  [ReactorTag] | geronimo and geronimo-plugins Geronimo :: J2EE Schema
| Memory: 15M/27M
00:03:36,964 INFO  [ReactorTag] | Memory: 15M/27M
+----------------------------------------
00:03:36,964 INFO  [ReactorTag] +----------------------------------------
DEPRECATED: the default goal should be specified in the <build> section of project.xml instead of maven.xml
00:03:36,988 WARN  [PluginScriptParser] DEPRECATED: the default goal should be specified in the <build> section of project.xml instead of maven.xml
DEPRECATED: the default goal should be specified in the <build> section of project.xml instead of maven.xml
00:03:36,989 WARN  [PluginScriptParser] DEPRECATED: the default goal should be specified in the <build> section of project.xml instead of maven.xml
build:start:

multiproject:install-callback:
    [echo] Running jar:install for Geronimo :: J2EE Schema
java:prepare-filesystem:

java:compile:
<depend closure="false" srcdir="1.4" dump="false" destdir="/home/continuum/continuum-1.0.2/apps/continuum/work/68/modules/j2ee-schema/target/classes"></depend>    [echo] Compiling to /home/continuum/continuum-1.0.2/apps/continuum/work/68/modules/j2ee-schema/target/classes

java:jar-resources:

test:prepare-filesystem:

test:test-resources:

test:compile:

test:test:
    [echo] NOTICE: Skipping tests; they seem to have passed already
    [echo] No tests to run.
Running post goal: test:test
00:03:39,464 INFO  [PostGoalTag] Running post goal: test:test

jar:jar:

jar:install:
    [echo] Installing...
Uploading to geronimo/jars/geronimo-j2ee-schema-1.1-SNAPSHOT.jar: 
.................... (1501K)
Uploading to geronimo/poms/geronimo-j2ee-schema-1.1-SNAPSHOT.pom: 
.................... (11K)

+----------------------------------------

build:end:

00:03:40,606 INFO  [ReactorTag] +----------------------------------------
| geronimo and geronimo-plugins Geronimo :: Service :: Builder
00:03:40,606 INFO  [ReactorTag] | geronimo and geronimo-plugins Geronimo :: Service :: Builder
| Memory: 17M/27M
00:03:40,606 INFO  [ReactorTag] | Memory: 17M/27M
+----------------------------------------
00:03:40,606 INFO  [ReactorTag] +----------------------------------------
DEPRECATED: the default goal should be specified in the <build> section of project.xml instead of maven.xml
00:03:40,626 WARN  [PluginScriptParser] DEPRECATED: the default goal should be specified in the <build> section of project.xml instead of maven.xml
DEPRECATED: the default goal should be specified in the <build> section of project.xml instead of maven.xml
00:03:40,627 WARN  [PluginScriptParser] DEPRECATED: the default goal should be specified in the <build> section of project.xml instead of maven.xml
Attempting to download geronimo-deployment-1.1-SNAPSHOT.jar.
00:03:40,972 INFO  [DependencyVerifier] Attempting to download geronimo-deployment-1.1-SNAPSHOT.jar.
Attempting to download geronimo-deploy-config-1.1-SNAPSHOT.jar.
00:03:41,861 INFO  [DependencyVerifier] Attempting to download geronimo-deploy-config-1.1-SNAPSHOT.jar.
Attempting to download geronimo-j2ee-1.1-SNAPSHOT.jar.
00:03:42,792 INFO  [DependencyVerifier] Attempting to download geronimo-j2ee-1.1-SNAPSHOT.jar.
Attempting to download geronimo-j2ee-schema-1.1-SNAPSHOT.jar.
00:03:43,689 INFO  [DependencyVerifier] Attempting to download geronimo-j2ee-schema-1.1-SNAPSHOT.jar.
build:start:

multiproject:install-callback:
    [echo] Running jar:install for Geronimo :: Service :: Builder
java:prepare-filesystem:

java:compile:
<depend closure="false" srcdir="1.4" dump="false" destdir="/home/continuum/continuum-1.0.2/apps/continuum/work/68/modules/service-builder/target/classes"></depend>    [echo] Compiling to /home/continuum/continuum-1.0.2/apps/continuum/work/68/modules/service-builder/target/classes

java:jar-resources:

test:prepare-filesystem:

test:test-resources:

test:compile:

test:test:
    [echo] NOTICE: Skipping tests; they seem to have passed already
    [echo] No tests to run.
Running post goal: test:test
00:03:45,991 INFO  [PostGoalTag] Running post goal: test:test

jar:jar:

jar:install:
    [echo] Installing...
Uploading to geronimo/jars/geronimo-service-builder-1.1-SNAPSHOT.jar: 
.................... (179K)
Uploading to geronimo/poms/geronimo-service-builder-1.1-SNAPSHOT.pom: 
.................... (12K)

+----------------------------------------

build:end:

00:03:46,355 INFO  [ReactorTag] +----------------------------------------
| geronimo and geronimo-plugins Geronimo :: Maven Dependency Plugin
00:03:46,355 INFO  [ReactorTag] | geronimo and geronimo-plugins Geronimo :: Maven Dependency Plugin
| Memory: 19M/27M
00:03:46,355 INFO  [ReactorTag] | Memory: 19M/27M
+----------------------------------------
00:03:46,355 INFO  [ReactorTag] +----------------------------------------
DEPRECATED: the default goal should be specified in the <build> section of project.xml instead of maven.xml
00:03:46,397 WARN  [PluginScriptParser] DEPRECATED: the default goal should be specified in the <build> section of project.xml instead of maven.xml
Attempting to download geronimo-service-builder-1.1-SNAPSHOT.jar.
00:03:46,629 INFO  [DependencyVerifier] Attempting to download geronimo-service-builder-1.1-SNAPSHOT.jar.
Artifact /geronimo/jars/geronimo-service-builder-1.1-SNAPSHOT.jar doesn't exist in remote repository, but it exists locally.
00:03:47,157 INFO  [DependencyVerifier] Artifact /geronimo/jars/geronimo-service-builder-1.1-SNAPSHOT.jar doesn't exist in remote repository, but it exists locally.
build:start:

multiproject:install-callback:
    [echo] Running plugin:repository-install for Geronimo :: Maven Dependency Plugin
plugin:plugin:
java:prepare-filesystem:

java:compile:
    [echo] Compiling to /home/continuum/continuum-1.0.2/apps/continuum/work/68/plugins/geronimo-dependency-plugin/target/classes

java:jar-resources:

test:prepare-filesystem:

test:test-resources:

test:compile:
    [echo] No test source files to compile.

test:test:
    [echo] No tests to run.

jar:jar:


plugin:repository-install:
    [echo] Installing...
Uploading to geronimo/plugins/geronimo-dependency-plugin-1.1.0-1.jar: 
.................... (9K)
Uploading to geronimo/poms/geronimo-dependency-plugin-1.1.0-1.pom: 
.................... (1K)

+----------------------------------------

build:end:

00:03:48,039 INFO  [ReactorTag] +----------------------------------------
| geronimo and geronimo-plugins Geronimo :: Naming
00:03:48,039 INFO  [ReactorTag] | geronimo and geronimo-plugins Geronimo :: Naming
| Memory: 18M/27M
00:03:48,039 INFO  [ReactorTag] | Memory: 18M/27M
+----------------------------------------
00:03:48,039 INFO  [ReactorTag] +----------------------------------------
DEPRECATED: the default goal should be specified in the <build> section of project.xml instead of maven.xml
00:03:48,068 WARN  [PluginScriptParser] DEPRECATED: the default goal should be specified in the <build> section of project.xml instead of maven.xml
DEPRECATED: the default goal should be specified in the <build> section of project.xml instead of maven.xml
00:03:48,070 WARN  [PluginScriptParser] DEPRECATED: the default goal should be specified in the <build> section of project.xml instead of maven.xml
build:start:

multiproject:install-callback:
    [echo] Running jar:install for Geronimo :: Naming
java:prepare-filesystem:

java:compile:
<depend closure="false" srcdir="1.4" dump="false" destdir="/home/continuum/continuum-1.0.2/apps/continuum/work/68/modules/naming/target/classes"></depend>    [echo] Compiling to /home/continuum/continuum-1.0.2/apps/continuum/work/68/modules/naming/target/classes

java:jar-resources:

test:prepare-filesystem:

test:test-resources:

test:compile:

test:test:
    [echo] NOTICE: Skipping tests; they seem to have passed already
    [echo] No tests to run.
Running post goal: test:test
00:03:49,291 INFO  [PostGoalTag] Running post goal: test:test

jar:jar:

jar:install:
    [echo] Installing...
Uploading to geronimo/jars/geronimo-naming-1.1-SNAPSHOT.jar: 
.................... (46K)
Uploading to geronimo/poms/geronimo-naming-1.1-SNAPSHOT.pom: 
.................... (10K)

+----------------------------------------

build:end:

00:03:49,645 INFO  [ReactorTag] +----------------------------------------
| geronimo and geronimo-plugins Geronimo :: Security
00:03:49,645 INFO  [ReactorTag] | geronimo and geronimo-plugins Geronimo :: Security
| Memory: 20M/27M
00:03:49,645 INFO  [ReactorTag] | Memory: 20M/27M
+----------------------------------------
00:03:49,645 INFO  [ReactorTag] +----------------------------------------
DEPRECATED: the default goal should be specified in the <build> section of project.xml instead of maven.xml
00:03:49,679 WARN  [PluginScriptParser] DEPRECATED: the default goal should be specified in the <build> section of project.xml instead of maven.xml
DEPRECATED: the default goal should be specified in the <build> section of project.xml instead of maven.xml
00:03:49,680 WARN  [PluginScriptParser] DEPRECATED: the default goal should be specified in the <build> section of project.xml instead of maven.xml
build:start:

multiproject:install-callback:
    [echo] Running jar:install for Geronimo :: Security
java:prepare-filesystem:

java:compile:
<depend closure="false" srcdir="1.4" dump="false" destdir="/home/continuum/continuum-1.0.2/apps/continuum/work/68/modules/security/target/classes"></depend>    [echo] Compiling to /home/continuum/continuum-1.0.2/apps/continuum/work/68/modules/security/target/classes

java:jar-resources:

test:prepare-filesystem:

test:test-resources:
Running post goal: test:test-resources
00:03:51,317 INFO  [PostGoalTag] Running post goal: test:test-resources
    [delete] Deleting directory /home/continuum/continuum-1.0.2/apps/continuum/work/68/modules/security/target/database
    [mkdir] Created dir: /home/continuum/continuum-1.0.2/apps/continuum/work/68/modules/security/target/database

test:compile:

test:test:
    [echo] NOTICE: Skipping tests; they seem to have passed already
    [echo] No tests to run.
Running post goal: test:test
00:03:51,830 INFO  [PostGoalTag] Running post goal: test:test

jar:jar:

jar:install:
    [echo] Installing...
Uploading to geronimo/jars/geronimo-security-1.1-SNAPSHOT.jar: 
.................... (186K)
Uploading to geronimo/poms/geronimo-security-1.1-SNAPSHOT.pom: 
.................... (13K)

+----------------------------------------

build:end:

00:03:52,268 INFO  [ReactorTag] +----------------------------------------
| geronimo and geronimo-plugins Geronimo :: Web Services
00:03:52,269 INFO  [ReactorTag] | geronimo and geronimo-plugins Geronimo :: Web Services
| Memory: 19M/27M
00:03:52,269 INFO  [ReactorTag] | Memory: 19M/27M
+----------------------------------------
00:03:52,269 INFO  [ReactorTag] +----------------------------------------
DEPRECATED: the default goal should be specified in the <build> section of project.xml instead of maven.xml
00:03:52,279 WARN  [PluginScriptParser] DEPRECATED: the default goal should be specified in the <build> section of project.xml instead of maven.xml
build:start:

multiproject:install-callback:
    [echo] Running jar:install for Geronimo :: Web Services
java:prepare-filesystem:

java:compile:
<depend closure="false" srcdir="1.4" dump="false" destdir="/home/continuum/continuum-1.0.2/apps/continuum/work/68/modules/webservices/target/classes"></depend>    [echo] Compiling to /home/continuum/continuum-1.0.2/apps/continuum/work/68/modules/webservices/target/classes

java:jar-resources:

test:prepare-filesystem:

test:test-resources:

test:compile:
    [echo] No test source files to compile.

test:test:
    [echo] NOTICE: Skipping tests; they seem to have passed already
    [echo] No tests to run.
Running post goal: test:test
00:03:53,411 INFO  [PostGoalTag] Running post goal: test:test

jar:jar:

jar:install:
    [echo] Installing...
Uploading to geronimo/jars/geronimo-webservices-1.1-SNAPSHOT.jar: 
.................... (34K)
Uploading to geronimo/poms/geronimo-webservices-1.1-SNAPSHOT.pom: 
.................... (12K)

+----------------------------------------

build:end:

00:03:53,974 INFO  [ReactorTag] +----------------------------------------
| geronimo and geronimo-plugins Geronimo :: Axis
00:03:53,975 INFO  [ReactorTag] | geronimo and geronimo-plugins Geronimo :: Axis
| Memory: 14M/27M
00:03:53,975 INFO  [ReactorTag] | Memory: 14M/27M
+----------------------------------------
00:03:53,975 INFO  [ReactorTag] +----------------------------------------
DEPRECATED: the default goal should be specified in the <build> section of project.xml instead of maven.xml
00:03:54,005 WARN  [PluginScriptParser] DEPRECATED: the default goal should be specified in the <build> section of project.xml instead of maven.xml
DEPRECATED: the default goal should be specified in the <build> section of project.xml instead of maven.xml
00:03:54,005 WARN  [PluginScriptParser] DEPRECATED: the default goal should be specified in the <build> section of project.xml instead of maven.xml
Attempting to download geronimo-naming-1.1-SNAPSHOT.jar.
00:03:54,330 INFO  [DependencyVerifier] Attempting to download geronimo-naming-1.1-SNAPSHOT.jar.
Attempting to download geronimo-security-1.1-SNAPSHOT.jar.
00:03:55,245 INFO  [DependencyVerifier] Attempting to download geronimo-security-1.1-SNAPSHOT.jar.
Attempting to download geronimo-webservices-1.1-SNAPSHOT.jar.
00:03:56,130 INFO  [DependencyVerifier] Attempting to download geronimo-webservices-1.1-SNAPSHOT.jar.
build:start:

multiproject:install-callback:
    [echo] Running jar:install for Geronimo :: Axis
java:prepare-filesystem:

java:compile:
<depend closure="false" srcdir="1.4" dump="false" destdir="/home/continuum/continuum-1.0.2/apps/continuum/work/68/modules/axis/target/classes"></depend>    [echo] Compiling to /home/continuum/continuum-1.0.2/apps/continuum/work/68/modules/axis/target/classes
Running post goal: java:compile
00:03:57,592 INFO  [PostGoalTag] Running post goal: java:compile
geronimo:dependency:


java:jar-resources:
Copying 1 file to /home/continuum/continuum-1.0.2/apps/continuum/work/68/modules/axis/target/classes

test:prepare-filesystem:

test:test-resources:

test:compile:

test:test:
    [echo] NOTICE: Skipping tests; they seem to have passed already
    [echo] No tests to run.
Running post goal: test:test
00:03:59,112 INFO  [PostGoalTag] Running post goal: test:test

jar:jar:
    [jar] Building jar: /home/continuum/continuum-1.0.2/apps/continuum/work/68/modules/axis/target/geronimo-axis-1.1-SNAPSHOT.jar

jar:install:
    [echo] Installing...
Uploading to geronimo/jars/geronimo-axis-1.1-SNAPSHOT.jar: 
.................... (42K)
Uploading to geronimo/poms/geronimo-axis-1.1-SNAPSHOT.pom: 
.................... (12K)

+----------------------------------------

build:end:

00:03:59,603 INFO  [ReactorTag] +----------------------------------------
| geronimo and geronimo-plugins Geronimo :: Test :: DDBeans
00:03:59,603 INFO  [ReactorTag] | geronimo and geronimo-plugins Geronimo :: Test :: DDBeans
| Memory: 15M/27M
00:03:59,603 INFO  [ReactorTag] | Memory: 15M/27M
+----------------------------------------
00:03:59,603 INFO  [ReactorTag] +----------------------------------------
DEPRECATED: the default goal should be specified in the <build> section of project.xml instead of maven.xml
00:03:59,629 WARN  [PluginScriptParser] DEPRECATED: the default goal should be specified in the <build> section of project.xml instead of maven.xml
DEPRECATED: the default goal should be specified in the <build> section of project.xml instead of maven.xml
00:03:59,630 WARN  [PluginScriptParser] DEPRECATED: the default goal should be specified in the <build> section of project.xml instead of maven.xml
build:start:

multiproject:install-callback:
    [echo] Running jar:install for Geronimo :: Test :: DDBeans
java:prepare-filesystem:

java:compile:
<depend closure="false" srcdir="1.4" dump="false" destdir="/home/continuum/continuum-1.0.2/apps/continuum/work/68/modules/test-ddbean/target/classes"></depend>    [echo] Compiling to /home/continuum/continuum-1.0.2/apps/continuum/work/68/modules/test-ddbean/target/classes

java:jar-resources:

test:prepare-filesystem:

test:test-resources:

test:compile:

test:test:
    [echo] NOTICE: Skipping tests; they seem to have passed already
    [echo] No tests to run.
Running post goal: test:test
00:04:00,764 INFO  [PostGoalTag] Running post goal: test:test

jar:jar:

jar:install:
    [echo] Installing...
Uploading to geronimo/jars/geronimo-test-ddbean-1.1-SNAPSHOT.jar: 
.................... (17K)
Uploading to geronimo/poms/geronimo-test-ddbean-1.1-SNAPSHOT.pom: 
.................... (10K)

+----------------------------------------

build:end:

00:04:01,075 INFO  [ReactorTag] +----------------------------------------
| geronimo and geronimo-plugins Geronimo :: Transaction
00:04:01,075 INFO  [ReactorTag] | geronimo and geronimo-plugins Geronimo :: Transaction
| Memory: 15M/27M
00:04:01,075 INFO  [ReactorTag] | Memory: 15M/27M
+----------------------------------------
00:04:01,075 INFO  [ReactorTag] +----------------------------------------
DEPRECATED: the default goal should be specified in the <build> section of project.xml instead of maven.xml
00:04:01,086 WARN  [PluginScriptParser] DEPRECATED: the default goal should be specified in the <build> section of project.xml instead of maven.xml
build:start:

multiproject:install-callback:
    [echo] Running jar:install for Geronimo :: Transaction
java:prepare-filesystem:

java:compile:
<depend closure="false" srcdir="1.4" dump="false" destdir="/home/continuum/continuum-1.0.2/apps/continuum/work/68/modules/transaction/target/classes"></depend>    [echo] Compiling to /home/continuum/continuum-1.0.2/apps/continuum/work/68/modules/transaction/target/classes

java:jar-resources:

test:prepare-filesystem:

test:test-resources:

test:compile:

test:test:
    [echo] NOTICE: Skipping tests; they seem to have passed already
    [echo] No tests to run.
Running post goal: test:test
00:04:02,387 INFO  [PostGoalTag] Running post goal: test:test

jar:jar:

jar:install:
    [echo] Installing...
Uploading to geronimo/jars/geronimo-transaction-1.1-SNAPSHOT.jar: 
.................... (73K)
Uploading to geronimo/poms/geronimo-transaction-1.1-SNAPSHOT.pom: 
.................... (12K)

+----------------------------------------

build:end:

00:04:02,718 INFO  [ReactorTag] +----------------------------------------
| geronimo and geronimo-plugins Geronimo :: Connector
00:04:02,718 INFO  [ReactorTag] | geronimo and geronimo-plugins Geronimo :: Connector
| Memory: 14M/27M
00:04:02,718 INFO  [ReactorTag] | Memory: 14M/27M
+----------------------------------------
00:04:02,718 INFO  [ReactorTag] +----------------------------------------
DEPRECATED: the default goal should be specified in the <build> section of project.xml instead of maven.xml
00:04:02,746 WARN  [PluginScriptParser] DEPRECATED: the default goal should be specified in the <build> section of project.xml instead of maven.xml
DEPRECATED: the default goal should be specified in the <build> section of project.xml instead of maven.xml
00:04:02,747 WARN  [PluginScriptParser] DEPRECATED: the default goal should be specified in the <build> section of project.xml instead of maven.xml
Attempting to download geronimo-transaction-1.1-SNAPSHOT.jar.
00:04:03,076 INFO  [DependencyVerifier] Attempting to download geronimo-transaction-1.1-SNAPSHOT.jar.
build:start:

multiproject:install-callback:
    [echo] Running jar:install for Geronimo :: Connector
java:prepare-filesystem:

java:compile:
<depend closure="false" srcdir="1.4" dump="false" destdir="/home/continuum/continuum-1.0.2/apps/continuum/work/68/modules/connector/target/classes"></depend>    [echo] Compiling to /home/continuum/continuum-1.0.2/apps/continuum/work/68/modules/connector/target/classes

java:jar-resources:

test:prepare-filesystem:

test:test-resources:

test:compile:

test:test:
    [echo] NOTICE: Skipping tests; they seem to have passed already
    [echo] No tests to run.
Running post goal: test:test
00:04:05,195 INFO  [PostGoalTag] Running post goal: test:test

jar:jar:

jar:install:
    [echo] Installing...
Uploading to geronimo/jars/geronimo-connector-1.1-SNAPSHOT.jar: 
.................... (130K)
Uploading to geronimo/poms/geronimo-connector-1.1-SNAPSHOT.pom: 
.................... (13K)

+----------------------------------------

build:end:

00:04:05,521 INFO  [ReactorTag] +----------------------------------------
| geronimo and geronimo-plugins Geronimo :: Security :: Builder
00:04:05,521 INFO  [ReactorTag] | geronimo and geronimo-plugins Geronimo :: Security :: Builder
| Memory: 17M/27M
00:04:05,521 INFO  [ReactorTag] | Memory: 17M/27M
+----------------------------------------
00:04:05,522 INFO  [ReactorTag] +----------------------------------------
DEPRECATED: the default goal should be specified in the <build> section of project.xml instead of maven.xml
00:04:05,553 WARN  [PluginScriptParser] DEPRECATED: the default goal should be specified in the <build> section of project.xml instead of maven.xml
DEPRECATED: the default goal should be specified in the <build> section of project.xml instead of maven.xml
00:04:05,554 WARN  [PluginScriptParser] DEPRECATED: the default goal should be specified in the <build> section of project.xml instead of maven.xml
build:start:

multiproject:install-callback:
    [echo] Running jar:install for Geronimo :: Security :: Builder
java:prepare-filesystem:

java:compile:
<depend closure="false" srcdir="1.4" dump="false" destdir="/home/continuum/continuum-1.0.2/apps/continuum/work/68/modules/security-builder/target/classes"></depend>    [echo] Compiling to /home/continuum/continuum-1.0.2/apps/continuum/work/68/modules/security-builder/target/classes

java:jar-resources:

test:prepare-filesystem:

test:test-resources:
Running post goal: test:test-resources
00:04:07,456 INFO  [PostGoalTag] Running post goal: test:test-resources
    [delete] Deleting directory /home/continuum/continuum-1.0.2/apps/continuum/work/68/modules/security-builder/target/database
    [mkdir] Created dir: /home/continuum/continuum-1.0.2/apps/continuum/work/68/modules/security-builder/target/database

test:compile:
    [echo] No test source files to compile.

test:test:
    [echo] NOTICE: Skipping tests; they seem to have passed already
    [echo] No tests to run.
Running post goal: test:test
00:04:07,862 INFO  [PostGoalTag] Running post goal: test:test

jar:jar:

jar:install:
    [echo] Installing...
Uploading to geronimo/jars/geronimo-security-builder-1.1-SNAPSHOT.jar: 
.................... (172K)
Uploading to geronimo/poms/geronimo-security-builder-1.1-SNAPSHOT.pom: 
.................... (12K)

+----------------------------------------

build:end:

00:04:08,327 INFO  [ReactorTag] +----------------------------------------
| geronimo and geronimo-plugins Geronimo :: J2EE
00:04:08,328 INFO  [ReactorTag] | geronimo and geronimo-plugins Geronimo :: J2EE
| Memory: 17M/27M
00:04:08,328 INFO  [ReactorTag] | Memory: 17M/27M
+----------------------------------------
00:04:08,328 INFO  [ReactorTag] +----------------------------------------
DEPRECATED: the default goal should be specified in the <build> section of project.xml instead of maven.xml
00:04:08,367 WARN  [PluginScriptParser] DEPRECATED: the default goal should be specified in the <build> section of project.xml instead of maven.xml
DEPRECATED: the default goal should be specified in the <build> section of project.xml instead of maven.xml
00:04:08,370 WARN  [PluginScriptParser] DEPRECATED: the default goal should be specified in the <build> section of project.xml instead of maven.xml
Attempting to download geronimo-security-builder-1.1-SNAPSHOT.jar.
00:04:08,701 INFO  [DependencyVerifier] Attempting to download geronimo-security-builder-1.1-SNAPSHOT.jar.
build:start:

multiproject:install-callback:
    [echo] Running jar:install for Geronimo :: J2EE
java:prepare-filesystem:

java:compile:
<depend closure="false" srcdir="1.4" dump="false" destdir="/home/continuum/continuum-1.0.2/apps/continuum/work/68/modules/j2ee-builder/target/classes"></depend>    [echo] Compiling to /home/continuum/continuum-1.0.2/apps/continuum/work/68/modules/j2ee-builder/target/classes

java:jar-resources:

test:prepare-filesystem:

test:test-resources:

test:compile:
setupEar:

setupEar:

setupUnpackedEar:
setupBaseUnpackedEar:

setupBaseUnpackedEar:

setupBaseUnpackedEar:


    [javac] Compiling 1 source file to /home/continuum/continuum-1.0.2/apps/continuum/work/68/modules/j2ee-builder/target/test-classes

test:test:
    [junit] Running org.apache.geronimo.j2ee.deployment.EARConfigBuilderTest
    [junit] Tests run: 64, Failures: 0, Errors: 0, Time elapsed: 2.544 sec
    [junit] Running org.apache.geronimo.j2ee.deployment.EJBRefContextTest
    [junit] Tests run: 1, Failures: 0, Errors: 0, Time elapsed: 0.048 sec
Running post goal: test:test
00:04:17,147 INFO  [PostGoalTag] Running post goal: test:test

jar:jar:

jar:install:
    [echo] Installing...
Uploading to geronimo/jars/geronimo-j2ee-builder-1.1-SNAPSHOT.jar: 
.................... (90K)
Uploading to geronimo/poms/geronimo-j2ee-builder-1.1-SNAPSHOT.pom: 
.................... (13K)

+----------------------------------------

build:end:

00:04:17,516 INFO  [ReactorTag] +----------------------------------------
| geronimo and geronimo-plugins Geronimo :: Naming :: Builder
00:04:17,516 INFO  [ReactorTag] | geronimo and geronimo-plugins Geronimo :: Naming :: Builder
| Memory: 18M/29M
00:04:17,516 INFO  [ReactorTag] | Memory: 18M/29M
+----------------------------------------
00:04:17,516 INFO  [ReactorTag] +----------------------------------------
DEPRECATED: the default goal should be specified in the <build> section of project.xml instead of maven.xml
00:04:17,538 WARN  [PluginScriptParser] DEPRECATED: the default goal should be specified in the <build> section of project.xml instead of maven.xml
DEPRECATED: the default goal should be specified in the <build> section of project.xml instead of maven.xml
00:04:17,539 WARN  [PluginScriptParser] DEPRECATED: the default goal should be specified in the <build> section of project.xml instead of maven.xml
Attempting to download geronimo-j2ee-builder-1.1-SNAPSHOT.jar.
00:04:17,870 INFO  [DependencyVerifier] Attempting to download geronimo-j2ee-builder-1.1-SNAPSHOT.jar.
build:start:

multiproject:install-callback:
    [echo] Running jar:install for Geronimo :: Naming :: Builder
java:prepare-filesystem:

java:compile:
<depend closure="false" srcdir="1.4" dump="false" destdir="/home/continuum/continuum-1.0.2/apps/continuum/work/68/modules/naming-builder/target/classes"></depend>    [echo] Compiling to /home/continuum/continuum-1.0.2/apps/continuum/work/68/modules/naming-builder/target/classes

java:jar-resources:

test:prepare-filesystem:

test:test-resources:

test:compile:

test:test:
    [echo] NOTICE: Skipping tests; they seem to have passed already
    [echo] No tests to run.
Running post goal: test:test
00:04:20,528 INFO  [PostGoalTag] Running post goal: test:test

jar:jar:

jar:install:
    [echo] Installing...
Uploading to geronimo/jars/geronimo-naming-builder-1.1-SNAPSHOT.jar: 
.................... (160K)
Uploading to geronimo/poms/geronimo-naming-builder-1.1-SNAPSHOT.pom: 
.................... (13K)

+----------------------------------------

build:end:

00:04:20,988 INFO  [ReactorTag] +----------------------------------------
| geronimo and geronimo-plugins Geronimo :: Connector :: Builder
00:04:20,988 INFO  [ReactorTag] | geronimo and geronimo-plugins Geronimo :: Connector :: Builder
| Memory: 20M/29M
00:04:20,988 INFO  [ReactorTag] | Memory: 20M/29M
+----------------------------------------
00:04:20,989 INFO  [ReactorTag] +----------------------------------------
DEPRECATED: the default goal should be specified in the <build> section of project.xml instead of maven.xml
00:04:21,017 WARN  [PluginScriptParser] DEPRECATED: the default goal should be specified in the <build> section of project.xml instead of maven.xml
DEPRECATED: the default goal should be specified in the <build> section of project.xml instead of maven.xml
00:04:21,018 WARN  [PluginScriptParser] DEPRECATED: the default goal should be specified in the <build> section of project.xml instead of maven.xml
Attempting to download geronimo-test-ddbean-1.1-SNAPSHOT.jar.
00:04:21,349 INFO  [DependencyVerifier] Attempting to download geronimo-test-ddbean-1.1-SNAPSHOT.jar.
Attempting to download geronimo-connector-1.1-SNAPSHOT.jar.
00:04:22,230 INFO  [DependencyVerifier] Attempting to download geronimo-connector-1.1-SNAPSHOT.jar.
Attempting to download geronimo-naming-builder-1.1-SNAPSHOT.jar.
00:04:23,141 INFO  [DependencyVerifier] Attempting to download geronimo-naming-builder-1.1-SNAPSHOT.jar.
build:start:

multiproject:install-callback:
    [echo] Running jar:install for Geronimo :: Connector :: Builder
java:prepare-filesystem:

java:compile:
<depend closure="false" srcdir="1.4" dump="false" destdir="/home/continuum/continuum-1.0.2/apps/continuum/work/68/modules/connector-builder/target/classes"></depend>    [echo] Compiling to /home/continuum/continuum-1.0.2/apps/continuum/work/68/modules/connector-builder/target/classes

java:jar-resources:

test:prepare-filesystem:

test:test-resources:

test:compile:
    [javac] Compiling 1 source file to /home/continuum/continuum-1.0.2/apps/continuum/work/68/modules/connector-builder/target/test-classes

test:test:
    [junit] Running org.apache.geronimo.connector.deployment.ConnectorModuleBuilderTest
    [junit] Tests run: 10, Failures: 0, Errors: 0, Time elapsed: 5.751 sec
    [junit] Running org.apache.geronimo.connector.deployment.PlanParsingTest
    [junit] Tests run: 7, Failures: 0, Errors: 0, Time elapsed: 1.389 sec
    [junit] Running org.apache.geronimo.connector.deployment.RAR_1_0DConfigBeanTest
    [junit] Tests run: 1, Failures: 0, Errors: 0, Time elapsed: 0.355 sec
    [junit] Running org.apache.geronimo.connector.deployment.RAR_1_5DConfigBeanTest
    [junit] Tests run: 1, Failures: 0, Errors: 0, Time elapsed: 0.354 sec
    [junit] Running org.apache.geronimo.connector.deployment.jsr88.Connector15DCBTest
    [junit] Tests run: 4, Failures: 0, Errors: 0, Time elapsed: 2.571 sec
Running post goal: test:test
00:04:40,354 INFO  [PostGoalTag] Running post goal: test:test

jar:jar:

jar:install:
    [echo] Installing...
Uploading to geronimo/jars/geronimo-connector-builder-1.1-SNAPSHOT.jar: 
.................... (202K)
Uploading to geronimo/poms/geronimo-connector-builder-1.1-SNAPSHOT.pom: 
.................... (15K)

+----------------------------------------

build:end:

00:04:40,706 INFO  [ReactorTag] +----------------------------------------
| geronimo and geronimo-plugins Geronimo :: Axis :: Builder
00:04:40,706 INFO  [ReactorTag] | geronimo and geronimo-plugins Geronimo :: Axis :: Builder
| Memory: 28M/29M
00:04:40,706 INFO  [ReactorTag] | Memory: 28M/29M
+----------------------------------------
00:04:40,706 INFO  [ReactorTag] +----------------------------------------
DEPRECATED: the default goal should be specified in the <build> section of project.xml instead of maven.xml
00:04:40,730 WARN  [PluginScriptParser] DEPRECATED: the default goal should be specified in the <build> section of project.xml instead of maven.xml
DEPRECATED: the default goal should be specified in the <build> section of project.xml instead of maven.xml
00:04:40,731 WARN  [PluginScriptParser] DEPRECATED: the default goal should be specified in the <build> section of project.xml instead of maven.xml
Attempting to download geronimo-axis-1.1-SNAPSHOT.jar.
00:04:41,062 INFO  [DependencyVerifier] Attempting to download geronimo-axis-1.1-SNAPSHOT.jar.
Attempting to download geronimo-connector-builder-1.1-SNAPSHOT.jar.
00:04:42,049 INFO  [DependencyVerifier] Attempting to download geronimo-connector-builder-1.1-SNAPSHOT.jar.
build:start:

multiproject:install-callback:
    [echo] Running jar:install for Geronimo :: Axis :: Builder
java:prepare-filesystem:

java:compile:
<depend closure="false" srcdir="1.4" dump="false" destdir="/home/continuum/continuum-1.0.2/apps/continuum/work/68/modules/axis-builder/target/classes"></depend>    [echo] Compiling to /home/continuum/continuum-1.0.2/apps/continuum/work/68/modules/axis-builder/target/classes

java:jar-resources:

test:prepare-filesystem:

test:test-resources:

test:compile:

test:test:
    [echo] NOTICE: Skipping tests; they seem to have passed already
    [echo] No tests to run.
Running post goal: test:test
00:04:44,735 INFO  [PostGoalTag] Running post goal: test:test

jar:jar:

jar:install:
    [echo] Installing...
Uploading to geronimo/jars/geronimo-axis-builder-1.1-SNAPSHOT.jar: 
.................... (219K)
Uploading to geronimo/poms/geronimo-axis-builder-1.1-SNAPSHOT.pom: 
.................... (15K)

+----------------------------------------

build:end:

00:04:45,587 INFO  [ReactorTag] +----------------------------------------
| geronimo and geronimo-plugins Geronimo :: Client
00:04:45,587 INFO  [ReactorTag] | geronimo and geronimo-plugins Geronimo :: Client
| Memory: 17M/29M
00:04:45,587 INFO  [ReactorTag] | Memory: 17M/29M
+----------------------------------------
00:04:45,587 INFO  [ReactorTag] +----------------------------------------
DEPRECATED: the default goal should be specified in the <build> section of project.xml instead of maven.xml
00:04:45,598 WARN  [PluginScriptParser] DEPRECATED: the default goal should be specified in the <build> section of project.xml instead of maven.xml
build:start:

multiproject:install-callback:
    [echo] Running jar:install for Geronimo :: Client
java:prepare-filesystem:

java:compile:
<depend closure="false" srcdir="1.4" dump="false" destdir="/home/continuum/continuum-1.0.2/apps/continuum/work/68/modules/client/target/classes"></depend>    [echo] Compiling to /home/continuum/continuum-1.0.2/apps/continuum/work/68/modules/client/target/classes

java:jar-resources:

test:prepare-filesystem:

test:test-resources:

test:compile:
    [echo] No test source files to compile.

test:test:
    [echo] NOTICE: Skipping tests; they seem to have passed already
    [echo] No tests to run.
Running post goal: test:test
00:04:46,722 INFO  [PostGoalTag] Running post goal: test:test

jar:jar:

jar:install:
    [echo] Installing...
Uploading to geronimo/jars/geronimo-client-1.1-SNAPSHOT.jar: 
.................... (14K)
Uploading to geronimo/poms/geronimo-client-1.1-SNAPSHOT.pom: 
.................... (12K)

+----------------------------------------

build:end:

00:04:46,988 INFO  [ReactorTag] +----------------------------------------
| geronimo and geronimo-plugins Geronimo :: Client Builder
00:04:46,988 INFO  [ReactorTag] | geronimo and geronimo-plugins Geronimo :: Client Builder
| Memory: 18M/29M
00:04:46,988 INFO  [ReactorTag] | Memory: 18M/29M
+----------------------------------------
00:04:46,988 INFO  [ReactorTag] +----------------------------------------
DEPRECATED: the default goal should be specified in the <build> section of project.xml instead of maven.xml
00:04:47,023 WARN  [PluginScriptParser] DEPRECATED: the default goal should be specified in the <build> section of project.xml instead of maven.xml
DEPRECATED: the default goal should be specified in the <build> section of project.xml instead of maven.xml
00:04:47,024 WARN  [PluginScriptParser] DEPRECATED: the default goal should be specified in the <build> section of project.xml instead of maven.xml
Attempting to download geronimo-client-1.1-SNAPSHOT.jar.
00:04:47,354 INFO  [DependencyVerifier] Attempting to download geronimo-client-1.1-SNAPSHOT.jar.
build:start:

multiproject:install-callback:
    [echo] Running jar:install for Geronimo :: Client Builder
java:prepare-filesystem:

java:compile:
<depend closure="false" srcdir="1.4" dump="false" destdir="/home/continuum/continuum-1.0.2/apps/continuum/work/68/modules/client-builder/target/classes"></depend>    [echo] Compiling to /home/continuum/continuum-1.0.2/apps/continuum/work/68/modules/client-builder/target/classes

java:jar-resources:

test:prepare-filesystem:

test:test-resources:

test:compile:

test:test:
    [echo] NOTICE: Skipping tests; they seem to have passed already
    [echo] No tests to run.
Running post goal: test:test
00:04:49,623 INFO  [PostGoalTag] Running post goal: test:test

jar:jar:

jar:install:
    [echo] Installing...
Uploading to geronimo/jars/geronimo-client-builder-1.1-SNAPSHOT.jar: 
.................... (46K)
Uploading to geronimo/poms/geronimo-client-builder-1.1-SNAPSHOT.pom: 
.................... (14K)

+----------------------------------------

build:end:

00:04:49,931 INFO  [ReactorTag] +----------------------------------------
| geronimo and geronimo-plugins Geronimo :: Console Web
00:04:49,931 INFO  [ReactorTag] | geronimo and geronimo-plugins Geronimo :: Console Web
| Memory: 19M/29M
00:04:49,931 INFO  [ReactorTag] | Memory: 19M/29M
+----------------------------------------
00:04:49,931 INFO  [ReactorTag] +----------------------------------------
DEPRECATED: the default goal should be specified in the <build> section of project.xml instead of maven.xml
00:04:49,953 WARN  [PluginScriptParser] DEPRECATED: the default goal should be specified in the <build> section of project.xml instead of maven.xml
DEPRECATED: the default goal should be specified in the <build> section of project.xml instead of maven.xml
00:04:49,954 WARN  [PluginScriptParser] DEPRECATED: the default goal should be specified in the <build> section of project.xml instead of maven.xml
build:start:

multiproject:install-callback:
    [echo] Running jar:install for Geronimo :: Console Web
java:prepare-filesystem:

java:compile:
<depend closure="false" srcdir="1.4" dump="false" destdir="/home/continuum/continuum-1.0.2/apps/continuum/work/68/modules/console-web/target/classes"></depend>    [echo] Compiling to /home/continuum/continuum-1.0.2/apps/continuum/work/68/modules/console-web/target/classes

java:jar-resources:

test:prepare-filesystem:

test:test-resources:

test:compile:
    [echo] No test source files to compile.

test:test:
    [echo] NOTICE: Skipping tests; they seem to have passed already
    [echo] No tests to run.
Running post goal: test:test
00:04:51,046 INFO  [PostGoalTag] Running post goal: test:test

jar:jar:

jar:install:
    [echo] Installing...
Uploading to geronimo/jars/geronimo-console-web-1.1-SNAPSHOT.jar: 
.................... (17K)
Uploading to geronimo/poms/geronimo-console-web-1.1-SNAPSHOT.pom: 
.................... (11K)

+----------------------------------------

build:end:

00:04:51,302 INFO  [ReactorTag] +----------------------------------------
| geronimo and geronimo-plugins Geronimo :: Configuration Converter
00:04:51,302 INFO  [ReactorTag] | geronimo and geronimo-plugins Geronimo :: Configuration Converter
| Memory: 20M/29M
00:04:51,303 INFO  [ReactorTag] | Memory: 20M/29M
+----------------------------------------
00:04:51,303 INFO  [ReactorTag] +----------------------------------------
DEPRECATED: the default goal should be specified in the <build> section of project.xml instead of maven.xml
00:04:51,338 WARN  [PluginScriptParser] DEPRECATED: the default goal should be specified in the <build> section of project.xml instead of maven.xml
DEPRECATED: the default goal should be specified in the <build> section of project.xml instead of maven.xml
00:04:51,339 WARN  [PluginScriptParser] DEPRECATED: the default goal should be specified in the <build> section of project.xml instead of maven.xml
build:start:

multiproject:install-callback:
    [echo] Running jar:install for Geronimo :: Configuration Converter
java:prepare-filesystem:

java:compile:
<depend closure="false" srcdir="1.4" dump="false" destdir="/home/continuum/continuum-1.0.2/apps/continuum/work/68/modules/converter/target/classes"></depend>    [echo] Compiling to /home/continuum/continuum-1.0.2/apps/continuum/work/68/modules/converter/target/classes

java:jar-resources:

test:prepare-filesystem:

test:test-resources:

test:compile:
    [echo] No test source files to compile.

test:test:
    [echo] NOTICE: Skipping tests; they seem to have passed already
    [echo] No tests to run.
Running post goal: test:test
00:04:52,404 INFO  [PostGoalTag] Running post goal: test:test

jar:jar:

jar:install:
    [echo] Installing...
Uploading to geronimo/jars/geronimo-converter-1.1-SNAPSHOT.jar: 
.................... (25K)
Uploading to geronimo/poms/geronimo-converter-1.1-SNAPSHOT.pom: 
.................... (11K)

+----------------------------------------

build:end:

00:04:52,745 INFO  [ReactorTag] +----------------------------------------
| geronimo and geronimo-plugins Geronimo :: Web :: Builder
00:04:52,745 INFO  [ReactorTag] | geronimo and geronimo-plugins Geronimo :: Web :: Builder
| Memory: 20M/29M
00:04:52,745 INFO  [ReactorTag] | Memory: 20M/29M
+----------------------------------------
00:04:52,745 INFO  [ReactorTag] +----------------------------------------
DEPRECATED: the default goal should be specified in the <build> section of project.xml instead of maven.xml
00:04:52,775 WARN  [PluginScriptParser] DEPRECATED: the default goal should be specified in the <build> section of project.xml instead of maven.xml
DEPRECATED: the default goal should be specified in the <build> section of project.xml instead of maven.xml
00:04:52,776 WARN  [PluginScriptParser] DEPRECATED: the default goal should be specified in the <build> section of project.xml instead of maven.xml
build:start:

multiproject:install-callback:
    [echo] Running jar:install for Geronimo :: Web :: Builder
java:prepare-filesystem:

java:compile:
<depend closure="false" srcdir="1.4" dump="false" destdir="/home/continuum/continuum-1.0.2/apps/continuum/work/68/modules/web-builder/target/classes"></depend>    [echo] Compiling to /home/continuum/continuum-1.0.2/apps/continuum/work/68/modules/web-builder/target/classes
    [javac] Compiling 1 source file to /home/continuum/continuum-1.0.2/apps/continuum/work/68/modules/web-builder/target/classes
    [javac] Note: /home/continuum/continuum-1.0.2/apps/continuum/work/68/modules/web-builder/src/java/org/apache/geronimo/web/deployment/AbstractWebModuleBuilder.java uses or overrides a deprecated API.
    [javac] Note: Recompile with -deprecation for details.

java:jar-resources:

test:prepare-filesystem:

test:test-resources:

test:compile:

test:test:
    [junit] Running org.apache.geronimo.web.deployment.GenericToSpecificPlanConverterTest
    [junit] Tests run: 3, Failures: 0, Errors: 0, Time elapsed: 1.904 sec
    [junit] Running org.apache.geronimo.web.deployment.WebAppDConfigTest
    [junit] Tests run: 2, Failures: 0, Errors: 0, Time elapsed: 1.273 sec
Running post goal: test:test
00:04:58,639 INFO  [PostGoalTag] Running post goal: test:test

jar:jar:
    [jar] Building jar: /home/continuum/continuum-1.0.2/apps/continuum/work/68/modules/web-builder/target/geronimo-web-builder-1.1-SNAPSHOT.jar

jar:install:
    [echo] Installing...
Uploading to geronimo/jars/geronimo-web-builder-1.1-SNAPSHOT.jar: 
.................... (46K)
Uploading to geronimo/poms/geronimo-web-builder-1.1-SNAPSHOT.pom: 
.................... (13K)

+----------------------------------------

build:end:

00:04:59,143 INFO  [ReactorTag] +----------------------------------------
| geronimo and geronimo-plugins Geronimo :: Deploy :: JSR-88
00:04:59,143 INFO  [ReactorTag] | geronimo and geronimo-plugins Geronimo :: Deploy :: JSR-88
| Memory: 25M/29M
00:04:59,143 INFO  [ReactorTag] | Memory: 25M/29M
+----------------------------------------
00:04:59,143 INFO  [ReactorTag] +----------------------------------------
DEPRECATED: the default goal should be specified in the <build> section of project.xml instead of maven.xml
00:04:59,171 WARN  [PluginScriptParser] DEPRECATED: the default goal should be specified in the <build> section of project.xml instead of maven.xml
DEPRECATED: the default goal should be specified in the <build> section of project.xml instead of maven.xml
00:04:59,174 WARN  [PluginScriptParser] DEPRECATED: the default goal should be specified in the <build> section of project.xml instead of maven.xml
Attempting to download geronimo-web-builder-1.1-SNAPSHOT.jar.
00:04:59,510 INFO  [DependencyVerifier] Attempting to download geronimo-web-builder-1.1-SNAPSHOT.jar.
build:start:

multiproject:install-callback:
    [echo] Running jar:install for Geronimo :: Deploy :: JSR-88
java:prepare-filesystem:

java:compile:
<depend closure="false" srcdir="1.4" dump="false" destdir="/home/continuum/continuum-1.0.2/apps/continuum/work/68/modules/deploy-jsr88/target/classes"></depend>    [echo] Compiling to /home/continuum/continuum-1.0.2/apps/continuum/work/68/modules/deploy-jsr88/target/classes

java:jar-resources:

test:prepare-filesystem:

test:test-resources:

test:compile:

test:test:
    [echo] NOTICE: Skipping tests; they seem to have passed already
    [echo] No tests to run.
Running post goal: test:test
00:05:01,402 INFO  [PostGoalTag] Running post goal: test:test

jar:jar:
    [echo] Generating Manifest file for JSR88-Deployer

jar:install:
    [echo] Installing...
Uploading to geronimo/jars/geronimo-deploy-jsr88-1.1-SNAPSHOT.jar: 
.................... (59K)
Uploading to geronimo/poms/geronimo-deploy-jsr88-1.1-SNAPSHOT.pom: 
.................... (13K)

+----------------------------------------

build:end:

00:05:02,432 INFO  [ReactorTag] +----------------------------------------
| geronimo and geronimo-plugins Geronimo :: Deploy :: CLI Tool
00:05:02,432 INFO  [ReactorTag] | geronimo and geronimo-plugins Geronimo :: Deploy :: CLI Tool
| Memory: 18M/32M
00:05:02,432 INFO  [ReactorTag] | Memory: 18M/32M
+----------------------------------------
00:05:02,432 INFO  [ReactorTag] +----------------------------------------
DEPRECATED: the default goal should be specified in the <build> section of project.xml instead of maven.xml
00:05:02,464 WARN  [PluginScriptParser] DEPRECATED: the default goal should be specified in the <build> section of project.xml instead of maven.xml
DEPRECATED: the default goal should be specified in the <build> section of project.xml instead of maven.xml
00:05:02,465 WARN  [PluginScriptParser] DEPRECATED: the default goal should be specified in the <build> section of project.xml instead of maven.xml
Attempting to download geronimo-deploy-jsr88-1.1-SNAPSHOT.jar.
00:05:02,795 INFO  [DependencyVerifier] Attempting to download geronimo-deploy-jsr88-1.1-SNAPSHOT.jar.
build:start:

multiproject:install-callback:
    [echo] Running jar:install for Geronimo :: Deploy :: CLI Tool
java:prepare-filesystem:

java:compile:
<depend closure="false" srcdir="1.4" dump="false" destdir="/home/continuum/continuum-1.0.2/apps/continuum/work/68/modules/deploy-tool/target/classes"></depend>    [echo] Compiling to /home/continuum/continuum-1.0.2/apps/continuum/work/68/modules/deploy-tool/target/classes
    [javac] Compiling 1 source file to /home/continuum/continuum-1.0.2/apps/continuum/work/68/modules/deploy-tool/target/classes

java:jar-resources:

test:prepare-filesystem:

test:test-resources:

test:compile:

test:test:
Running post goal: test:test
00:05:04,842 INFO  [PostGoalTag] Running post goal: test:test

jar:jar:
    [jar] Building jar: /home/continuum/continuum-1.0.2/apps/continuum/work/68/modules/deploy-tool/target/geronimo-deploy-tool-1.1-SNAPSHOT.jar

jar:install:
    [echo] Installing...
Uploading to geronimo/jars/geronimo-deploy-tool-1.1-SNAPSHOT.jar: 
.................... (60K)
Uploading to geronimo/poms/geronimo-deploy-tool-1.1-SNAPSHOT.pom: 
.................... (12K)

+----------------------------------------

build:end:

00:05:05,340 INFO  [ReactorTag] +----------------------------------------
| geronimo and geronimo-plugins Geronimo :: Derby
00:05:05,340 INFO  [ReactorTag] | geronimo and geronimo-plugins Geronimo :: Derby
| Memory: 24M/32M
00:05:05,340 INFO  [ReactorTag] | Memory: 24M/32M
+----------------------------------------
00:05:05,340 INFO  [ReactorTag] +----------------------------------------
DEPRECATED: the default goal should be specified in the <build> section of project.xml instead of maven.xml
00:05:05,350 WARN  [PluginScriptParser] DEPRECATED: the default goal should be specified in the <build> section of project.xml instead of maven.xml
build:start:

multiproject:install-callback:
    [echo] Running jar:install for Geronimo :: Derby
java:prepare-filesystem:

java:compile:
<depend closure="false" srcdir="1.4" dump="false" destdir="/home/continuum/continuum-1.0.2/apps/continuum/work/68/modules/derby/target/classes"></depend>    [echo] Compiling to /home/continuum/continuum-1.0.2/apps/continuum/work/68/modules/derby/target/classes

java:jar-resources:

test:prepare-filesystem:

test:test-resources:

test:compile:

test:test:
    [echo] NOTICE: Skipping tests; they seem to have passed already
    [echo] No tests to run.
Running post goal: test:test
00:05:06,451 INFO  [PostGoalTag] Running post goal: test:test

jar:jar:

jar:install:
    [echo] Installing...
Uploading to geronimo/jars/geronimo-derby-1.1-SNAPSHOT.jar: 
.................... (12K)
Uploading to geronimo/poms/geronimo-derby-1.1-SNAPSHOT.pom: 
.................... (11K)

+----------------------------------------

build:end:

00:05:06,702 INFO  [ReactorTag] +----------------------------------------
| geronimo and geronimo-plugins Geronimo :: Directory
00:05:06,702 INFO  [ReactorTag] | geronimo and geronimo-plugins Geronimo :: Directory
| Memory: 23M/32M
00:05:06,702 INFO  [ReactorTag] | Memory: 23M/32M
+----------------------------------------
00:05:06,702 INFO  [ReactorTag] +----------------------------------------
DEPRECATED: the default goal should be specified in the <build> section of project.xml instead of maven.xml
00:05:06,716 WARN  [PluginScriptParser] DEPRECATED: the default goal should be specified in the <build> section of project.xml instead of maven.xml
DEPRECATED: the default goal should be specified in the <build> section of project.xml instead of maven.xml
00:05:06,718 WARN  [PluginScriptParser] DEPRECATED: the default goal should be specified in the <build> section of project.xml instead of maven.xml
build:start:

multiproject:install-callback:
    [echo] Running jar:install for Geronimo :: Directory
java:prepare-filesystem:

java:compile:
<depend closure="false" srcdir="1.4" dump="false" destdir="/home/continuum/continuum-1.0.2/apps/continuum/work/68/modules/directory/target/classes"></depend>    [echo] Compiling to /home/continuum/continuum-1.0.2/apps/continuum/work/68/modules/directory/target/classes
Running post goal: java:compile
00:05:07,820 INFO  [PostGoalTag] Running post goal: java:compile
geronimo:dependency:


java:jar-resources:
Copying 1 file to /home/continuum/continuum-1.0.2/apps/continuum/work/68/modules/directory/target/classes

test:prepare-filesystem:

test:test-resources:

test:compile:

test:test:
    [echo] NOTICE: Skipping tests; they seem to have passed already
    [echo] No tests to run.
Running post goal: test:test
00:05:08,426 INFO  [PostGoalTag] Running post goal: test:test

jar:jar:
    [jar] Building jar: /home/continuum/continuum-1.0.2/apps/continuum/work/68/modules/directory/target/geronimo-directory-1.1-SNAPSHOT.jar

jar:install:
    [echo] Installing...
Uploading to geronimo/jars/geronimo-directory-1.1-SNAPSHOT.jar: 
.................... (113K)
Uploading to geronimo/poms/geronimo-directory-1.1-SNAPSHOT.pom: 
.................... (16K)

+----------------------------------------

build:end:

00:05:09,187 INFO  [ReactorTag] +----------------------------------------
| geronimo and geronimo-plugins Geronimo :: Deploy :: Hot Deployer
00:05:09,187 INFO  [ReactorTag] | geronimo and geronimo-plugins Geronimo :: Deploy :: Hot Deployer
| Memory: 25M/32M
00:05:09,187 INFO  [ReactorTag] | Memory: 25M/32M
+----------------------------------------
00:05:09,187 INFO  [ReactorTag] +----------------------------------------
DEPRECATED: the default goal should be specified in the <build> section of project.xml instead of maven.xml
00:05:09,211 WARN  [PluginScriptParser] DEPRECATED: the default goal should be specified in the <build> section of project.xml instead of maven.xml
DEPRECATED: the default goal should be specified in the <build> section of project.xml instead of maven.xml
00:05:09,211 WARN  [PluginScriptParser] DEPRECATED: the default goal should be specified in the <build> section of project.xml instead of maven.xml
Attempting to download geronimo-deploy-tool-1.1-SNAPSHOT.jar.
00:05:09,495 INFO  [DependencyVerifier] Attempting to download geronimo-deploy-tool-1.1-SNAPSHOT.jar.
build:start:

multiproject:install-callback:
    [echo] Running jar:install for Geronimo :: Deploy :: Hot Deployer
java:prepare-filesystem:

java:compile:
<depend closure="false" srcdir="1.4" dump="false" destdir="/home/continuum/continuum-1.0.2/apps/continuum/work/68/modules/hot-deploy/target/classes"></depend>    [echo] Compiling to /home/continuum/continuum-1.0.2/apps/continuum/work/68/modules/hot-deploy/target/classes

java:jar-resources:

test:prepare-filesystem:

test:test-resources:

test:compile:
    [echo] No test source files to compile.

test:test:
    [echo] NOTICE: Skipping tests; they seem to have passed already
    [echo] No tests to run.
Running post goal: test:test
00:05:14,139 INFO  [PostGoalTag] Running post goal: test:test

jar:jar:

jar:install:
    [echo] Installing...
Uploading to geronimo/jars/geronimo-hot-deploy-1.1-SNAPSHOT.jar: 
.................... (19K)
Uploading to geronimo/poms/geronimo-hot-deploy-1.1-SNAPSHOT.pom: 
.................... (12K)

+----------------------------------------

build:end:

00:05:14,401 INFO  [ReactorTag] +----------------------------------------
| geronimo and geronimo-plugins Geronimo :: Installer Processing
00:05:14,401 INFO  [ReactorTag] | geronimo and geronimo-plugins Geronimo :: Installer Processing
| Memory: 24M/32M
00:05:14,401 INFO  [ReactorTag] | Memory: 24M/32M
+----------------------------------------
00:05:14,401 INFO  [ReactorTag] +----------------------------------------
DEPRECATED: the default goal should be specified in the <build> section of project.xml instead of maven.xml
00:05:14,429 WARN  [PluginScriptParser] DEPRECATED: the default goal should be specified in the <build> section of project.xml instead of maven.xml
DEPRECATED: the default goal should be specified in the <build> section of project.xml instead of maven.xml
00:05:14,430 WARN  [PluginScriptParser] DEPRECATED: the default goal should be specified in the <build> section of project.xml instead of maven.xml
build:start:

multiproject:install-callback:
    [echo] Running jar:install for Geronimo :: Installer Processing
java:prepare-filesystem:

java:compile:
<depend closure="false" srcdir="1.4" dump="false" destdir="/home/continuum/continuum-1.0.2/apps/continuum/work/68/modules/installer-processing/target/classes"></depend>    [echo] Compiling to /home/continuum/continuum-1.0.2/apps/continuum/work/68/modules/installer-processing/target/classes
Running post goal: java:compile
00:05:15,025 INFO  [PostGoalTag] Running post goal: java:compile
geronimo:dependency:

    [echo] Maven local repo is: /home/continuum/.geronimo-1.1-maven/repository
    [echo] Maven build dir is: /home/continuum/continuum-1.0.2/apps/continuum/work/68/modules/installer-processing/target

java:jar-resources:

test:prepare-filesystem:

test:test-resources:

test:compile:
    [echo] No test source files to compile.

test:test:
    [echo] NOTICE: Skipping tests; they seem to have passed already
    [echo] No tests to run.
Running post goal: test:test
00:05:15,558 INFO  [PostGoalTag] Running post goal: test:test

jar:jar:

jar:install:
    [echo] Installing...
Uploading to geronimo/jars/geronimo-installer-processing-1.1-SNAPSHOT.jar: 
.................... (15K)
Uploading to geronimo/poms/geronimo-installer-processing-1.1-SNAPSHOT.pom: 
.................... (10K)

+----------------------------------------

build:end:

00:05:15,815 INFO  [ReactorTag] +----------------------------------------
| geronimo and geronimo-plugins Geronimo :: Installer Support
00:05:15,815 INFO  [ReactorTag] | geronimo and geronimo-plugins Geronimo :: Installer Support
| Memory: 25M/32M
00:05:15,815 INFO  [ReactorTag] | Memory: 25M/32M
+----------------------------------------
00:05:15,815 INFO  [ReactorTag] +----------------------------------------
DEPRECATED: the default goal should be specified in the <build> section of project.xml instead of maven.xml
00:05:15,844 WARN  [PluginScriptParser] DEPRECATED: the default goal should be specified in the <build> section of project.xml instead of maven.xml
DEPRECATED: the default goal should be specified in the <build> section of project.xml instead of maven.xml
00:05:15,846 WARN  [PluginScriptParser] DEPRECATED: the default goal should be specified in the <build> section of project.xml instead of maven.xml
build:start:

multiproject:install-callback:
    [echo] Running jar:install for Geronimo :: Installer Support
java:prepare-filesystem:

java:compile:
<depend closure="false" srcdir="1.4" dump="false" destdir="/home/continuum/continuum-1.0.2/apps/continuum/work/68/modules/installer-support/target/classes"></depend>    [echo] Compiling to /home/continuum/continuum-1.0.2/apps/continuum/work/68/modules/installer-support/target/classes
Running post goal: java:compile
00:05:16,455 INFO  [PostGoalTag] Running post goal: java:compile
geronimo:dependency:

    [echo] Maven local repo is: /home/continuum/.geronimo-1.1-maven/repository
    [echo] Maven build dir is: /home/continuum/continuum-1.0.2/apps/continuum/work/68/modules/installer-support/target
    [unjar] Expanding: /home/continuum/continuum-1.0.2/apps/continuum/work/68/modules/installer-support/target/standalone-compiler-custom-3.8.0.jar into /home/continuum/continuum-1.0.2/apps/continuum/work/68/modules/installer-support/target/tmp
    [echo] Built Geronimo custom IzPack installer jar
    [echo] Copying standalone-compiler-custom-3.8.0 to local repo

java:jar-resources:

test:prepare-filesystem:

test:test-resources:

test:compile:
    [echo] No test source files to compile.

test:test:
    [echo] NOTICE: Skipping tests; they seem to have passed already
    [echo] No tests to run.
Running post goal: test:test
00:05:18,193 INFO  [PostGoalTag] Running post goal: test:test

jar:jar:

jar:install:
    [echo] Installing...
Uploading to geronimo/jars/geronimo-installer-support-1.1-SNAPSHOT.jar: 
.................... (50K)
Uploading to geronimo/poms/geronimo-installer-support-1.1-SNAPSHOT.pom: 
.................... (10K)

+----------------------------------------

build:end:

00:05:18,457 INFO  [ReactorTag] +----------------------------------------
| geronimo and geronimo-plugins Geronimo :: JavaMail Transport
00:05:18,458 INFO  [ReactorTag] | geronimo and geronimo-plugins Geronimo :: JavaMail Transport
| Memory: 28M/32M
00:05:18,458 INFO  [ReactorTag] | Memory: 28M/32M
+----------------------------------------
00:05:18,458 INFO  [ReactorTag] +----------------------------------------
DEPRECATED: the default goal should be specified in the <build> section of project.xml instead of maven.xml
00:05:18,468 WARN  [PluginScriptParser] DEPRECATED: the default goal should be specified in the <build> section of project.xml instead of maven.xml
build:start:

multiproject:install-callback:
    [echo] Running jar:install for Geronimo :: JavaMail Transport
java:prepare-filesystem:

java:compile:
<depend closure="false" srcdir="1.4" dump="false" destdir="/home/continuum/continuum-1.0.2/apps/continuum/work/68/modules/javamail-transport/target/classes"></depend>    [echo] Compiling to /home/continuum/continuum-1.0.2/apps/continuum/work/68/modules/javamail-transport/target/classes

java:jar-resources:

test:prepare-filesystem:

test:test-resources:

test:compile:
    [echo] No test source files to compile.

test:test:
    [echo] NOTICE: Skipping tests; they seem to have passed already
    [echo] No tests to run.
Running post goal: test:test
00:05:19,545 INFO  [PostGoalTag] Running post goal: test:test

jar:jar:

jar:install:
    [echo] Installing...
Uploading to geronimo/jars/geronimo-javamail-transport-1.1-SNAPSHOT.jar: 
.................... (13K)
Uploading to geronimo/poms/geronimo-javamail-transport-1.1-SNAPSHOT.pom: 
.................... (10K)

+----------------------------------------

build:end:

00:05:19,794 INFO  [ReactorTag] +----------------------------------------
| geronimo and geronimo-plugins Geronimo :: Jetty
00:05:19,794 INFO  [ReactorTag] | geronimo and geronimo-plugins Geronimo :: Jetty
| Memory: 28M/32M
00:05:19,794 INFO  [ReactorTag] | Memory: 28M/32M
+----------------------------------------
00:05:19,794 INFO  [ReactorTag] +----------------------------------------
DEPRECATED: the default goal should be specified in the <build> section of project.xml instead of maven.xml
00:05:19,817 WARN  [PluginScriptParser] DEPRECATED: the default goal should be specified in the <build> section of project.xml instead of maven.xml
DEPRECATED: the default goal should be specified in the <build> section of project.xml instead of maven.xml
00:05:19,818 WARN  [PluginScriptParser] DEPRECATED: the default goal should be specified in the <build> section of project.xml instead of maven.xml
build:start:

multiproject:install-callback:
    [echo] Running jar:install for Geronimo :: Jetty
java:prepare-filesystem:

java:compile:
<depend closure="false" srcdir="1.4" dump="false" destdir="/home/continuum/continuum-1.0.2/apps/continuum/work/68/modules/jetty/target/classes"></depend>    [echo] Compiling to /home/continuum/continuum-1.0.2/apps/continuum/work/68/modules/jetty/target/classes
Running post goal: java:compile
00:05:20,567 INFO  [PostGoalTag] Running post goal: java:compile
geronimo:dependency:


java:jar-resources:
Copying 1 file to /home/continuum/continuum-1.0.2/apps/continuum/work/68/modules/jetty/target/classes

test:prepare-filesystem:

test:test-resources:

test:compile:

test:test:
    [echo] NOTICE: Skipping tests; they seem to have passed already
    [echo] No tests to run.
Running post goal: test:test
00:05:21,223 INFO  [PostGoalTag] Running post goal: test:test

jar:jar:
    [jar] Building jar: /home/continuum/continuum-1.0.2/apps/continuum/work/68/modules/jetty/target/geronimo-jetty-1.1-SNAPSHOT.jar

jar:install:
    [echo] Installing...
Uploading to geronimo/jars/geronimo-jetty-1.1-SNAPSHOT.jar: 
.................... (79K)
Uploading to geronimo/poms/geronimo-jetty-1.1-SNAPSHOT.pom: 
.................... (16K)

+----------------------------------------

build:end:

00:05:21,672 INFO  [ReactorTag] +----------------------------------------
| geronimo and geronimo-plugins Geronimo :: Jetty :: Builder
00:05:21,672 INFO  [ReactorTag] | geronimo and geronimo-plugins Geronimo :: Jetty :: Builder
| Memory: 29M/32M
00:05:21,672 INFO  [ReactorTag] | Memory: 29M/32M
+----------------------------------------
00:05:21,673 INFO  [ReactorTag] +----------------------------------------
DEPRECATED: the default goal should be specified in the <build> section of project.xml instead of maven.xml
00:05:21,699 WARN  [PluginScriptParser] DEPRECATED: the default goal should be specified in the <build> section of project.xml instead of maven.xml
DEPRECATED: the default goal should be specified in the <build> section of project.xml instead of maven.xml
00:05:21,700 WARN  [PluginScriptParser] DEPRECATED: the default goal should be specified in the <build> section of project.xml instead of maven.xml
Attempting to download geronimo-jetty-1.1-SNAPSHOT.jar.
00:05:22,032 INFO  [DependencyVerifier] Attempting to download geronimo-jetty-1.1-SNAPSHOT.jar.
build:start:

multiproject:install-callback:
    [echo] Running jar:install for Geronimo :: Jetty :: Builder
java:prepare-filesystem:

java:compile:
<depend closure="false" srcdir="1.4" dump="false" destdir="/home/continuum/continuum-1.0.2/apps/continuum/work/68/modules/jetty-builder/target/classes"></depend>    [echo] Compiling to /home/continuum/continuum-1.0.2/apps/continuum/work/68/modules/jetty-builder/target/classes

java:jar-resources:

test:prepare-filesystem:

test:test-resources:

test:compile:
    [javac] Compiling 1 source file to /home/continuum/continuum-1.0.2/apps/continuum/work/68/modules/jetty-builder/target/test-classes

test:test:
    [junit] Running org.apache.geronimo.jetty.deployment.JettyModuleBuilderTest
    [junit] Tests run: 1, Failures: 0, Errors: 0, Time elapsed: 4.076 sec
    [junit] Running org.apache.geronimo.jetty.deployment.PlanParsingTest
    [junit] Tests run: 15, Failures: 0, Errors: 0, Time elapsed: 1.251 sec
    [junit] Running org.apache.geronimo.jetty.deployment.StartupOrderComparatorTest
    [junit] Tests run: 5, Failures: 0, Errors: 0, Time elapsed: 0.812 sec
Running post goal: test:test
00:05:33,576 INFO  [PostGoalTag] Running post goal: test:test

jar:jar:

jar:install:
    [echo] Installing...
Uploading to geronimo/jars/geronimo-jetty-builder-1.1-SNAPSHOT.jar: 
.................... (64K)
Uploading to geronimo/poms/geronimo-jetty-builder-1.1-SNAPSHOT.pom: 
.................... (18K)

+----------------------------------------

build:end:

00:05:33,905 INFO  [ReactorTag] +----------------------------------------
| geronimo and geronimo-plugins Geronimo :: JMX Remoting
00:05:33,905 INFO  [ReactorTag] | geronimo and geronimo-plugins Geronimo :: JMX Remoting
| Memory: 26M/37M
00:05:33,905 INFO  [ReactorTag] | Memory: 26M/37M
+----------------------------------------
00:05:33,905 INFO  [ReactorTag] +----------------------------------------
DEPRECATED: the default goal should be specified in the <build> section of project.xml instead of maven.xml
00:05:33,915 WARN  [PluginScriptParser] DEPRECATED: the default goal should be specified in the <build> section of project.xml instead of maven.xml
build:start:

multiproject:install-callback:
    [echo] Running jar:install for Geronimo :: JMX Remoting
java:prepare-filesystem:

java:compile:
<depend closure="false" srcdir="1.4" dump="false" destdir="/home/continuum/continuum-1.0.2/apps/continuum/work/68/modules/jmx-remoting/target/classes"></depend>    [echo] Compiling to /home/continuum/continuum-1.0.2/apps/continuum/work/68/modules/jmx-remoting/target/classes

java:jar-resources:

test:prepare-filesystem:

test:test-resources:

test:compile:

test:test:
    [echo] NOTICE: Skipping tests; they seem to have passed already
    [echo] No tests to run.
Running post goal: test:test
00:05:35,017 INFO  [PostGoalTag] Running post goal: test:test

jar:jar:

jar:install:
    [echo] Installing...
Uploading to geronimo/jars/geronimo-jmxremoting-1.1-SNAPSHOT.jar: 
.................... (10K)
Uploading to geronimo/poms/geronimo-jmxremoting-1.1-SNAPSHOT.pom: 
.................... (11K)

+----------------------------------------

build:end:

00:05:35,280 INFO  [ReactorTag] +----------------------------------------
| geronimo and geronimo-plugins Geronimo :: Mail
00:05:35,280 INFO  [ReactorTag] | geronimo and geronimo-plugins Geronimo :: Mail
| Memory: 28M/37M
00:05:35,280 INFO  [ReactorTag] | Memory: 28M/37M
+----------------------------------------
00:05:35,280 INFO  [ReactorTag] +----------------------------------------
DEPRECATED: the default goal should be specified in the <build> section of project.xml instead of maven.xml
00:05:35,292 WARN  [PluginScriptParser] DEPRECATED: the default goal should be specified in the <build> section of project.xml instead of maven.xml
build:start:

multiproject:install-callback:
    [echo] Running jar:install for Geronimo :: Mail
java:prepare-filesystem:

java:compile:
<depend closure="false" srcdir="1.4" dump="false" destdir="/home/continuum/continuum-1.0.2/apps/continuum/work/68/modules/mail/target/classes"></depend>    [echo] Compiling to /home/continuum/continuum-1.0.2/apps/continuum/work/68/modules/mail/target/classes

java:jar-resources:

test:prepare-filesystem:

test:test-resources:

test:compile:

test:test:
    [echo] NOTICE: Skipping tests; they seem to have passed already
    [echo] No tests to run.
Running post goal: test:test
00:05:36,369 INFO  [PostGoalTag] Running post goal: test:test

jar:jar:

jar:install:
    [echo] Installing...
Uploading to geronimo/jars/geronimo-mail-1.1-SNAPSHOT.jar: 
.................... (21K)
Uploading to geronimo/poms/geronimo-mail-1.1-SNAPSHOT.pom: 
.................... (11K)

+----------------------------------------

build:end:

00:05:36,610 INFO  [ReactorTag] +----------------------------------------
| geronimo and geronimo-plugins Geronimo :: Scripts
00:05:36,611 INFO  [ReactorTag] | geronimo and geronimo-plugins Geronimo :: Scripts
| Memory: 27M/37M
00:05:36,611 INFO  [ReactorTag] | Memory: 27M/37M
+----------------------------------------
00:05:36,611 INFO  [ReactorTag] +----------------------------------------
DEPRECATED: the default goal should be specified in the <build> section of project.xml instead of maven.xml
00:05:36,624 WARN  [PluginScriptParser] DEPRECATED: the default goal should be specified in the <build> section of project.xml instead of maven.xml
build:start:

multiproject:install-callback:
    [echo] Running jar:install for Geronimo :: Scripts
java:prepare-filesystem:

java:compile:
    [echo] Compiling to /home/continuum/continuum-1.0.2/apps/continuum/work/68/modules/scripts/target/classes
    [echo] No java source files to compile.

java:jar-resources:

test:prepare-filesystem:

test:test-resources:

test:compile:
    [echo] No test source files to compile.

test:test:
    [echo] NOTICE: Skipping tests; they seem to have passed already
    [echo] No tests to run.
Running post goal: test:test
00:05:37,672 INFO  [PostGoalTag] Running post goal: test:test

jar:jar:

jar:install:
    [echo] Installing...
Uploading to geronimo/jars/geronimo-scripts-1.1-SNAPSHOT.jar: 
.................... (3214K)
Uploading to geronimo/poms/geronimo-scripts-1.1-SNAPSHOT.pom: 
.................... (10K)

+----------------------------------------

build:end:

00:05:38,418 INFO  [ReactorTag] +----------------------------------------
| geronimo and geronimo-plugins Geronimo :: Timer
00:05:38,418 INFO  [ReactorTag] | geronimo and geronimo-plugins Geronimo :: Timer
| Memory: 27M/37M
00:05:38,418 INFO  [ReactorTag] | Memory: 27M/37M
+----------------------------------------
00:05:38,418 INFO  [ReactorTag] +----------------------------------------
DEPRECATED: the default goal should be specified in the <build> section of project.xml instead of maven.xml
00:05:38,428 WARN  [PluginScriptParser] DEPRECATED: the default goal should be specified in the <build> section of project.xml instead of maven.xml
build:start:

multiproject:install-callback:
    [echo] Running jar:install for Geronimo :: Timer
java:prepare-filesystem:

java:compile:
<depend closure="false" srcdir="1.4" dump="false" destdir="/home/continuum/continuum-1.0.2/apps/continuum/work/68/modules/timer/target/classes"></depend>    [echo] Compiling to /home/continuum/continuum-1.0.2/apps/continuum/work/68/modules/timer/target/classes

java:jar-resources:

test:prepare-filesystem:

test:test-resources:

test:compile:

test:test:
    [echo] NOTICE: Skipping tests; they seem to have passed already
    [echo] No tests to run.
Running post goal: test:test
00:05:39,547 INFO  [PostGoalTag] Running post goal: test:test

jar:jar:

jar:install:
    [echo] Installing...
Uploading to geronimo/jars/geronimo-timer-1.1-SNAPSHOT.jar: 
.................... (38K)
Uploading to geronimo/poms/geronimo-timer-1.1-SNAPSHOT.pom: 
.................... (12K)

+----------------------------------------

build:end:

00:05:39,815 INFO  [ReactorTag] +----------------------------------------
| geronimo and geronimo-plugins Geronimo :: Tomcat
00:05:39,815 INFO  [ReactorTag] | geronimo and geronimo-plugins Geronimo :: Tomcat
| Memory: 27M/37M
00:05:39,815 INFO  [ReactorTag] | Memory: 27M/37M
+----------------------------------------
00:05:39,815 INFO  [ReactorTag] +----------------------------------------
DEPRECATED: the default goal should be specified in the <build> section of project.xml instead of maven.xml
00:05:39,845 WARN  [PluginScriptParser] DEPRECATED: the default goal should be specified in the <build> section of project.xml instead of maven.xml
DEPRECATED: the default goal should be specified in the <build> section of project.xml instead of maven.xml
00:05:39,846 WARN  [PluginScriptParser] DEPRECATED: the default goal should be specified in the <build> section of project.xml instead of maven.xml
build:start:

multiproject:install-callback:
    [echo] Running jar:install for Geronimo :: Tomcat
java:prepare-filesystem:

java:compile:
<depend closure="false" srcdir="1.4" dump="false" destdir="/home/continuum/continuum-1.0.2/apps/continuum/work/68/modules/tomcat/target/classes"></depend>    [echo] Compiling to /home/continuum/continuum-1.0.2/apps/continuum/work/68/modules/tomcat/target/classes
Running post goal: java:compile
00:05:40,576 INFO  [PostGoalTag] Running post goal: java:compile
geronimo:dependency:


java:jar-resources:
Copying 1 file to /home/continuum/continuum-1.0.2/apps/continuum/work/68/modules/tomcat/target/classes

test:prepare-filesystem:

test:test-resources:

test:compile:

test:test:
    [echo] NOTICE: Skipping tests; they seem to have passed already
    [echo] No tests to run.
Running post goal: test:test
00:05:41,612 INFO  [PostGoalTag] Running post goal: test:test

jar:jar:
    [jar] Building jar: /home/continuum/continuum-1.0.2/apps/continuum/work/68/modules/tomcat/target/geronimo-tomcat-1.1-SNAPSHOT.jar

jar:install:
    [echo] Installing...
Uploading to geronimo/jars/geronimo-tomcat-1.1-SNAPSHOT.jar: 
.................... (130K)
Uploading to geronimo/poms/geronimo-tomcat-1.1-SNAPSHOT.pom: 
.................... (21K)

+----------------------------------------

build:end:

00:05:42,125 INFO  [ReactorTag] +----------------------------------------
| geronimo and geronimo-plugins Geronimo :: Tomcat :: Builder
00:05:42,125 INFO  [ReactorTag] | geronimo and geronimo-plugins Geronimo :: Tomcat :: Builder
| Memory: 28M/37M
00:05:42,125 INFO  [ReactorTag] | Memory: 28M/37M
+----------------------------------------
00:05:42,125 INFO  [ReactorTag] +----------------------------------------
DEPRECATED: the default goal should be specified in the <build> section of project.xml instead of maven.xml
00:05:42,164 WARN  [PluginScriptParser] DEPRECATED: the default goal should be specified in the <build> section of project.xml instead of maven.xml
DEPRECATED: the default goal should be specified in the <build> section of project.xml instead of maven.xml
00:05:42,165 WARN  [PluginScriptParser] DEPRECATED: the default goal should be specified in the <build> section of project.xml instead of maven.xml
Attempting to download geronimo-tomcat-1.1-SNAPSHOT.jar.
00:05:42,499 INFO  [DependencyVerifier] Attempting to download geronimo-tomcat-1.1-SNAPSHOT.jar.
Attempting to download geronimo-axis-builder-1.1-SNAPSHOT.jar.
00:05:43,402 INFO  [DependencyVerifier] Attempting to download geronimo-axis-builder-1.1-SNAPSHOT.jar.
build:start:

multiproject:install-callback:
    [echo] Running jar:install for Geronimo :: Tomcat :: Builder
java:prepare-filesystem:

java:compile:
<depend closure="false" srcdir="1.4" dump="false" destdir="/home/continuum/continuum-1.0.2/apps/continuum/work/68/modules/tomcat-builder/target/classes"></depend>    [echo] Compiling to /home/continuum/continuum-1.0.2/apps/continuum/work/68/modules/tomcat-builder/target/classes

java:jar-resources:

test:prepare-filesystem:

test:test-resources:

test:compile:
    [javac] Compiling 1 source file to /home/continuum/continuum-1.0.2/apps/continuum/work/68/modules/tomcat-builder/target/test-classes

test:test:
    [junit] Running org.apache.geronimo.tomcat.deployment.PlanParsingTest
    [junit] Tests run: 2, Failures: 0, Errors: 0, Time elapsed: 1.288 sec
    [junit] Running org.apache.geronimo.tomcat.deployment.TomcatModuleBuilderTest
    [junit] Tests run: 2, Failures: 0, Errors: 0, Time elapsed: 7.203 sec
Running post goal: test:test
00:05:56,468 INFO  [PostGoalTag] Running post goal: test:test

jar:jar:

jar:install:
    [echo] Installing...
Uploading to geronimo/jars/geronimo-tomcat-builder-1.1-SNAPSHOT.jar: 
.................... (65K)
Uploading to geronimo/poms/geronimo-tomcat-builder-1.1-SNAPSHOT.pom: 
.................... (20K)

+----------------------------------------

build:end:

00:05:56,815 INFO  [ReactorTag] +----------------------------------------
| geronimo and geronimo-plugins Geronimo :: Upgrade
00:05:56,815 INFO  [ReactorTag] | geronimo and geronimo-plugins Geronimo :: Upgrade
| Memory: 21M/37M
00:05:56,815 INFO  [ReactorTag] | Memory: 21M/37M
+----------------------------------------
00:05:56,815 INFO  [ReactorTag] +----------------------------------------
DEPRECATED: the default goal should be specified in the <build> section of project.xml instead of maven.xml
00:05:56,827 WARN  [PluginScriptParser] DEPRECATED: the default goal should be specified in the <build> section of project.xml instead of maven.xml
Attempting to download geronimo-client-builder-1.1-SNAPSHOT.jar.
00:05:57,159 INFO  [DependencyVerifier] Attempting to download geronimo-client-builder-1.1-SNAPSHOT.jar.
Attempting to download geronimo-jetty-builder-1.1-SNAPSHOT.jar.
00:05:58,103 INFO  [DependencyVerifier] Attempting to download geronimo-jetty-builder-1.1-SNAPSHOT.jar.
Attempting to download geronimo-tomcat-builder-1.1-SNAPSHOT.jar.
00:05:58,982 INFO  [DependencyVerifier] Attempting to download geronimo-tomcat-builder-1.1-SNAPSHOT.jar.
Attempting to download openejb-builder-2.1-SNAPSHOT.jar.
00:05:59,863 INFO  [DependencyVerifier] Attempting to download openejb-builder-2.1-SNAPSHOT.jar.
build:start:

multiproject:install-callback:
    [echo] Running jar:install for Geronimo :: Upgrade
java:prepare-filesystem:

java:compile:
<depend closure="false" srcdir="1.4" dump="false" destdir="/home/continuum/continuum-1.0.2/apps/continuum/work/68/modules/upgrade/target/classes"></depend>    [echo] Compiling to /home/continuum/continuum-1.0.2/apps/continuum/work/68/modules/upgrade/target/classes

java:jar-resources:

test:prepare-filesystem:

test:test-resources:

test:compile:

test:test:
    [echo] NOTICE: Skipping tests; they seem to have passed already
    [echo] No tests to run.
Running post goal: test:test
00:06:01,568 INFO  [PostGoalTag] Running post goal: test:test

jar:jar:

jar:install:
    [echo] Installing...
Uploading to geronimo/jars/geronimo-upgrade-1.1-SNAPSHOT.jar: 
.................... (9K)
Uploading to geronimo/poms/geronimo-upgrade-1.1-SNAPSHOT.pom: 
.................... (11K)

+----------------------------------------

build:end:

00:06:01,825 INFO  [ReactorTag] +----------------------------------------
| geronimo and geronimo-plugins Geronimo :: Maven Assembly Plugin
00:06:01,825 INFO  [ReactorTag] | geronimo and geronimo-plugins Geronimo :: Maven Assembly Plugin
| Memory: 23M/37M
00:06:01,825 INFO  [ReactorTag] | Memory: 23M/37M
+----------------------------------------
00:06:01,826 INFO  [ReactorTag] +----------------------------------------
DEPRECATED: the default goal should be specified in the <build> section of project.xml instead of maven.xml
00:06:01,876 WARN  [PluginScriptParser] DEPRECATED: the default goal should be specified in the <build> section of project.xml instead of maven.xml
build:start:

multiproject:install-callback:
    [echo] Running plugin:repository-install for Geronimo :: Maven Assembly Plugin
plugin:plugin:
java:prepare-filesystem:

java:compile:
    [echo] Compiling to /home/continuum/continuum-1.0.2/apps/continuum/work/68/plugins/geronimo-assembly-plugin/target/classes

java:jar-resources:

test:prepare-filesystem:

test:test-resources:

test:compile:
    [echo] No test source files to compile.

test:test:
    [echo] No tests to run.

jar:jar:


plugin:repository-install:
    [echo] Installing...
Uploading to geronimo/plugins/geronimo-assembly-plugin-1.1.0-9.jar: 
.................... (16K)
Uploading to geronimo/poms/geronimo-assembly-plugin-1.1.0-9.pom: 
.................... (1K)

+----------------------------------------

build:end:

00:06:02,851 INFO  [ReactorTag] +----------------------------------------
| geronimo and geronimo-plugins Geronimo :: Maven Deployment Plugin
00:06:02,851 INFO  [ReactorTag] | geronimo and geronimo-plugins Geronimo :: Maven Deployment Plugin
| Memory: 23M/37M
00:06:02,851 INFO  [ReactorTag] | Memory: 23M/37M
+----------------------------------------
00:06:02,851 INFO  [ReactorTag] +----------------------------------------
DEPRECATED: the default goal should be specified in the <build> section of project.xml instead of maven.xml
00:06:02,871 WARN  [PluginScriptParser] DEPRECATED: the default goal should be specified in the <build> section of project.xml instead of maven.xml
build:start:

multiproject:install-callback:
    [echo] Running plugin:repository-install for Geronimo :: Maven Deployment Plugin
plugin:plugin:
java:prepare-filesystem:

java:compile:
    [echo] Compiling to /home/continuum/continuum-1.0.2/apps/continuum/work/68/plugins/geronimo-deployment-plugin/target/classes

java:jar-resources:

test:prepare-filesystem:

test:test-resources:

test:compile:
    [echo] No test source files to compile.

test:test:
    [echo] No tests to run.

jar:jar:


plugin:repository-install:
    [echo] Installing...
Uploading to geronimo/plugins/geronimo-deployment-plugin-1.1.0-1.jar: 
.................... (31K)
Uploading to geronimo/poms/geronimo-deployment-plugin-1.1.0-1.pom: 
.................... (3K)

+----------------------------------------

build:end:

00:06:03,892 INFO  [ReactorTag] +----------------------------------------
| geronimo and geronimo-plugins Geronimo :: IZPack Installer Build Plugin
00:06:03,892 INFO  [ReactorTag] | geronimo and geronimo-plugins Geronimo :: IZPack Installer Build Plugin
| Memory: 24M/37M
00:06:03,892 INFO  [ReactorTag] | Memory: 24M/37M
+----------------------------------------
00:06:03,892 INFO  [ReactorTag] +----------------------------------------
DEPRECATED: the default goal should be specified in the <build> section of project.xml instead of maven.xml
00:06:03,914 WARN  [PluginScriptParser] DEPRECATED: the default goal should be specified in the <build> section of project.xml instead of maven.xml
build:start:

multiproject:install-callback:
    [echo] Running plugin:repository-install for Geronimo :: IZPack Installer Build Plugin
plugin:plugin:
java:prepare-filesystem:

java:compile:
    [echo] Compiling to /home/continuum/continuum-1.0.2/apps/continuum/work/68/plugins/geronimo-izpack-plugin/target/classes
    [echo] No java source files to compile.

java:jar-resources:

test:prepare-filesystem:

test:test-resources:

test:compile:
    [echo] No test source files to compile.

test:test:
    [echo] No tests to run.

jar:jar:


plugin:repository-install:
    [echo] Installing...
Uploading to geronimo/plugins/geronimo-izpack-plugin-1.1-SNAPSHOT.jar: 
.................... (7K)
Uploading to geronimo/poms/geronimo-izpack-plugin-1.1-SNAPSHOT.pom: 
.................... (1K)

+----------------------------------------

build:end:

00:06:04,780 INFO  [ReactorTag] +----------------------------------------
| geronimo and geronimo-plugins Geronimo :: Maven Packaging Plugin
00:06:04,780 INFO  [ReactorTag] | geronimo and geronimo-plugins Geronimo :: Maven Packaging Plugin
| Memory: 22M/37M
00:06:04,780 INFO  [ReactorTag] | Memory: 22M/37M
+----------------------------------------
00:06:04,780 INFO  [ReactorTag] +----------------------------------------
DEPRECATED: the default goal should be specified in the <build> section of project.xml instead of maven.xml
00:06:04,810 WARN  [PluginScriptParser] DEPRECATED: the default goal should be specified in the <build> section of project.xml instead of maven.xml
build:start:

multiproject:install-callback:
    [echo] Running plugin:repository-install for Geronimo :: Maven Packaging Plugin
plugin:plugin:
java:prepare-filesystem:

java:compile:
    [echo] Compiling to /home/continuum/continuum-1.0.2/apps/continuum/work/68/plugins/geronimo-packaging-plugin/target/classes

java:jar-resources:

test:prepare-filesystem:

test:test-resources:

test:compile:

test:test:
    [junit] Running org.apache.geronimo.plugin.packaging.PlanProcessorTest
    [junit] Tests run: 1, Failures: 0, Errors: 0, Time elapsed: 0.888 sec

jar:jar:


plugin:repository-install:
    [echo] Installing...
Uploading to geronimo/plugins/geronimo-packaging-plugin-1.1.0-4.jar: 
.................... (28K)
Uploading to geronimo/poms/geronimo-packaging-plugin-1.1.0-4.pom: 
.................... (4K)


build:end:


Starting the reactor...
new2:
00:06:07,949 INFO  [ReactorTag] Starting the reactor...
Our processing order:
00:06:08,215 INFO  [ReactorTag] Our processing order:
OpenEJB :: Core
00:06:08,215 INFO  [ReactorTag] OpenEJB :: Core
OpenEJB :: PK Generation :: Builder
00:06:08,215 INFO  [ReactorTag] OpenEJB :: PK Generation :: Builder
OpenEJB :: Builder
00:06:08,216 INFO  [ReactorTag] OpenEJB :: Builder
+----------------------------------------
00:06:08,216 INFO  [ReactorTag] +----------------------------------------
| openejb OpenEJB :: Core
00:06:08,216 INFO  [ReactorTag] | openejb OpenEJB :: Core
| Memory: 25M/37M
00:06:08,216 INFO  [ReactorTag] | Memory: 25M/37M
+----------------------------------------
00:06:08,216 INFO  [ReactorTag] +----------------------------------------
DEPRECATED: the default goal should be specified in the <build> section of project.xml instead of maven.xml
00:06:08,228 WARN  [PluginScriptParser] DEPRECATED: the default goal should be specified in the <build> section of project.xml instead of maven.xml
DEPRECATED: the default goal should be specified in the <build> section of project.xml instead of maven.xml
00:06:08,238 WARN  [PluginScriptParser] DEPRECATED: the default goal should be specified in the <build> section of project.xml instead of maven.xml
Attempting to download geronimo-timer-1.1-SNAPSHOT.jar.
00:06:08,581 INFO  [DependencyVerifier] Attempting to download geronimo-timer-1.1-SNAPSHOT.jar.
Attempting to download geronimo-corba_2.3_spec-1.1-SNAPSHOT.jar.
00:06:09,586 INFO  [DependencyVerifier] Attempting to download geronimo-corba_2.3_spec-1.1-SNAPSHOT.jar.
build:start:

multiproject:install-callback:
    [echo] Running jar:install for OpenEJB :: Core
java:prepare-filesystem:

java:compile:
<depend closure="false" srcdir="1.4" dump="false" destdir="/home/continuum/continuum-1.0.2/apps/continuum/work/68/openejb/modules/core/target/classes"></depend>    [echo] Compiling to /home/continuum/continuum-1.0.2/apps/continuum/work/68/openejb/modules/core/target/classes
Running post goal: java:compile
00:06:12,073 INFO  [PostGoalTag] Running post goal: java:compile
geronimo:dependency:


java:jar-resources:
Copying 1 file to /home/continuum/continuum-1.0.2/apps/continuum/work/68/openejb/modules/core/target/classes

test:prepare-filesystem:

test:test-resources:

test:compile:

test:test:
    [echo] NOTICE: Skipping tests; they seem to have passed already
    [echo] No tests to run.
Running post goal: test:test
00:06:14,282 INFO  [PostGoalTag] Running post goal: test:test

jar:jar:
    [jar] Building jar: /home/continuum/continuum-1.0.2/apps/continuum/work/68/openejb/modules/core/target/openejb-core-2.1-SNAPSHOT.jar

jar:install:
    [echo] Installing...
Uploading to openejb/jars/openejb-core-2.1-SNAPSHOT.jar: 
.................... (1186K)
Uploading to openejb/poms/openejb-core-2.1-SNAPSHOT.pom: 
.................... (13K)

+----------------------------------------

build:end:

00:06:19,566 INFO  [ReactorTag] +----------------------------------------
| openejb OpenEJB :: PK Generation :: Builder
00:06:19,566 INFO  [ReactorTag] | openejb OpenEJB :: PK Generation :: Builder
| Memory: 28M/37M
00:06:19,566 INFO  [ReactorTag] | Memory: 28M/37M
+----------------------------------------
00:06:19,567 INFO  [ReactorTag] +----------------------------------------
DEPRECATED: the default goal should be specified in the <build> section of project.xml instead of maven.xml
00:06:19,590 WARN  [PluginScriptParser] DEPRECATED: the default goal should be specified in the <build> section of project.xml instead of maven.xml
DEPRECATED: the default goal should be specified in the <build> section of project.xml instead of maven.xml
00:06:19,591 WARN  [PluginScriptParser] DEPRECATED: the default goal should be specified in the <build> section of project.xml instead of maven.xml
Attempting to download openejb-core-2.1-SNAPSHOT.jar.
00:06:19,886 INFO  [DependencyVerifier] Attempting to download openejb-core-2.1-SNAPSHOT.jar.
build:start:

multiproject:install-callback:
    [echo] Running jar:install for OpenEJB :: PK Generation :: Builder
java:prepare-filesystem:

java:compile:
<depend closure="false" srcdir="1.4" dump="false" destdir="/home/continuum/continuum-1.0.2/apps/continuum/work/68/openejb/modules/pkgen-builder/target/classes"></depend>    [echo] Compiling to /home/continuum/continuum-1.0.2/apps/continuum/work/68/openejb/modules/pkgen-builder/target/classes

java:jar-resources:

test:prepare-filesystem:

test:test-resources:

test:compile:
    [echo] No test source files to compile.

test:test:
    [echo] NOTICE: Skipping tests; they seem to have passed already
    [echo] No tests to run.
Running post goal: test:test
00:06:22,168 INFO  [PostGoalTag] Running post goal: test:test

jar:jar:

jar:install:
    [echo] Installing...
Uploading to openejb/jars/openejb-pkgen-builder-2.1-SNAPSHOT.jar: 
.................... (52K)
Uploading to openejb/poms/openejb-pkgen-builder-2.1-SNAPSHOT.pom: 
.................... (6K)

+----------------------------------------

build:end:

00:06:22,471 INFO  [ReactorTag] +----------------------------------------
| openejb OpenEJB :: Builder
00:06:22,471 INFO  [ReactorTag] | openejb OpenEJB :: Builder
| Memory: 29M/37M
00:06:22,471 INFO  [ReactorTag] | Memory: 29M/37M
+----------------------------------------
00:06:22,471 INFO  [ReactorTag] +----------------------------------------
DEPRECATED: the default goal should be specified in the <build> section of project.xml instead of maven.xml
00:06:22,488 WARN  [PluginScriptParser] DEPRECATED: the default goal should be specified in the <build> section of project.xml instead of maven.xml
DEPRECATED: the default goal should be specified in the <build> section of project.xml instead of maven.xml
00:06:22,489 WARN  [PluginScriptParser] DEPRECATED: the default goal should be specified in the <build> section of project.xml instead of maven.xml
Attempting to download openejb-pkgen-builder-2.1-SNAPSHOT.jar.
00:06:22,830 INFO  [DependencyVerifier] Attempting to download openejb-pkgen-builder-2.1-SNAPSHOT.jar.
build:start:

multiproject:install-callback:
    [echo] Running jar:install for OpenEJB :: Builder
java:prepare-filesystem:

java:compile:
<depend closure="false" srcdir="1.4" dump="false" destdir="/home/continuum/continuum-1.0.2/apps/continuum/work/68/openejb/modules/openejb-builder/target/classes"></depend>    [echo] Compiling to /home/continuum/continuum-1.0.2/apps/continuum/work/68/openejb/modules/openejb-builder/target/classes

java:jar-resources:

test:prepare-filesystem:

test:test-resources:

test:compile:
    [javac] Compiling 8 source files to /home/continuum/continuum-1.0.2/apps/continuum/work/68/openejb/modules/openejb-builder/target/test-classes

test:test:
    [junit] Running org.openejb.corba.security.config.tss.TSSConfigEditorTest
    [junit] Tests run: 3, Failures: 0, Errors: 0, Time elapsed: 2.692 sec
    [junit] Running org.openejb.deployment.BMPSystemMethodIndicesTest
    [junit] Tests run: 1, Failures: 0, Errors: 0, Time elapsed: 0.594 sec
    [junit] Running org.openejb.deployment.CMPEntityBuilderTest
    [junit] Tests run: 1, Failures: 0, Errors: 0, Time elapsed: 0.338 sec
    [junit] Running org.openejb.deployment.CMPSystemMethodIndicesTest
    [junit] Tests run: 1, Failures: 0, Errors: 0, Time elapsed: 0.644 sec
    [junit] Running org.openejb.deployment.EarDeploymentTest
    [junit] Tests run: 13, Failures: 0, Errors: 0, Time elapsed: 9.89 sec
    [junit] Running org.openejb.deployment.EjbJarModuleDeploymentTest
    [junit] Tests run: 13, Failures: 0, Errors: 0, Time elapsed: 9.356 sec
    [junit] Running org.openejb.deployment.MessageDrivenSystemMethodIndicesTest
    [junit] Tests run: 1, Failures: 0, Errors: 0, Time elapsed: 0.543 sec
    [junit] Running org.openejb.deployment.PlanParsingTest
    [junit] Tests run: 1, Failures: 0, Errors: 0, Time elapsed: 1.29 sec
    [junit] Running org.openejb.deployment.StatelessSystemMethodIndicesTest
    [junit] Tests run: 1, Failures: 0, Errors: 0, Time elapsed: 0.571 sec
    [junit] Running org.openejb.deployment.StatelfulSystemMethodIndicesTest
    [junit] Tests run: 1, Failures: 0, Errors: 0, Time elapsed: 0.553 sec
    [junit] Running org.openejb.deployment.TransactionPolicyHelperTest
    [junit] Tests run: 5, Failures: 0, Errors: 0, Time elapsed: 0.955 sec
    [junit] Running org.openejb.deployment.UnpackedModuleDeploymentTest
    [junit] Tests run: 13, Failures: 0, Errors: 0, Time elapsed: 9.309 sec
    [junit] Running org.openejb.deployment.ant.EjbJarLocationTest
    [junit] Tests run: 3, Failures: 0, Errors: 0, Time elapsed: 0.38 sec
    [junit] Running org.openejb.deployment.ant.OpenejbJarLocationTest
    [junit] Tests run: 5, Failures: 0, Errors: 0, Time elapsed: 0.968 sec
    [junit] Running org.openejb.deployment.entity.BasicBMPEntityContainerTest
    [junit] Tests run: 6, Failures: 0, Errors: 0, Time elapsed: 4.081 sec
    [junit] Running org.openejb.deployment.entity.BasicCMPEntityContainerTest
    [junit] Tests run: 7, Failures: 0, Errors: 0, Time elapsed: 5.092 sec
    [junit] Running org.openejb.deployment.entity.cmp.cmr.manytomany.ManyToManyCompoundPKTest
    [junit] Tests run: 11, Failures: 0, Errors: 0, Time elapsed: 7.177 sec
    [junit] Running org.openejb.deployment.entity.cmp.cmr.manytomany.ManyToManyTest
    [junit] Tests run: 11, Failures: 0, Errors: 0, Time elapsed: 6.969 sec
    [junit] Running org.openejb.deployment.entity.cmp.cmr.onetomany.OneToManyCascadeDeleteTest
    [junit] Tests run: 1, Failures: 0, Errors: 0, Time elapsed: 4.379 sec
    [junit] Running org.openejb.deployment.entity.cmp.cmr.onetomany.OneToManyCompoundPKCascadeDeleteTest
    [junit] Tests run: 1, Failures: 0, Errors: 0, Time elapsed: 4.457 sec
    [junit] Running org.openejb.deployment.entity.cmp.cmr.onetomany.OneToManyCompoundPKTest
    [junit] Tests run: 10, Failures: 0, Errors: 0, Time elapsed: 6.757 sec
    [junit] Running org.openejb.deployment.entity.cmp.cmr.onetomany.OneToManyTest
    [junit] Tests run: 10, Failures: 0, Errors: 0, Time elapsed: 6.698 sec
    [junit] Running org.openejb.deployment.entity.cmp.cmr.onetoone.OneToOneCompoundPKTest
    [junit] Tests run: 9, Failures: 0, Errors: 0, Time elapsed: 6.516 sec
    [junit] Running org.openejb.deployment.entity.cmp.cmr.onetoone.OneToOneTest
    [junit] Tests run: 9, Failures: 0, Errors: 0, Time elapsed: 6.464 sec
    [junit] Running org.openejb.deployment.entity.cmp.ejbql.EJBQLTest
    [junit] Tests run: 3, Failures: 0, Errors: 0, Time elapsed: 5.059 sec
    [junit] Running org.openejb.deployment.mdb.BasicMDBContainerTest
    [junit] Tests run: 1, Failures: 0, Errors: 0, Time elapsed: 6.558 sec
    [junit] Running org.openejb.deployment.slsb.BasicStatelessContainerTest
    [junit] Tests run: 6, Failures: 0, Errors: 0, Time elapsed: 4.768 sec
    [junit] Running org.openejb.deployment.slsb.StatelessClientContainerTest
    [junit] Tests run: 7, Failures: 0, Errors: 0, Time elapsed: 1.25 sec
    [junit] Running org.openejb.transaction.ContainerPolicyTest
    [junit] Tests run: 3, Failures: 0, Errors: 0, Time elapsed: 0.483 sec
Running post goal: test:test
00:08:38,644 INFO  [PostGoalTag] Running post goal: test:test

jar:jar:

jar:install:
    [echo] Installing...
Uploading to openejb/jars/openejb-builder-2.1-SNAPSHOT.jar: 
.................... (605K)
Uploading to openejb/poms/openejb-builder-2.1-SNAPSHOT.pom: 
.................... (16K)


build:end:


Starting the reactor...
new3:
00:08:39,383 INFO  [ReactorTag] Starting the reactor...
Our processing order:
00:08:40,557 INFO  [ReactorTag] Our processing order:
Geronimo :: Console :: Common Code
00:08:40,557 INFO  [ReactorTag] Geronimo :: Console :: Common Code
Geronimo :: Console :: Portal Framework
00:08:40,558 INFO  [ReactorTag] Geronimo :: Console :: Portal Framework
Geronimo :: Console :: Standard Portlets
00:08:40,558 INFO  [ReactorTag] Geronimo :: Console :: Standard Portlets
Geronimo :: Console :: Application EAR
00:08:40,558 INFO  [ReactorTag] Geronimo :: Console :: Application EAR
DayTrader :: Core
00:08:40,558 INFO  [ReactorTag] DayTrader :: Core
DayTrader :: Derby Database
00:08:40,558 INFO  [ReactorTag] DayTrader :: Derby Database
DayTrader :: WS Application Client
00:08:40,558 INFO  [ReactorTag] DayTrader :: WS Application Client
DayTrader :: EJBs
00:08:40,558 INFO  [ReactorTag] DayTrader :: EJBs
DayTrader :: Web Application
00:08:40,558 INFO  [ReactorTag] DayTrader :: Web Application
DayTrader :: Quote Streamer
00:08:40,558 INFO  [ReactorTag] DayTrader :: Quote Streamer
DayTrader :: Enterprise Application
00:08:40,558 INFO  [ReactorTag] DayTrader :: Enterprise Application
Geronimo :: Demo Webapp
00:08:40,558 INFO  [ReactorTag] Geronimo :: Demo Webapp
Geronimo :: JMX Debug Webapp
00:08:40,558 INFO  [ReactorTag] Geronimo :: JMX Debug Webapp
Geronimo :: LDAP Demo Application
00:08:40,558 INFO  [ReactorTag] Geronimo :: LDAP Demo Application
Geronimo :: The Magic G Ball Sample Application
00:08:40,558 INFO  [ReactorTag] Geronimo :: The Magic G Ball Sample Application
Geronimo :: Remote Deploy GBean
00:08:40,558 INFO  [ReactorTag] Geronimo :: Remote Deploy GBean
Geronimo :: Remote Deploy Application
00:08:40,558 INFO  [ReactorTag] Geronimo :: Remote Deploy Application
Geronimo :: UDDI-Server database
00:08:40,559 INFO  [ReactorTag] Geronimo :: UDDI-Server database
Geronimo :: UDDI-Server
00:08:40,559 INFO  [ReactorTag] Geronimo :: UDDI-Server
Geronimo :: Welcome Application
00:08:40,559 INFO  [ReactorTag] Geronimo :: Welcome Application
+----------------------------------------
00:08:40,559 INFO  [ReactorTag] +----------------------------------------
| applications Geronimo :: Console :: Common Code
00:08:40,559 INFO  [ReactorTag] | applications Geronimo :: Console :: Common Code
| Memory: 33M/46M
00:08:40,559 INFO  [ReactorTag] | Memory: 33M/46M
+----------------------------------------
00:08:40,559 INFO  [ReactorTag] +----------------------------------------
DEPRECATED: the default goal should be specified in the <build> section of project.xml instead of maven.xml
00:08:40,593 WARN  [PluginScriptParser] DEPRECATED: the default goal should be specified in the <build> section of project.xml instead of maven.xml
DEPRECATED: the default goal should be specified in the <build> section of project.xml instead of maven.xml
00:08:40,594 WARN  [PluginScriptParser] DEPRECATED: the default goal should be specified in the <build> section of project.xml instead of maven.xml
build:start:

multiproject:install-callback:
    [echo] Running jar:install for Geronimo :: Console :: Common Code
java:prepare-filesystem:

java:compile:
<depend closure="false" srcdir="1.4" dump="false" destdir="/home/continuum/continuum-1.0.2/apps/continuum/work/68/applications/console-core/target/classes"></depend>    [echo] Compiling to /home/continuum/continuum-1.0.2/apps/continuum/work/68/applications/console-core/target/classes
Running post goal: java:compile
00:08:41,284 INFO  [PostGoalTag] Running post goal: java:compile

java:jar-resources:

test:prepare-filesystem:

test:test-resources:

test:compile:
    [echo] No test source files to compile.

test:test:
    [echo] NOTICE: Skipping tests; they seem to have passed already
    [echo] No tests to run.
Running post goal: test:test
00:08:41,893 INFO  [PostGoalTag] Running post goal: test:test

jar:jar:
    [jar] Building jar: /home/continuum/continuum-1.0.2/apps/continuum/work/68/applications/console-core/target/geronimo-console-core-1.1-SNAPSHOT.jar

jar:install:
    [echo] Installing...
Uploading to geronimo/jars/geronimo-console-core-1.1-SNAPSHOT.jar: 
.................... (40K)
Uploading to geronimo/poms/geronimo-console-core-1.1-SNAPSHOT.pom: 
.................... (13K)

+----------------------------------------

build:end:

00:08:42,384 INFO  [ReactorTag] +----------------------------------------
| applications Geronimo :: Console :: Portal Framework
00:08:42,384 INFO  [ReactorTag] | applications Geronimo :: Console :: Portal Framework
| Memory: 33M/46M
00:08:42,384 INFO  [ReactorTag] | Memory: 33M/46M
+----------------------------------------
00:08:42,384 INFO  [ReactorTag] +----------------------------------------
DEPRECATED: the default goal should be specified in the <build> section of project.xml instead of maven.xml
00:08:42,418 WARN  [PluginScriptParser] DEPRECATED: the default goal should be specified in the <build> section of project.xml instead of maven.xml
DEPRECATED: the default goal should be specified in the <build> section of project.xml instead of maven.xml
00:08:42,419 WARN  [PluginScriptParser] DEPRECATED: the default goal should be specified in the <build> section of project.xml instead of maven.xml
Attempting to download geronimo-j2ee_1.4_spec-1.1-SNAPSHOT.jar.
00:08:42,713 INFO  [DependencyVerifier] Attempting to download geronimo-j2ee_1.4_spec-1.1-SNAPSHOT.jar.
build:start:

multiproject:install-callback:
    [echo] Running war:install for Geronimo :: Console :: Portal Framework
Tag library requested that is not present: 'caller' in plugin: 'maven-war-plugin-1.6.1'
00:08:43,692 WARN  [GoalToJellyScriptHousingMapper] Tag library requested that is not present: 'caller' in plugin: 'maven-war-plugin-1.6.1'
war:init:

war:war-resources:
    [copy] Copying 1 file to /home/continuum/continuum-1.0.2/apps/continuum/work/68/applications/console-framework/target/geronimo-console-framework
    [copy] Copying 1 file to /home/continuum/continuum-1.0.2/apps/continuum/work/68/applications/console-framework/target/geronimo-console-framework/WEB-INF

java:prepare-filesystem:

java:compile:
    [echo] Compiling to /home/continuum/continuum-1.0.2/apps/continuum/work/68/applications/console-framework/target/classes
    [echo] No java source files to compile.

java:jar-resources:

test:prepare-filesystem:

test:test-resources:

test:compile:
    [echo] No test source files to compile.

test:test:
    [echo] NOTICE: Skipping tests; they seem to have passed already
    [echo] No tests to run.
Running post goal: test:test
00:08:45,408 INFO  [PostGoalTag] Running post goal: test:test

war:webapp:
    [echo] Assembling webapp geronimo-console-framework
Running post goal: war:webapp
00:08:46,112 INFO  [PostGoalTag] Running post goal: war:webapp
    [echo] Use classes.jar ? true
    [copy] Copying 1 file to /home/continuum/continuum-1.0.2/apps/continuum/work/68/applications/console-framework/target/work
    [delete] Deleting 1 files from /home/continuum/continuum-1.0.2/apps/continuum/work/68/applications/console-framework/target/geronimo-console-framework/WEB-INF/classes
    [delete] Deleting 1 files from /home/continuum/continuum-1.0.2/apps/continuum/work/68/applications/console-framework/target/work

war:war:
    [echo] Building WAR geronimo-console-framework
    [jar] Building jar: /home/continuum/continuum-1.0.2/apps/continuum/work/68/applications/console-framework/target/geronimo-console-framework-1.1-SNAPSHOT.war

war:install:
    [echo] Installing...
Uploading to geronimo/wars/geronimo-console-framework-1.1-SNAPSHOT.war: 
.................... (2515K)
Uploading to geronimo/poms/geronimo-console-framework-1.1-SNAPSHOT.pom: 
.................... (12K)

+----------------------------------------

build:end:

00:08:49,023 INFO  [ReactorTag] +----------------------------------------
| applications Geronimo :: Console :: Standard Portlets
00:08:49,023 INFO  [ReactorTag] | applications Geronimo :: Console :: Standard Portlets
| Memory: 35M/46M
00:08:49,023 INFO  [ReactorTag] | Memory: 35M/46M
+----------------------------------------
00:08:49,023 INFO  [ReactorTag] +----------------------------------------
DEPRECATED: the default goal should be specified in the <build> section of project.xml instead of maven.xml
00:08:49,061 WARN  [PluginScriptParser] DEPRECATED: the default goal should be specified in the <build> section of project.xml instead of maven.xml
DEPRECATED: the default goal should be specified in the <build> section of project.xml instead of maven.xml
00:08:49,062 WARN  [PluginScriptParser] DEPRECATED: the default goal should be specified in the <build> section of project.xml instead of maven.xml
Attempting to download geronimo-derby-1.1-SNAPSHOT.jar.
00:08:49,405 INFO  [DependencyVerifier] Attempting to download geronimo-derby-1.1-SNAPSHOT.jar.
Attempting to download geronimo-converter-1.1-SNAPSHOT.jar.
00:08:50,371 INFO  [DependencyVerifier] Attempting to download geronimo-converter-1.1-SNAPSHOT.jar.
Attempting to download activemq-core-3.2.4-SNAPSHOT.jar.
00:08:51,289 INFO  [DependencyVerifier] Attempting to download activemq-core-3.2.4-SNAPSHOT.jar.
Attempting to download geronimo-console-core-1.1-SNAPSHOT.jar.
00:08:52,209 INFO  [DependencyVerifier] Attempting to download geronimo-console-core-1.1-SNAPSHOT.jar.
build:start:

multiproject:install-callback:
    [echo] Running war:install for Geronimo :: Console :: Standard Portlets
Tag library requested that is not present: 'caller' in plugin: 'maven-war-plugin-1.6.1'
00:08:53,255 WARN  [GoalToJellyScriptHousingMapper] Tag library requested that is not present: 'caller' in plugin: 'maven-war-plugin-1.6.1'
war:init:

war:war-resources:
    [copy] Copying 1 file to /home/continuum/continuum-1.0.2/apps/continuum/work/68/applications/console-standard/target/geronimo-console-standard
    [copy] Copying 1 file to /home/continuum/continuum-1.0.2/apps/continuum/work/68/applications/console-standard/target/geronimo-console-standard/WEB-INF

java:prepare-filesystem:

java:compile:
<depend closure="false" srcdir="1.4" dump="false" destdir="/home/continuum/continuum-1.0.2/apps/continuum/work/68/applications/console-standard/target/classes"></depend>    [echo] Compiling to /home/continuum/continuum-1.0.2/apps/continuum/work/68/applications/console-standard/target/classes
    [javac] Compiling 1 source file to /home/continuum/continuum-1.0.2/apps/continuum/work/68/applications/console-standard/target/classes

java:jar-resources:

test:prepare-filesystem:

test:test-resources:

test:compile:

test:test:
Running post goal: test:test
00:08:57,351 INFO  [PostGoalTag] Running post goal: test:test

war:webapp:
    [echo] Assembling webapp geronimo-console-standard
    [copy] Copying 166 files to /home/continuum/continuum-1.0.2/apps/continuum/work/68/applications/console-standard/target/geronimo-console-standard/WEB-INF/classes
Running post goal: war:webapp
00:09:00,099 INFO  [PostGoalTag] Running post goal: war:webapp
    [echo] Use classes.jar ? true
    [copy] Copying 168 files to /home/continuum/continuum-1.0.2/apps/continuum/work/68/applications/console-standard/target/work
    [jar] Building jar: /home/continuum/continuum-1.0.2/apps/continuum/work/68/applications/console-standard/target/geronimo-console-standard/WEB-INF/lib/classes.jar
    [delete] Deleting 168 files from /home/continuum/continuum-1.0.2/apps/continuum/work/68/applications/console-standard/target/geronimo-console-standard/WEB-INF/classes
    [delete] Deleted 32 directories from /home/continuum/continuum-1.0.2/apps/continuum/work/68/applications/console-standard/target/geronimo-console-standard/WEB-INF/classes
    [delete] Deleting 168 files from /home/continuum/continuum-1.0.2/apps/continuum/work/68/applications/console-standard/target/work
    [delete] Deleted 32 directories from /home/continuum/continuum-1.0.2/apps/continuum/work/68/applications/console-standard/target/work

war:war:
substitute:

    [echo] Building WAR geronimo-console-standard
    [jar] Building jar: /home/continuum/continuum-1.0.2/apps/continuum/work/68/applications/console-standard/target/geronimo-console-standard-1.1-SNAPSHOT.war

war:install:
    [echo] Installing...
Uploading to geronimo/wars/geronimo-console-standard-1.1-SNAPSHOT.war: 
.................... (4391K)
Uploading to geronimo/poms/geronimo-console-standard-1.1-SNAPSHOT.pom: 
.................... (17K)

+----------------------------------------

build:end:

00:09:07,588 INFO  [ReactorTag] +----------------------------------------
| applications Geronimo :: Console :: Application EAR
00:09:07,588 INFO  [ReactorTag] | applications Geronimo :: Console :: Application EAR
| Memory: 43M/46M
00:09:07,588 INFO  [ReactorTag] | Memory: 43M/46M
+----------------------------------------
00:09:07,589 INFO  [ReactorTag] +----------------------------------------
DEPRECATED: the default goal should be specified in the <build> section of project.xml instead of maven.xml
00:09:07,619 WARN  [PluginScriptParser] DEPRECATED: the default goal should be specified in the <build> section of project.xml instead of maven.xml
DEPRECATED: the default goal should be specified in the <build> section of project.xml instead of maven.xml
00:09:07,621 WARN  [PluginScriptParser] DEPRECATED: the default goal should be specified in the <build> section of project.xml instead of maven.xml
Attempting to download geronimo-console-framework-1.1-SNAPSHOT.war.
00:09:07,916 INFO  [DependencyVerifier] Attempting to download geronimo-console-framework-1.1-SNAPSHOT.war.
Attempting to download geronimo-console-standard-1.1-SNAPSHOT.war.
00:09:08,953 INFO  [DependencyVerifier] Attempting to download geronimo-console-standard-1.1-SNAPSHOT.war.
build:start:

multiproject:install-callback:
    [echo] Running ear:install for Geronimo :: Console :: Application EAR
ear:init:

ear:ear:
ear:generate-ear-descriptor:
    [echo] Generating /home/continuum/continuum-1.0.2/apps/continuum/work/68/applications/console-ear/target/application.xml

    [echo] Building EAR geronimo-console-1.1-SNAPSHOT.ear with appxml "/home/continuum/continuum-1.0.2/apps/continuum/work/68/applications/console-ear/target/application.xml"
    [ear] Building ear: /home/continuum/continuum-1.0.2/apps/continuum/work/68/applications/console-ear/target/geronimo-console-1.1-SNAPSHOT.ear

ear:install:
    [echo] Installing...
Uploading to geronimo/ears/geronimo-console-1.1-SNAPSHOT.ear: 
.................... (6813K)
Uploading to geronimo/poms/geronimo-console-1.1-SNAPSHOT.pom: 
.................... (12K)

+----------------------------------------

build:end:

00:09:12,509 INFO  [ReactorTag] +----------------------------------------
| applications DayTrader :: Core
00:09:12,509 INFO  [ReactorTag] | applications DayTrader :: Core
| Memory: 45M/46M
00:09:12,509 INFO  [ReactorTag] | Memory: 45M/46M
+----------------------------------------
00:09:12,509 INFO  [ReactorTag] +----------------------------------------
DEPRECATED: the default goal should be specified in the <build> section of project.xml instead of maven.xml
00:09:12,541 WARN  [PluginScriptParser] DEPRECATED: the default goal should be specified in the <build> section of project.xml instead of maven.xml
DEPRECATED: the default goal should be specified in the <build> section of project.xml instead of maven.xml
00:09:12,542 WARN  [PluginScriptParser] DEPRECATED: the default goal should be specified in the <build> section of project.xml instead of maven.xml
build:start:

multiproject:install-callback:
    [echo] Running jar:install for DayTrader :: Core
java:prepare-filesystem:

java:compile:
<depend closure="false" srcdir="1.4" dump="false" destdir="/home/continuum/continuum-1.0.2/apps/continuum/work/68/applications/daytrader/core/target/classes"></depend>    [echo] Compiling to /home/continuum/continuum-1.0.2/apps/continuum/work/68/applications/daytrader/core/target/classes

java:jar-resources:

test:prepare-filesystem:

test:test-resources:

test:compile:

test:test:
    [echo] NOTICE: Skipping tests; they seem to have passed already
    [echo] No tests to run.
Running post goal: test:test
00:09:13,957 INFO  [PostGoalTag] Running post goal: test:test

jar:jar:

jar:install:
    [echo] Installing...
Uploading to geronimo/jars/daytrader-core-1.1-SNAPSHOT.jar: 
.................... (1K)
Uploading to geronimo/poms/daytrader-core-1.1-SNAPSHOT.pom: 
.................... (10K)

+----------------------------------------

build:end:

00:09:14,206 INFO  [ReactorTag] +----------------------------------------
| applications DayTrader :: Derby Database
00:09:14,206 INFO  [ReactorTag] | applications DayTrader :: Derby Database
| Memory: 22M/46M
00:09:14,206 INFO  [ReactorTag] | Memory: 22M/46M
+----------------------------------------
00:09:14,206 INFO  [ReactorTag] +----------------------------------------
DEPRECATED: the default goal should be specified in the <build> section of project.xml instead of maven.xml
00:09:14,224 WARN  [PluginScriptParser] DEPRECATED: the default goal should be specified in the <build> section of project.xml instead of maven.xml
DEPRECATED: the default goal should be specified in the <build> section of project.xml instead of maven.xml
00:09:14,226 WARN  [PluginScriptParser] DEPRECATED: the default goal should be specified in the <build> section of project.xml instead of maven.xml
build:start:

multiproject:install-callback:
    [echo] Running jar:install for DayTrader :: Derby Database
java:prepare-filesystem:
init-database:
    [delete] Deleting directory /home/continuum/continuum-1.0.2/apps/continuum/work/68/applications/daytrader/derby/target/resources/META-INF/geronimo-daytrader-derby-db/var/derby
    [mkdir] Created dir: /home/continuum/continuum-1.0.2/apps/continuum/work/68/applications/daytrader/derby/target/resources/META-INF/geronimo-daytrader-derby-db/var/derby
    [sql] Executing file: /home/continuum/continuum-1.0.2/apps/continuum/work/68/applications/daytrader/derby/src/sql/daytrader.sql
    [sql] 18 of 18 SQL statements executed successfully


java:compile:
    [echo] Compiling to /home/continuum/continuum-1.0.2/apps/continuum/work/68/applications/daytrader/derby/target/classes
    [echo] No java source files to compile.

java:jar-resources:
Copying 71 files to /home/continuum/continuum-1.0.2/apps/continuum/work/68/applications/daytrader/derby/target/classes

test:prepare-filesystem:

test:test-resources:

test:compile:
    [echo] No test source files to compile.

test:test:
    [echo] NOTICE: Skipping tests; they seem to have passed already
    [echo] No tests to run.
Running post goal: test:test
00:09:21,653 INFO  [PostGoalTag] Running post goal: test:test

jar:jar:
    [jar] Building jar: /home/continuum/continuum-1.0.2/apps/continuum/work/68/applications/daytrader/derby/target/geronimo-daytrader-derby-db-1.1-SNAPSHOT.jar

jar:install:
    [echo] Installing...
Uploading to geronimo/jars/geronimo-daytrader-derby-db-1.1-SNAPSHOT.jar: 
.................... (67K)
Uploading to geronimo/poms/geronimo-daytrader-derby-db-1.1-SNAPSHOT.pom: 
.................... (10K)

+----------------------------------------

build:end:

00:09:22,079 INFO  [ReactorTag] +----------------------------------------
| applications DayTrader :: WS Application Client
00:09:22,079 INFO  [ReactorTag] | applications DayTrader :: WS Application Client
| Memory: 21M/46M
00:09:22,079 INFO  [ReactorTag] | Memory: 21M/46M
+----------------------------------------
00:09:22,079 INFO  [ReactorTag] +----------------------------------------
DEPRECATED: the default goal should be specified in the <build> section of project.xml instead of maven.xml
00:09:22,097 WARN  [PluginScriptParser] DEPRECATED: the default goal should be specified in the <build> section of project.xml instead of maven.xml
DEPRECATED: the default goal should be specified in the <build> section of project.xml instead of maven.xml
00:09:22,098 WARN  [PluginScriptParser] DEPRECATED: the default goal should be specified in the <build> section of project.xml instead of maven.xml
build:start:

multiproject:install-callback:
    [echo] Running jar:install for DayTrader :: WS Application Client
java:prepare-filesystem:

java:compile:
<depend closure="false" srcdir="1.4" dump="false" destdir="/home/continuum/continuum-1.0.2/apps/continuum/work/68/applications/daytrader/wsappclient/target/classes"></depend>    [echo] Compiling to /home/continuum/continuum-1.0.2/apps/continuum/work/68/applications/daytrader/wsappclient/target/classes

java:jar-resources:

test:prepare-filesystem:

test:test-resources:

test:compile:

test:test:
    [echo] NOTICE: Skipping tests; they seem to have passed already
    [echo] No tests to run.
Running post goal: test:test
00:09:23,210 INFO  [PostGoalTag] Running post goal: test:test

jar:jar:
    [echo] Generating Manifest file for Streamer Application
    [echo] And this is found in /client/META-INF

jar:install:
    [echo] Installing...
Uploading to geronimo/jars/daytrader-wsappclient-1.1-SNAPSHOT.jar: 
.................... (40K)
Uploading to geronimo/poms/daytrader-wsappclient-1.1-SNAPSHOT.pom: 
.................... (10K)

+----------------------------------------

build:end:

00:09:23,653 INFO  [ReactorTag] +----------------------------------------
| applications DayTrader :: EJBs
00:09:23,653 INFO  [ReactorTag] | applications DayTrader :: EJBs
| Memory: 24M/46M
00:09:23,653 INFO  [ReactorTag] | Memory: 24M/46M
+----------------------------------------
00:09:23,653 INFO  [ReactorTag] +----------------------------------------
DEPRECATED: the default goal should be specified in the <build> section of project.xml instead of maven.xml
00:09:23,677 WARN  [PluginScriptParser] DEPRECATED: the default goal should be specified in the <build> section of project.xml instead of maven.xml
DEPRECATED: the default goal should be specified in the <build> section of project.xml instead of maven.xml
00:09:23,677 WARN  [PluginScriptParser] DEPRECATED: the default goal should be specified in the <build> section of project.xml instead of maven.xml
Attempting to download daytrader-core-1.1-SNAPSHOT.jar.
00:09:24,022 INFO  [DependencyVerifier] Attempting to download daytrader-core-1.1-SNAPSHOT.jar.
Attempting to download daytrader-wsappclient-1.1-SNAPSHOT.jar.
00:09:24,990 INFO  [DependencyVerifier] Attempting to download daytrader-wsappclient-1.1-SNAPSHOT.jar.
build:start:

multiproject:install-callback:
    [echo] Running ejb:install for DayTrader :: EJBs
ejb:init:
java:prepare-filesystem:

java:compile:
<depend closure="false" srcdir="1.4" dump="false" destdir="/home/continuum/continuum-1.0.2/apps/continuum/work/68/applications/daytrader/ejb/target/classes"></depend>    [echo] Compiling to /home/continuum/continuum-1.0.2/apps/continuum/work/68/applications/daytrader/ejb/target/classes

java:jar-resources:

test:prepare-filesystem:

test:test-resources:

test:compile:

test:test:
    [echo] NOTICE: Skipping tests; they seem to have passed already
    [echo] No tests to run.
Running post goal: test:test
00:09:27,019 INFO  [PostGoalTag] Running post goal: test:test


ejb:ejb:
ejb:ejb-jar-internal:
    [echo] Building ejb daytrader-ejb-1.1-SNAPSHOT
    [echo] Bundling: jar - commons-logging:commons-logging


ejb:install:
    [echo] Installing...
Uploading to geronimo/ejbs/daytrader-ejb-1.1-SNAPSHOT.jar: 
.................... (140K)
Uploading to geronimo/poms/daytrader-ejb-1.1-SNAPSHOT.pom: 
.................... (10K)

+----------------------------------------

build:end:

00:09:27,450 INFO  [ReactorTag] +----------------------------------------
| applications DayTrader :: Web Application
00:09:27,450 INFO  [ReactorTag] | applications DayTrader :: Web Application
| Memory: 25M/46M
00:09:27,450 INFO  [ReactorTag] | Memory: 25M/46M
+----------------------------------------
00:09:27,450 INFO  [ReactorTag] +----------------------------------------
DEPRECATED: the default goal should be specified in the <build> section of project.xml instead of maven.xml
00:09:27,483 WARN  [PluginScriptParser] DEPRECATED: the default goal should be specified in the <build> section of project.xml instead of maven.xml
DEPRECATED: the default goal should be specified in the <build> section of project.xml instead of maven.xml
00:09:27,484 WARN  [PluginScriptParser] DEPRECATED: the default goal should be specified in the <build> section of project.xml instead of maven.xml
Attempting to download daytrader-ejb-1.1-SNAPSHOT.jar.
00:09:27,829 INFO  [DependencyVerifier] Attempting to download daytrader-ejb-1.1-SNAPSHOT.jar.
build:start:

multiproject:install-callback:
    [echo] Running war:install for DayTrader :: Web Application
Tag library requested that is not present: 'caller' in plugin: 'maven-war-plugin-1.6.1'
00:09:28,933 WARN  [GoalToJellyScriptHousingMapper] Tag library requested that is not present: 'caller' in plugin: 'maven-war-plugin-1.6.1'
war:init:

war:war-resources:

java:prepare-filesystem:

java:compile:
<depend closure="false" srcdir="1.4" dump="false" destdir="/home/continuum/continuum-1.0.2/apps/continuum/work/68/applications/daytrader/web/target/classes"></depend>    [echo] Compiling to /home/continuum/continuum-1.0.2/apps/continuum/work/68/applications/daytrader/web/target/classes

java:jar-resources:

test:prepare-filesystem:

test:test-resources:

test:compile:

test:test:
    [echo] NOTICE: Skipping tests; they seem to have passed already
    [echo] No tests to run.
Running post goal: test:test
00:09:29,963 INFO  [PostGoalTag] Running post goal: test:test

war:webapp:
    [echo] Assembling webapp daytrader-web
    [copy] Copying 33 files to /home/continuum/continuum-1.0.2/apps/continuum/work/68/applications/daytrader/web/target/daytrader-web/WEB-INF/classes
Running post goal: war:webapp
00:09:30,386 INFO  [PostGoalTag] Running post goal: war:webapp
    [echo] Generating /web.xml
Running post goal: war:webapp
00:09:30,502 INFO  [PostGoalTag] Running post goal: war:webapp
    [echo] Use classes.jar ? true
    [copy] Copying 33 files to /home/continuum/continuum-1.0.2/apps/continuum/work/68/applications/daytrader/web/target/work
    [jar] Building jar: /home/continuum/continuum-1.0.2/apps/continuum/work/68/applications/daytrader/web/target/daytrader-web/WEB-INF/lib/classes.jar
    [delete] Deleting 33 files from /home/continuum/continuum-1.0.2/apps/continuum/work/68/applications/daytrader/web/target/daytrader-web/WEB-INF/classes
    [delete] Deleted 7 directories from /home/continuum/continuum-1.0.2/apps/continuum/work/68/applications/daytrader/web/target/daytrader-web/WEB-INF/classes
    [delete] Deleting 33 files from /home/continuum/continuum-1.0.2/apps/continuum/work/68/applications/daytrader/web/target/work
    [delete] Deleted 7 directories from /home/continuum/continuum-1.0.2/apps/continuum/work/68/applications/daytrader/web/target/work

war:war:
    [echo] Building WAR daytrader-web
    [jar] Building jar: /home/continuum/continuum-1.0.2/apps/continuum/work/68/applications/daytrader/web/target/daytrader-web-1.1-SNAPSHOT.war

war:install:
    [echo] Installing...
Uploading to geronimo/wars/daytrader-web-1.1-SNAPSHOT.war: 
.................... (446K)
Uploading to geronimo/poms/daytrader-web-1.1-SNAPSHOT.pom: 
.................... (10K)

+----------------------------------------

build:end:

00:09:31,540 INFO  [ReactorTag] +----------------------------------------
| applications DayTrader :: Quote Streamer
00:09:31,540 INFO  [ReactorTag] | applications DayTrader :: Quote Streamer
| Memory: 29M/46M
00:09:31,540 INFO  [ReactorTag] | Memory: 29M/46M
+----------------------------------------
00:09:31,540 INFO  [ReactorTag] +----------------------------------------
DEPRECATED: the default goal should be specified in the <build> section of project.xml instead of maven.xml
00:09:31,576 WARN  [PluginScriptParser] DEPRECATED: the default goal should be specified in the <build> section of project.xml instead of maven.xml
DEPRECATED: the default goal should be specified in the <build> section of project.xml instead of maven.xml
00:09:31,577 WARN  [PluginScriptParser] DEPRECATED: the default goal should be specified in the <build> section of project.xml instead of maven.xml
build:start:

multiproject:install-callback:
    [echo] Running jar:install for DayTrader :: Quote Streamer
java:prepare-filesystem:

java:compile:
<depend closure="false" srcdir="1.4" dump="false" destdir="/home/continuum/continuum-1.0.2/apps/continuum/work/68/applications/daytrader/streamer/target/classes"></depend>    [echo] Compiling to /home/continuum/continuum-1.0.2/apps/continuum/work/68/applications/daytrader/streamer/target/classes

java:jar-resources:

test:prepare-filesystem:

test:test-resources:

test:compile:

test:test:
    [echo] NOTICE: Skipping tests; they seem to have passed already
    [echo] No tests to run.
Running post goal: test:test
00:09:32,770 INFO  [PostGoalTag] Running post goal: test:test

jar:jar:
    [echo] Generating Manifest file for Streamer Application
    [echo] And this is found in /client/META-INF

jar:install:
    [echo] Installing...
Uploading to geronimo/jars/daytrader-streamer-1.1-SNAPSHOT.jar: 
.................... (24K)
Uploading to geronimo/poms/daytrader-streamer-1.1-SNAPSHOT.pom: 
.................... (10K)

+----------------------------------------

build:end:

00:09:33,240 INFO  [ReactorTag] +----------------------------------------
| applications DayTrader :: Enterprise Application
00:09:33,240 INFO  [ReactorTag] | applications DayTrader :: Enterprise Application
| Memory: 29M/46M
00:09:33,240 INFO  [ReactorTag] | Memory: 29M/46M
+----------------------------------------
00:09:33,240 INFO  [ReactorTag] +----------------------------------------
DEPRECATED: the default goal should be specified in the <build> section of project.xml instead of maven.xml
00:09:33,268 WARN  [PluginScriptParser] DEPRECATED: the default goal should be specified in the <build> section of project.xml instead of maven.xml
DEPRECATED: the default goal should be specified in the <build> section of project.xml instead of maven.xml
00:09:33,270 WARN  [PluginScriptParser] DEPRECATED: the default goal should be specified in the <build> section of project.xml instead of maven.xml
Attempting to download daytrader-web-1.1-SNAPSHOT.war.
00:09:33,612 INFO  [DependencyVerifier] Attempting to download daytrader-web-1.1-SNAPSHOT.war.
Attempting to download daytrader-streamer-1.1-SNAPSHOT.jar.
00:09:34,678 INFO  [DependencyVerifier] Attempting to download daytrader-streamer-1.1-SNAPSHOT.jar.
build:start:

multiproject:install-callback:
    [echo] Running ear:install for DayTrader :: Enterprise Application
ear:init:

ear:ear:
ear:generate-ear-descriptor:
    [echo] Generating /home/continuum/continuum-1.0.2/apps/continuum/work/68/applications/daytrader/ear/target/application.xml

    [echo] Building EAR daytrader-ear-1.1-SNAPSHOT.ear with appxml "/home/continuum/continuum-1.0.2/apps/continuum/work/68/applications/daytrader/ear/target/application.xml"
    [ear] Building ear: /home/continuum/continuum-1.0.2/apps/continuum/work/68/applications/daytrader/ear/target/daytrader-ear-1.1-SNAPSHOT.ear

ear:install:
    [echo] Installing...
Uploading to geronimo/ears/daytrader-ear-1.1-SNAPSHOT.ear: 
.................... (634K)
Uploading to geronimo/poms/daytrader-ear-1.1-SNAPSHOT.pom: 
.................... (11K)

+----------------------------------------

build:end:

00:09:36,486 INFO  [ReactorTag] +----------------------------------------
| applications Geronimo :: Demo Webapp
00:09:36,486 INFO  [ReactorTag] | applications Geronimo :: Demo Webapp
| Memory: 32M/46M
00:09:36,486 INFO  [ReactorTag] | Memory: 32M/46M
+----------------------------------------
00:09:36,486 INFO  [ReactorTag] +----------------------------------------
DEPRECATED: the default goal should be specified in the <build> section of project.xml instead of maven.xml
00:09:36,516 WARN  [PluginScriptParser] DEPRECATED: the default goal should be specified in the <build> section of project.xml instead of maven.xml
DEPRECATED: the default goal should be specified in the <build> section of project.xml instead of maven.xml
00:09:36,518 WARN  [PluginScriptParser] DEPRECATED: the default goal should be specified in the <build> section of project.xml instead of maven.xml
build:start:

multiproject:install-callback:
    [echo] Running war:install for Geronimo :: Demo Webapp
Tag library requested that is not present: 'caller' in plugin: 'maven-war-plugin-1.6.1'
00:09:36,899 WARN  [GoalToJellyScriptHousingMapper] Tag library requested that is not present: 'caller' in plugin: 'maven-war-plugin-1.6.1'
war:init:

war:war-resources:
    [copy] Copying 1 file to /home/continuum/continuum-1.0.2/apps/continuum/work/68/applications/demo/target/geronimo-demo/WEB-INF

java:prepare-filesystem:

java:compile:
    [echo] Compiling to /home/continuum/continuum-1.0.2/apps/continuum/work/68/applications/demo/target/classes
    [echo] No java source files to compile.

java:jar-resources:

test:prepare-filesystem:

test:test-resources:

test:compile:
    [echo] No test source files to compile.

test:test:
    [echo] NOTICE: Skipping tests; they seem to have passed already
    [echo] No tests to run.
Running post goal: test:test
00:09:37,818 INFO  [PostGoalTag] Running post goal: test:test

war:webapp:
    [echo] Assembling webapp geronimo-demo
Running post goal: war:webapp
00:09:38,132 INFO  [PostGoalTag] Running post goal: war:webapp
    [echo] Use classes.jar ? true

war:war:
    [echo] Building WAR geronimo-demo
    [jar] Building jar: /home/continuum/continuum-1.0.2/apps/continuum/work/68/applications/demo/target/geronimo-demo-1.1-SNAPSHOT.war

war:install:
    [echo] Installing...
Uploading to geronimo/wars/geronimo-demo-1.1-SNAPSHOT.war: 
.................... (4K)
Uploading to geronimo/poms/geronimo-demo-1.1-SNAPSHOT.pom: 
.................... (10K)

+----------------------------------------

build:end:

00:09:38,634 INFO  [ReactorTag] +----------------------------------------
| applications Geronimo :: JMX Debug Webapp
00:09:38,634 INFO  [ReactorTag] | applications Geronimo :: JMX Debug Webapp
| Memory: 33M/46M
00:09:38,634 INFO  [ReactorTag] | Memory: 33M/46M
+----------------------------------------
00:09:38,634 INFO  [ReactorTag] +----------------------------------------
DEPRECATED: the default goal should be specified in the <build> section of project.xml instead of maven.xml
00:09:38,656 WARN  [PluginScriptParser] DEPRECATED: the default goal should be specified in the <build> section of project.xml instead of maven.xml
DEPRECATED: the default goal should be specified in the <build> section of project.xml instead of maven.xml
00:09:38,657 WARN  [PluginScriptParser] DEPRECATED: the default goal should be specified in the <build> section of project.xml instead of maven.xml
build:start:

multiproject:install-callback:
    [echo] Running war:install for Geronimo :: JMX Debug Webapp
Tag library requested that is not present: 'caller' in plugin: 'maven-war-plugin-1.6.1'
00:09:39,042 WARN  [GoalToJellyScriptHousingMapper] Tag library requested that is not present: 'caller' in plugin: 'maven-war-plugin-1.6.1'
war:init:

war:war-resources:
    [copy] Copying 1 file to /home/continuum/continuum-1.0.2/apps/continuum/work/68/applications/jmxdebug/target/geronimo-jmxdebug/WEB-INF

java:prepare-filesystem:

java:compile:
<depend closure="false" srcdir="1.4" dump="false" destdir="/home/continuum/continuum-1.0.2/apps/continuum/work/68/applications/jmxdebug/target/classes"></depend>    [echo] Compiling to /home/continuum/continuum-1.0.2/apps/continuum/work/68/applications/jmxdebug/target/classes

java:jar-resources:

test:prepare-filesystem:

test:test-resources:

test:compile:
    [echo] No test source files to compile.

test:test:
    [echo] NOTICE: Skipping tests; they seem to have passed already
    [echo] No tests to run.
Running post goal: test:test
00:09:40,175 INFO  [PostGoalTag] Running post goal: test:test

war:webapp:
    [echo] Assembling webapp geronimo-jmxdebug
    [copy] Copying 11 files to /home/continuum/continuum-1.0.2/apps/continuum/work/68/applications/jmxdebug/target/geronimo-jmxdebug/WEB-INF/classes
Running post goal: war:webapp
00:09:40,607 INFO  [PostGoalTag] Running post goal: war:webapp
    [echo] Use classes.jar ? true
    [copy] Copying 11 files to /home/continuum/continuum-1.0.2/apps/continuum/work/68/applications/jmxdebug/target/work
    [jar] Building jar: /home/continuum/continuum-1.0.2/apps/continuum/work/68/applications/jmxdebug/target/geronimo-jmxdebug/WEB-INF/lib/classes.jar
    [delete] Deleting 11 files from /home/continuum/continuum-1.0.2/apps/continuum/work/68/applications/jmxdebug/target/geronimo-jmxdebug/WEB-INF/classes
    [delete] Deleted 8 directories from /home/continuum/continuum-1.0.2/apps/continuum/work/68/applications/jmxdebug/target/geronimo-jmxdebug/WEB-INF/classes
    [delete] Deleting 11 files from /home/continuum/continuum-1.0.2/apps/continuum/work/68/applications/jmxdebug/target/work
    [delete] Deleted 8 directories from /home/continuum/continuum-1.0.2/apps/continuum/work/68/applications/jmxdebug/target/work

war:war:
    [echo] Building WAR geronimo-jmxdebug
    [jar] Building jar: /home/continuum/continuum-1.0.2/apps/continuum/work/68/applications/jmxdebug/target/geronimo-jmxdebug-1.1-SNAPSHOT.war

war:install:
    [echo] Installing...
Uploading to geronimo/wars/geronimo-jmxdebug-1.1-SNAPSHOT.war: 
.................... (470K)
Uploading to geronimo/poms/geronimo-jmxdebug-1.1-SNAPSHOT.pom: 
.................... (10K)

+----------------------------------------

build:end:

00:09:41,549 INFO  [ReactorTag] +----------------------------------------
| applications Geronimo :: LDAP Demo Application
00:09:41,549 INFO  [ReactorTag] | applications Geronimo :: LDAP Demo Application
| Memory: 33M/46M
00:09:41,549 INFO  [ReactorTag] | Memory: 33M/46M
+----------------------------------------
00:09:41,549 INFO  [ReactorTag] +----------------------------------------
DEPRECATED: the default goal should be specified in the <build> section of project.xml instead of maven.xml
00:09:41,600 WARN  [PluginScriptParser] DEPRECATED: the default goal should be specified in the <build> section of project.xml instead of maven.xml
DEPRECATED: the default goal should be specified in the <build> section of project.xml instead of maven.xml
00:09:41,601 WARN  [PluginScriptParser] DEPRECATED: the default goal should be specified in the <build> section of project.xml instead of maven.xml
build:start:

multiproject:install-callback:
    [echo] Running war:install for Geronimo :: LDAP Demo Application
Tag library requested that is not present: 'caller' in plugin: 'maven-war-plugin-1.6.1'
00:09:41,983 WARN  [GoalToJellyScriptHousingMapper] Tag library requested that is not present: 'caller' in plugin: 'maven-war-plugin-1.6.1'
war:init:

war:war-resources:
    [copy] Copying 1 file to /home/continuum/continuum-1.0.2/apps/continuum/work/68/applications/ldap-realm-demo/target/geronimo-ldap-demo/WEB-INF

java:prepare-filesystem:

java:compile:
    [echo] Compiling to /home/continuum/continuum-1.0.2/apps/continuum/work/68/applications/ldap-realm-demo/target/classes
    [echo] No java source files to compile.

java:jar-resources:

test:prepare-filesystem:

test:test-resources:

test:compile:
    [echo] No test source files to compile.

test:test:
    [echo] NOTICE: Skipping tests; they seem to have passed already
    [echo] No tests to run.
Running post goal: test:test
00:09:42,927 INFO  [PostGoalTag] Running post goal: test:test

war:webapp:
    [echo] Assembling webapp geronimo-ldap-demo
Running post goal: war:webapp
00:09:43,242 INFO  [PostGoalTag] Running post goal: war:webapp
    [echo] Use classes.jar ? true

war:war:
    [echo] Building WAR geronimo-ldap-demo
    [jar] Building jar: /home/continuum/continuum-1.0.2/apps/continuum/work/68/applications/ldap-realm-demo/target/geronimo-ldap-demo-1.1-SNAPSHOT.war

war:install:
    [echo] Installing...
Uploading to geronimo/wars/geronimo-ldap-demo-1.1-SNAPSHOT.war: 
.................... (4K)
Uploading to geronimo/poms/geronimo-ldap-demo-1.1-SNAPSHOT.pom: 
.................... (10K)

+----------------------------------------

build:end:

00:09:43,753 INFO  [ReactorTag] +----------------------------------------
| applications Geronimo :: The Magic G Ball Sample Application
00:09:43,753 INFO  [ReactorTag] | applications Geronimo :: The Magic G Ball Sample Application
| Memory: 34M/46M
00:09:43,753 INFO  [ReactorTag] | Memory: 34M/46M
+----------------------------------------
00:09:43,753 INFO  [ReactorTag] +----------------------------------------
DEPRECATED: the default goal should be specified in the <build> section of project.xml instead of maven.xml
00:09:43,776 WARN  [PluginScriptParser] DEPRECATED: the default goal should be specified in the <build> section of project.xml instead of maven.xml
DEPRECATED: the default goal should be specified in the <build> section of project.xml instead of maven.xml
00:09:43,787 WARN  [PluginScriptParser] DEPRECATED: the default goal should be specified in the <build> section of project.xml instead of maven.xml
build:start:

multiproject:install-callback:
    [echo] Running war:install for Geronimo :: The Magic G Ball Sample Application
Tag library requested that is not present: 'caller' in plugin: 'maven-war-plugin-1.6.1'
00:09:44,220 WARN  [GoalToJellyScriptHousingMapper] Tag library requested that is not present: 'caller' in plugin: 'maven-war-plugin-1.6.1'
war:init:

war:war-resources:
    [copy] Copying 1 file to /home/continuum/continuum-1.0.2/apps/continuum/work/68/applications/magicGball/target/magicGball/WEB-INF

java:prepare-filesystem:

java:compile:
<depend closure="false" srcdir="1.4" dump="false" destdir="/home/continuum/continuum-1.0.2/apps/continuum/work/68/applications/magicGball/target/classes"></depend>    [echo] Compiling to /home/continuum/continuum-1.0.2/apps/continuum/work/68/applications/magicGball/target/classes

java:jar-resources:

test:prepare-filesystem:

test:test-resources:

test:compile:
    [echo] No test source files to compile.

test:test:
    [echo] NOTICE: Skipping tests; they seem to have passed already
    [echo] No tests to run.
Running post goal: test:test
00:09:45,249 INFO  [PostGoalTag] Running post goal: test:test

war:webapp:
    [echo] Assembling webapp magicGball
    [copy] Copying 1 file to /home/continuum/continuum-1.0.2/apps/continuum/work/68/applications/magicGball/target/magicGball/WEB-INF/classes
Running post goal: war:webapp
00:09:45,571 INFO  [PostGoalTag] Running post goal: war:webapp
    [echo] Use classes.jar ? true
    [copy] Copying 1 file to /home/continuum/continuum-1.0.2/apps/continuum/work/68/applications/magicGball/target/work
    [jar] Building jar: /home/continuum/continuum-1.0.2/apps/continuum/work/68/applications/magicGball/target/magicGball/WEB-INF/lib/classes.jar
    [delete] Deleting 1 files from /home/continuum/continuum-1.0.2/apps/continuum/work/68/applications/magicGball/target/magicGball/WEB-INF/classes
    [delete] Deleted 2 directories from /home/continuum/continuum-1.0.2/apps/continuum/work/68/applications/magicGball/target/magicGball/WEB-INF/classes
    [delete] Deleting 1 files from /home/continuum/continuum-1.0.2/apps/continuum/work/68/applications/magicGball/target/work
    [delete] Deleted 2 directories from /home/continuum/continuum-1.0.2/apps/continuum/work/68/applications/magicGball/target/work

war:war:
    [echo] Building WAR magicGball
    [jar] Building jar: /home/continuum/continuum-1.0.2/apps/continuum/work/68/applications/magicGball/target/magicGball-1.1-SNAPSHOT.war

war:install:
    [echo] Installing...
Uploading to geronimo/wars/magicGball-1.1-SNAPSHOT.war: 
.................... (2K)
Uploading to geronimo/poms/magicGball-1.1-SNAPSHOT.pom: 
.................... (10K)

+----------------------------------------

build:end:

00:09:46,193 INFO  [ReactorTag] +----------------------------------------
| applications Geronimo :: Remote Deploy GBean
00:09:46,193 INFO  [ReactorTag] | applications Geronimo :: Remote Deploy GBean
| Memory: 36M/46M
00:09:46,193 INFO  [ReactorTag] | Memory: 36M/46M
+----------------------------------------
00:09:46,193 INFO  [ReactorTag] +----------------------------------------
DEPRECATED: the default goal should be specified in the <build> section of project.xml instead of maven.xml
00:09:46,238 WARN  [PluginScriptParser] DEPRECATED: the default goal should be specified in the <build> section of project.xml instead of maven.xml
DEPRECATED: the default goal should be specified in the <build> section of project.xml instead of maven.xml
00:09:46,260 WARN  [PluginScriptParser] DEPRECATED: the default goal should be specified in the <build> section of project.xml instead of maven.xml
build:start:

multiproject:install-callback:
    [echo] Running jar:install for Geronimo :: Remote Deploy GBean
java:prepare-filesystem:

java:compile:
<depend closure="false" srcdir="1.4" dump="false" destdir="/home/continuum/continuum-1.0.2/apps/continuum/work/68/applications/remote-deploy-lib/target/classes"></depend>    [echo] Compiling to /home/continuum/continuum-1.0.2/apps/continuum/work/68/applications/remote-deploy-lib/target/classes

java:jar-resources:

test:prepare-filesystem:

test:test-resources:

test:compile:
    [echo] No test source files to compile.

test:test:
    [echo] NOTICE: Skipping tests; they seem to have passed already
    [echo] No tests to run.
Running post goal: test:test
00:09:47,429 INFO  [PostGoalTag] Running post goal: test:test

jar:jar:

jar:install:
    [echo] Installing...
Uploading to geronimo/jars/geronimo-remote-deploy-lib-1.1-SNAPSHOT.jar: 
.................... (6K)
Uploading to geronimo/poms/geronimo-remote-deploy-lib-1.1-SNAPSHOT.pom: 
.................... (10K)

+----------------------------------------

build:end:

00:09:47,709 INFO  [ReactorTag] +----------------------------------------
| applications Geronimo :: Remote Deploy Application
00:09:47,710 INFO  [ReactorTag] | applications Geronimo :: Remote Deploy Application
| Memory: 34M/46M
00:09:47,710 INFO  [ReactorTag] | Memory: 34M/46M
+----------------------------------------
00:09:47,710 INFO  [ReactorTag] +----------------------------------------
DEPRECATED: the default goal should be specified in the <build> section of project.xml instead of maven.xml
00:09:47,735 WARN  [PluginScriptParser] DEPRECATED: the default goal should be specified in the <build> section of project.xml instead of maven.xml
DEPRECATED: the default goal should be specified in the <build> section of project.xml instead of maven.xml
00:09:47,736 WARN  [PluginScriptParser] DEPRECATED: the default goal should be specified in the <build> section of project.xml instead of maven.xml
Attempting to download geronimo-remote-deploy-lib-1.1-SNAPSHOT.jar.
00:09:48,033 INFO  [DependencyVerifier] Attempting to download geronimo-remote-deploy-lib-1.1-SNAPSHOT.jar.
build:start:

multiproject:install-callback:
    [echo] Running war:install for Geronimo :: Remote Deploy Application
Tag library requested that is not present: 'caller' in plugin: 'maven-war-plugin-1.6.1'
00:09:49,039 WARN  [GoalToJellyScriptHousingMapper] Tag library requested that is not present: 'caller' in plugin: 'maven-war-plugin-1.6.1'
war:init:

war:war-resources:
    [copy] Copying 1 file to /home/continuum/continuum-1.0.2/apps/continuum/work/68/applications/remote-deploy/target/geronimo-remote-deploy/WEB-INF

java:prepare-filesystem:

java:compile:
<depend closure="false" srcdir="1.4" dump="false" destdir="/home/continuum/continuum-1.0.2/apps/continuum/work/68/applications/remote-deploy/target/classes"></depend>    [echo] Compiling to /home/continuum/continuum-1.0.2/apps/continuum/work/68/applications/remote-deploy/target/classes

java:jar-resources:

test:prepare-filesystem:

test:test-resources:

test:compile:
    [echo] No test source files to compile.

test:test:
    [echo] NOTICE: Skipping tests; they seem to have passed already
    [echo] No tests to run.
Running post goal: test:test
00:09:50,033 INFO  [PostGoalTag] Running post goal: test:test

war:webapp:
    [echo] Assembling webapp geronimo-remote-deploy
    [copy] Copying 2 files to /home/continuum/continuum-1.0.2/apps/continuum/work/68/applications/remote-deploy/target/geronimo-remote-deploy/WEB-INF/classes
Running post goal: war:webapp
00:09:50,381 INFO  [PostGoalTag] Running post goal: war:webapp
    [echo] Use classes.jar ? true
    [copy] Copying 2 files to /home/continuum/continuum-1.0.2/apps/continuum/work/68/applications/remote-deploy/target/work
    [jar] Building jar: /home/continuum/continuum-1.0.2/apps/continuum/work/68/applications/remote-deploy/target/geronimo-remote-deploy/WEB-INF/lib/classes.jar
    [delete] Deleting 2 files from /home/continuum/continuum-1.0.2/apps/continuum/work/68/applications/remote-deploy/target/geronimo-remote-deploy/WEB-INF/classes
    [delete] Deleted 5 directories from /home/continuum/continuum-1.0.2/apps/continuum/work/68/applications/remote-deploy/target/geronimo-remote-deploy/WEB-INF/classes
    [delete] Deleting 2 files from /home/continuum/continuum-1.0.2/apps/continuum/work/68/applications/remote-deploy/target/work
    [delete] Deleted 5 directories from /home/continuum/continuum-1.0.2/apps/continuum/work/68/applications/remote-deploy/target/work

war:war:
    [echo] Building WAR geronimo-remote-deploy
    [jar] Building jar: /home/continuum/continuum-1.0.2/apps/continuum/work/68/applications/remote-deploy/target/geronimo-remote-deploy-1.1-SNAPSHOT.war

war:install:
    [echo] Installing...
Uploading to geronimo/wars/geronimo-remote-deploy-1.1-SNAPSHOT.war: 
.................... (4K)
Uploading to geronimo/poms/geronimo-remote-deploy-1.1-SNAPSHOT.pom: 
.................... (11K)

+----------------------------------------

build:end:

00:09:51,007 INFO  [ReactorTag] +----------------------------------------
| applications Geronimo :: UDDI-Server database
00:09:51,008 INFO  [ReactorTag] | applications Geronimo :: UDDI-Server database
| Memory: 36M/46M
00:09:51,008 INFO  [ReactorTag] | Memory: 36M/46M
+----------------------------------------
00:09:51,008 INFO  [ReactorTag] +----------------------------------------
DEPRECATED: the default goal should be specified in the <build> section of project.xml instead of maven.xml
00:09:51,028 WARN  [PluginScriptParser] DEPRECATED: the default goal should be specified in the <build> section of project.xml instead of maven.xml
DEPRECATED: the default goal should be specified in the <build> section of project.xml instead of maven.xml
00:09:51,030 WARN  [PluginScriptParser] DEPRECATED: the default goal should be specified in the <build> section of project.xml instead of maven.xml
build:start:

multiproject:install-callback:
    [echo] Running jar:install for Geronimo :: UDDI-Server database
java:prepare-filesystem:
init-database:
    [delete] Deleting directory /home/continuum/continuum-1.0.2/apps/continuum/work/68/applications/uddi-db/target/resources/META-INF/geronimo-uddi-db/var/derby
    [mkdir] Created dir: /home/continuum/continuum-1.0.2/apps/continuum/work/68/applications/uddi-db/target/resources/META-INF/geronimo-uddi-db/var/derby
    [sql] Executing file: /home/continuum/continuum-1.0.2/apps/continuum/work/68/applications/uddi-db/src/sql/juddi.sql
    [sql] 87 of 87 SQL statements executed successfully


java:compile:
    [echo] Compiling to /home/continuum/continuum-1.0.2/apps/continuum/work/68/applications/uddi-db/target/classes
    [echo] No java source files to compile.

java:jar-resources:
Copying 142 files to /home/continuum/continuum-1.0.2/apps/continuum/work/68/applications/uddi-db/target/classes

test:prepare-filesystem:

test:test-resources:

test:compile:
    [echo] No test source files to compile.

test:test:
    [echo] NOTICE: Skipping tests; they seem to have passed already
    [echo] No tests to run.
Running post goal: test:test
00:09:58,420 INFO  [PostGoalTag] Running post goal: test:test

jar:jar:
    [jar] Building jar: /home/continuum/continuum-1.0.2/apps/continuum/work/68/applications/uddi-db/target/geronimo-uddi-db-1.1-SNAPSHOT.jar

jar:install:
    [echo] Installing...
Uploading to geronimo/jars/geronimo-uddi-db-1.1-SNAPSHOT.jar: 
.................... (140K)
Uploading to geronimo/poms/geronimo-uddi-db-1.1-SNAPSHOT.pom: 
.................... (10K)

+----------------------------------------

build:end:

00:09:59,001 INFO  [ReactorTag] +----------------------------------------
| applications Geronimo :: UDDI-Server
00:09:59,001 INFO  [ReactorTag] | applications Geronimo :: UDDI-Server
| Memory: 38M/46M
00:09:59,001 INFO  [ReactorTag] | Memory: 38M/46M
+----------------------------------------
00:09:59,001 INFO  [ReactorTag] +----------------------------------------
DEPRECATED: the default goal should be specified in the <build> section of project.xml instead of maven.xml
00:09:59,030 WARN  [PluginScriptParser] DEPRECATED: the default goal should be specified in the <build> section of project.xml instead of maven.xml
DEPRECATED: the default goal should be specified in the <build> section of project.xml instead of maven.xml
00:09:59,031 WARN  [PluginScriptParser] DEPRECATED: the default goal should be specified in the <build> section of project.xml instead of maven.xml
build:start:

multiproject:install-callback:
    [echo] Running war:install for Geronimo :: UDDI-Server
Tag library requested that is not present: 'caller' in plugin: 'maven-war-plugin-1.6.1'
00:09:59,416 WARN  [GoalToJellyScriptHousingMapper] Tag library requested that is not present: 'caller' in plugin: 'maven-war-plugin-1.6.1'
war:init:

war:war-resources:
    [copy] Copying 1 file to /home/continuum/continuum-1.0.2/apps/continuum/work/68/applications/uddi-server/target/geronimo-uddi-server/WEB-INF

java:prepare-filesystem:

java:compile:
    [echo] Compiling to /home/continuum/continuum-1.0.2/apps/continuum/work/68/applications/uddi-server/target/classes
    [echo] No java source files to compile.

java:jar-resources:

test:prepare-filesystem:

test:test-resources:

test:compile:
    [echo] No test source files to compile.

test:test:
    [echo] NOTICE: Skipping tests; they seem to have passed already
    [echo] No tests to run.
Running post goal: test:test
00:10:00,301 INFO  [PostGoalTag] Running post goal: test:test

war:webapp:
    [echo] Assembling webapp geronimo-uddi-server
Running post goal: war:webapp
00:10:00,617 INFO  [PostGoalTag] Running post goal: war:webapp
    [echo] Use classes.jar ? true

war:war:
    [echo] Building WAR geronimo-uddi-server
    [jar] Building jar: /home/continuum/continuum-1.0.2/apps/continuum/work/68/applications/uddi-server/target/geronimo-uddi-server-1.1-SNAPSHOT.war

war:install:
    [echo] Installing...
Uploading to geronimo/wars/geronimo-uddi-server-1.1-SNAPSHOT.war: 
.................... (5K)
Uploading to geronimo/poms/geronimo-uddi-server-1.1-SNAPSHOT.pom: 
.................... (10K)

+----------------------------------------

build:end:

00:10:01,311 INFO  [ReactorTag] +----------------------------------------
| applications Geronimo :: Welcome Application
00:10:01,311 INFO  [ReactorTag] | applications Geronimo :: Welcome Application
| Memory: 38M/46M
00:10:01,311 INFO  [ReactorTag] | Memory: 38M/46M
+----------------------------------------
00:10:01,312 INFO  [ReactorTag] +----------------------------------------
DEPRECATED: the default goal should be specified in the <build> section of project.xml instead of maven.xml
00:10:01,361 WARN  [PluginScriptParser] DEPRECATED: the default goal should be specified in the <build> section of project.xml instead of maven.xml
DEPRECATED: the default goal should be specified in the <build> section of project.xml instead of maven.xml
00:10:01,362 WARN  [PluginScriptParser] DEPRECATED: the default goal should be specified in the <build> section of project.xml instead of maven.xml
build:start:

multiproject:install-callback:
    [echo] Running war:install for Geronimo :: Welcome Application
Tag library requested that is not present: 'caller' in plugin: 'maven-war-plugin-1.6.1'
00:10:01,745 WARN  [GoalToJellyScriptHousingMapper] Tag library requested that is not present: 'caller' in plugin: 'maven-war-plugin-1.6.1'
war:init:

war:war-resources:
    [copy] Copying 1 file to /home/continuum/continuum-1.0.2/apps/continuum/work/68/applications/welcome/target/geronimo-welcome/WEB-INF

java:prepare-filesystem:

java:compile:
    [echo] Compiling to /home/continuum/continuum-1.0.2/apps/continuum/work/68/applications/welcome/target/classes
    [echo] No java source files to compile.

java:jar-resources:

test:prepare-filesystem:

test:test-resources:

test:compile:
    [echo] No test source files to compile.

test:test:
    [echo] NOTICE: Skipping tests; they seem to have passed already
    [echo] No tests to run.
Running post goal: test:test
00:10:02,815 INFO  [PostGoalTag] Running post goal: test:test

war:webapp:
    [echo] Assembling webapp geronimo-welcome
Running post goal: war:webapp
00:10:03,134 INFO  [PostGoalTag] Running post goal: war:webapp
    [echo] Use classes.jar ? true

war:war:
    [echo] Building WAR geronimo-welcome
    [jar] Building jar: /home/continuum/continuum-1.0.2/apps/continuum/work/68/applications/welcome/target/geronimo-welcome-1.1-SNAPSHOT.war

war:install:
    [echo] Installing...
Uploading to geronimo/wars/geronimo-welcome-1.1-SNAPSHOT.war: 
.................... (33K)
Uploading to geronimo/poms/geronimo-welcome-1.1-SNAPSHOT.pom: 
.................... (10K)


build:end:


Starting the reactor...
new4:
00:10:03,662 INFO  [ReactorTag] Starting the reactor...
Our processing order:
00:10:09,829 INFO  [ReactorTag] Our processing order:
Geronimo Configuration for performing service deployments
00:10:09,829 INFO  [ReactorTag] Geronimo Configuration for performing service deployments
System Configuration for the J2EE Server
00:10:09,829 INFO  [ReactorTag] System Configuration for the J2EE Server
RMI/Naming configuration
00:10:09,829 INFO  [ReactorTag] RMI/Naming configuration
Server Configuration for the J2EE Server
00:10:09,829 INFO  [ReactorTag] Server Configuration for the J2EE Server
System Configuration for the J2EE Client
00:10:09,830 INFO  [ReactorTag] System Configuration for the J2EE Client
Configuration for the J2EE Client
00:10:09,830 INFO  [ReactorTag] Configuration for the J2EE Client
Configuration for performing J2EE deployments
00:10:09,830 INFO  [ReactorTag] Configuration for performing J2EE deployments
System Database Configuration for the J2EE Server
00:10:09,830 INFO  [ReactorTag] System Database Configuration for the J2EE Server
ActiveMQ broker configuration
00:10:09,830 INFO  [ReactorTag] ActiveMQ broker configuration
Activemq configuration
00:10:09,830 INFO  [ReactorTag] Activemq configuration
Corba Configuration for the J2EE Client
00:10:09,830 INFO  [ReactorTag] Corba Configuration for the J2EE Client
Security Configuration for the J2EE Client
00:10:09,831 INFO  [ReactorTag] Security Configuration for the J2EE Client
Security Configuration for the J2EE Server
00:10:09,831 INFO  [ReactorTag] Security Configuration for the J2EE Server
Jetty Configuration for the J2EE Server
00:10:09,831 INFO  [ReactorTag] Jetty Configuration for the J2EE Server
Jetty Deployer Configuration for the J2EE Server
00:10:09,831 INFO  [ReactorTag] Jetty Deployer Configuration for the J2EE Server
Web console deployed on jetty
00:10:09,831 INFO  [ReactorTag] Web console deployed on jetty
Tomcat Configuration for the J2EE Server
00:10:09,831 INFO  [ReactorTag] Tomcat Configuration for the J2EE Server
Tomcat Deployer Configuration for the J2EE Server
00:10:09,831 INFO  [ReactorTag] Tomcat Deployer Configuration for the J2EE Server
Web console deployed on tomcat
00:10:09,831 INFO  [ReactorTag] Web console deployed on tomcat
Daytrader using derby deployed on jetty
00:10:09,832 INFO  [ReactorTag] Daytrader using derby deployed on jetty
Daytrader using derby deployed on tomcat
00:10:09,832 INFO  [ReactorTag] Daytrader using derby deployed on tomcat
Directory Configuration
00:10:09,832 INFO  [ReactorTag] Directory Configuration
Hot deployer
00:10:09,832 INFO  [ReactorTag] Hot deployer
Corba Configuration for the J2EE Server
00:10:09,832 INFO  [ReactorTag] Corba Configuration for the J2EE Server
JavaMail
00:10:09,832 INFO  [ReactorTag] JavaMail
JMX Debug app for Jetty
00:10:09,832 INFO  [ReactorTag] JMX Debug app for Jetty
JMX Debug app Tomcat
00:10:09,833 INFO  [ReactorTag] JMX Debug app Tomcat
JSP Examples for Jetty
00:10:09,833 INFO  [ReactorTag] JSP Examples for Jetty
JSP Examples Tomcat
00:10:09,833 INFO  [ReactorTag] JSP Examples Tomcat
LDAP security realm
00:10:09,833 INFO  [ReactorTag] LDAP security realm
LDAP Demo for Jetty
00:10:09,833 INFO  [ReactorTag] LDAP Demo for Jetty
LDAP Demo for Tomcat
00:10:09,833 INFO  [ReactorTag] LDAP Demo for Tomcat
Online Deployer
00:10:09,833 INFO  [ReactorTag] Online Deployer
Geronimo :: Remote Deploy Jetty Application
00:10:09,833 INFO  [ReactorTag] Geronimo :: Remote Deploy Jetty Application
Geronimo :: Remote Deploy Tomcat Application
00:10:09,834 INFO  [ReactorTag] Geronimo :: Remote Deploy Tomcat Application
Servlet Examples for Jetty
00:10:09,834 INFO  [ReactorTag] Servlet Examples for Jetty
Servlet Examples Tomcat
00:10:09,834 INFO  [ReactorTag] Servlet Examples Tomcat
Shared Library GBean
00:10:09,834 INFO  [ReactorTag] Shared Library GBean
Shutdown
00:10:09,834 INFO  [ReactorTag] Shutdown
UDDI server Configuration for the J2EE Jetty Server
00:10:09,834 INFO  [ReactorTag] UDDI server Configuration for the J2EE Jetty Server
UDDI server Configuration for the J2EE Tomcat Server
00:10:09,834 INFO  [ReactorTag] UDDI server Configuration for the J2EE Tomcat Server
Configuration for no j2ee app clients
00:10:09,835 INFO  [ReactorTag] Configuration for no j2ee app clients
Configuration for no EJBs
00:10:09,835 INFO  [ReactorTag] Configuration for no EJBs
Unavailable Web Services deployer
00:10:09,835 INFO  [ReactorTag] Unavailable Web Services deployer
Welcome app for Jetty
00:10:09,835 INFO  [ReactorTag] Welcome app for Jetty
Welcome app Tomcat
00:10:09,835 INFO  [ReactorTag] Welcome app Tomcat
+----------------------------------------
00:10:09,835 INFO  [ReactorTag] +----------------------------------------
| configurations Geronimo Configuration for performing service deployments
00:10:09,835 INFO  [ReactorTag] | configurations Geronimo Configuration for performing service deployments
| Memory: 39M/60M
00:10:09,835 INFO  [ReactorTag] | Memory: 39M/60M
+----------------------------------------
00:10:09,836 INFO  [ReactorTag] +----------------------------------------
DEPRECATED: the default goal should be specified in the <build> section of project.xml instead of maven.xml
00:10:09,870 WARN  [PluginScriptParser] DEPRECATED: the default goal should be specified in the <build> section of project.xml instead of maven.xml
DEPRECATED: the default goal should be specified in the <build> section of project.xml instead of maven.xml
00:10:09,874 WARN  [PluginScriptParser] DEPRECATED: the default goal should be specified in the <build> section of project.xml instead of maven.xml
build:start:

multiproject:install-callback:
    [echo] Running car:install for Geronimo Configuration for performing service deployments
car:prepare-plan:

car:package:

    Packaging configuration /home/continuum/continuum-1.0.2/apps/continuum/work/68/configs/geronimo-gbean-deployer/target/plan/plan.xml


car:install:
    [echo] Installing...
Uploading to geronimo/cars/geronimo-gbean-deployer-1.1-SNAPSHOT.car: 
.................... (3K)
Uploading to geronimo/poms/geronimo-gbean-deployer-1.1-SNAPSHOT.pom: 
.................... (13K)

+----------------------------------------

build:end:

00:10:11,228 INFO  [ReactorTag] +----------------------------------------
| configurations System Configuration for the J2EE Server
00:10:11,228 INFO  [ReactorTag] | configurations System Configuration for the J2EE Server
| Memory: 41M/60M
00:10:11,229 INFO  [ReactorTag] | Memory: 41M/60M
+----------------------------------------
00:10:11,229 INFO  [ReactorTag] +----------------------------------------
DEPRECATED: the default goal should be specified in the <build> section of project.xml instead of maven.xml
00:10:11,265 WARN  [PluginScriptParser] DEPRECATED: the default goal should be specified in the <build> section of project.xml instead of maven.xml
DEPRECATED: the default goal should be specified in the <build> section of project.xml instead of maven.xml
00:10:11,267 WARN  [PluginScriptParser] DEPRECATED: the default goal should be specified in the <build> section of project.xml instead of maven.xml
Attempting to download geronimo-gbean-deployer-1.1-SNAPSHOT.car.
00:10:11,600 INFO  [DependencyVerifier] Attempting to download geronimo-gbean-deployer-1.1-SNAPSHOT.car.
build:start:

multiproject:install-callback:
    [echo] Running car:install for System Configuration for the J2EE Server

    Packaging configuration /home/continuum/continuum-1.0.2/apps/continuum/work/68/configs/j2ee-system/target/plan/plan.xml

0 [main] DEBUG org.apache.geronimo.kernel.basic.BasicKernel  - Starting boot
277 [main] DEBUG org.apache.geronimo.gbean.runtime.GBeanInstanceState  - GBeanInstanceState for: geronimo/boot/none/car?role=kernel State changed from stopped to starting
278 [main] DEBUG org.apache.geronimo.gbean.runtime.GBeanInstanceState  - GBeanInstanceState for: geronimo/boot/none/car?role=kernel State changed from starting to running
278 [main] DEBUG org.apache.geronimo.kernel.basic.BasicKernel  - Booted
384 [main] DEBUG org.apache.geronimo.gbean.runtime.GBeanInstanceState  - GBeanInstanceState for: geronimo/packaging/fixed/car?configurationName=geronimo/packaging/fixed/car State changed from stopped to starting
385 [main] DEBUG org.apache.geronimo.kernel.config.Configuration  - ClassPath for geronimo/packaging/fixed/car resolved to []
387 [main] DEBUG org.apache.geronimo.kernel.config.Configuration  - Started configuration geronimo/packaging/fixed/car
387 [main] DEBUG org.apache.geronimo.gbean.runtime.GBeanInstanceState  - GBeanInstanceState for: geronimo/packaging/fixed/car?configurationName=geronimo/packaging/fixed/car State changed from starting to running
492 [main] DEBUG org.apache.geronimo.gbean.runtime.GBeanInstanceState  - GBeanInstanceState for: geronimo/packaging/fixed/car?j2eeType=ConfigurationStore,name=ConfigStore State changed from stopped to starting
492 [main] DEBUG org.apache.geronimo.gbean.runtime.GBeanSingleReference  - Waiting to start geronimo/packaging/fixed/car?j2eeType=ConfigurationStore,name=ConfigStore because no targets are running for reference Repository matching the patterns geronimo/packaging/fixed/car?j2eeType=Repository,name=Repository
492 [main] DEBUG org.apache.geronimo.gbean.runtime.GBeanInstanceState  - GBeanInstanceState for: geronimo/packaging/fixed/car?j2eeType=ArtifactResolver,name=ArtifactResolver State changed from stopped to starting
492 [main] DEBUG org.apache.geronimo.gbean.runtime.GBeanSingleReference  - Waiting to start geronimo/packaging/fixed/car?j2eeType=ArtifactResolver,name=ArtifactResolver because no targets are running for reference ArtifactManager matching the patterns geronimo/packaging/fixed/car?j2eeType=ArtifactManager,name=ArtifactManager
554 [main] DEBUG org.apache.geronimo.gbean.runtime.GBeanInstanceState  - GBeanInstanceState for: geronimo/packaging/fixed/car?j2eeType=ArtifactManager,name=ArtifactManager State changed from stopped to starting
554 [main] DEBUG org.apache.geronimo.gbean.runtime.GBeanInstanceState  - GBeanInstanceState for: geronimo/packaging/fixed/car?j2eeType=ArtifactManager,name=ArtifactManager State changed from starting to running
554 [main] DEBUG org.apache.geronimo.gbean.runtime.GBeanInstanceState  - GBeanInstanceState for: geronimo/packaging/fixed/car?j2eeType=ConfigurationManager,name=ConfigManager State changed from stopped to starting
555 [main] DEBUG org.apache.geronimo.gbean.runtime.GBeanSingleReference  - Waiting to start geronimo/packaging/fixed/car?j2eeType=ConfigurationManager,name=ConfigManager because no targets are running for reference ArtifactResolver matching the patterns geronimo/packaging/fixed/car?j2eeType=ArtifactResolver,name=ArtifactResolver
635 [main] DEBUG org.apache.geronimo.gbean.runtime.GBeanSingleReference  - Waiting to start geronimo/packaging/fixed/car?j2eeType=ConfigurationManager,name=ConfigManager because no targets are running for reference AttributeStore matching the patterns geronimo/packaging/fixed/car?j2eeType=GBean,name=AttributeStore
635 [main] DEBUG org.apache.geronimo.gbean.runtime.GBeanInstanceState  - Checking if parent is running: parent=geronimo/packaging/fixed/car?configurationName=geronimo/packaging/fixed/car
635 [main] DEBUG org.apache.geronimo.gbean.runtime.GBeanInstanceState  - Parent is running: parent=geronimo/packaging/fixed/car?configurationName=geronimo/packaging/fixed/car
636 [main] DEBUG org.apache.geronimo.gbean.runtime.GBeanInstanceState  - GBeanInstanceState for: geronimo/packaging/fixed/car?j2eeType=ArtifactResolver,name=ArtifactResolver State changed from starting to running
636 [main] DEBUG org.apache.geronimo.gbean.runtime.GBeanInstanceState  - Checking if parent is running: parent=geronimo/packaging/fixed/car?configurationName=geronimo/packaging/fixed/car
637 [main] DEBUG org.apache.geronimo.gbean.runtime.GBeanInstanceState  - Parent is running: parent=geronimo/packaging/fixed/car?configurationName=geronimo/packaging/fixed/car
637 [main] DEBUG org.apache.geronimo.gbean.runtime.GBeanInstanceState  - Checking if parent is running: parent=geronimo/packaging/fixed/car?j2eeType=ArtifactManager,name=ArtifactManager
637 [main] DEBUG org.apache.geronimo.gbean.runtime.GBeanInstanceState  - Parent is running: parent=geronimo/packaging/fixed/car?j2eeType=ArtifactManager,name=ArtifactManager
664 [main] DEBUG org.apache.geronimo.gbean.runtime.GBeanSingleReference  - Waiting to start geronimo/packaging/fixed/car?j2eeType=ConfigurationManager,name=ConfigManager because no targets are running for reference AttributeStore matching the patterns geronimo/packaging/fixed/car?j2eeType=GBean,name=AttributeStore
664 [main] DEBUG org.apache.geronimo.gbean.runtime.GBeanInstanceState  - GBeanInstanceState for: geronimo/packaging/fixed/car?j2eeType=GBean,name=AttributeStore State changed from stopped to starting
664 [main] DEBUG org.apache.geronimo.gbean.runtime.GBeanInstanceState  - GBeanInstanceState for: geronimo/packaging/fixed/car?j2eeType=GBean,name=AttributeStore State changed from starting to running
664 [main] DEBUG org.apache.geronimo.gbean.runtime.GBeanInstanceState  - Checking if parent is running: parent=geronimo/packaging/fixed/car?configurationName=geronimo/packaging/fixed/car
664 [main] DEBUG org.apache.geronimo.gbean.runtime.GBeanInstanceState  - Parent is running: parent=geronimo/packaging/fixed/car?configurationName=geronimo/packaging/fixed/car
665 [main] DEBUG org.apache.geronimo.gbean.runtime.GBeanInstanceState  - Checking if parent is running: parent=geronimo/packaging/fixed/car?j2eeType=ArtifactResolver,name=ArtifactResolver
665 [main] DEBUG org.apache.geronimo.gbean.runtime.GBeanInstanceState  - Parent is running: parent=geronimo/packaging/fixed/car?j2eeType=ArtifactResolver,name=ArtifactResolver
665 [main] DEBUG org.apache.geronimo.gbean.runtime.GBeanInstanceState  - Checking if parent is running: parent=geronimo/packaging/fixed/car?j2eeType=ArtifactManager,name=ArtifactManager
665 [main] DEBUG org.apache.geronimo.gbean.runtime.GBeanInstanceState  - Parent is running: parent=geronimo/packaging/fixed/car?j2eeType=ArtifactManager,name=ArtifactManager
694 [main] DEBUG org.apache.geronimo.gbean.runtime.GBeanInstanceState  - GBeanInstanceState for: geronimo/packaging/fixed/car?j2eeType=ConfigurationManager,name=ConfigManager State changed from starting to running
694 [main] DEBUG org.apache.geronimo.gbean.runtime.GBeanInstanceState  - GBeanInstanceState for: geronimo/packaging/fixed/car?j2eeType=Repository,name=Repository State changed from stopped to starting
695 [main] DEBUG org.apache.geronimo.system.repository.AbstractRepository  - Repository root is /home/continuum/.geronimo-1.1-maven/repository
696 [main] DEBUG org.apache.geronimo.gbean.runtime.GBeanInstanceState  - GBeanInstanceState for: geronimo/packaging/fixed/car?j2eeType=Repository,name=Repository State changed from starting to running
702 [main] DEBUG org.apache.geronimo.gbean.runtime.GBeanInstanceState  - Checking if parent is running: parent=geronimo/packaging/fixed/car?configurationName=geronimo/packaging/fixed/car
702 [main] DEBUG org.apache.geronimo.gbean.runtime.GBeanInstanceState  - Parent is running: parent=geronimo/packaging/fixed/car?configurationName=geronimo/packaging/fixed/car
727 [main] DEBUG org.apache.geronimo.gbean.runtime.GBeanInstanceState  - GBeanInstanceState for: geronimo/packaging/fixed/car?j2eeType=ConfigurationStore,name=ConfigStore State changed from starting to running
java.lang.reflect.InvocationTargetException: null
java.lang.reflect.InvocationTargetException
	at sun.reflect.NativeMethodAccessorImpl.invoke0(Native Method)
	at sun.reflect.NativeMethodAccessorImpl.invoke(NativeMethodAccessorImpl.java:39)
	at sun.reflect.DelegatingMethodAccessorImpl.invoke(DelegatingMethodAccessorImpl.java:25)
	at java.lang.reflect.Method.invoke(Method.java:324)
	at org.apache.geronimo.plugin.packaging.PackageBuilderShell.execute(PackageBuilderShell.java:220)
	at sun.reflect.NativeMethodAccessorImpl.invoke0(Native Method)
	at sun.reflect.NativeMethodAccessorImpl.invoke(NativeMethodAccessorImpl.java:39)
	at sun.reflect.DelegatingMethodAccessorImpl.invoke(DelegatingMethodAccessorImpl.java:25)
	at java.lang.reflect.Method.invoke(Method.java:324)
	at org.apache.commons.jelly.impl.DynamicBeanTag.doTag(DynamicBeanTag.java:180)
	at org.apache.commons.jelly.impl.StaticTagScript.run(StaticTagScript.java:102)
	at org.apache.commons.jelly.impl.ScriptBlock.run(ScriptBlock.java:95)
	at org.apache.maven.jelly.tags.werkz.MavenGoalTag.runBodyTag(MavenGoalTag.java:78)
	at org.apache.maven.jelly.tags.werkz.MavenGoalTag$MavenGoalAction.performAction(MavenGoalTag.java:109)
	at org.apache.maven.werkz.Goal.fire(Goal.java:656)
	at org.apache.maven.werkz.Goal.attain(Goal.java:592)
	at org.apache.maven.werkz.Goal.attainPrecursors(Goal.java:505)
	at org.apache.maven.werkz.Goal.attain(Goal.java:590)
	at org.apache.maven.werkz.WerkzProject.attainGoal(WerkzProject.java:210)
	at org.apache.maven.jelly.tags.werkz.MavenAttainGoalTag.doTag(MavenAttainGoalTag.java:114)
	at org.apache.commons.jelly.impl.TagScript.run(TagScript.java:247)
	at org.apache.commons.jelly.impl.ScriptBlock.run(ScriptBlock.java:95)
	at org.apache.maven.jelly.tags.werkz.MavenGoalTag.runBodyTag(MavenGoalTag.java:78)
	at org.apache.maven.jelly.tags.werkz.MavenGoalTag$MavenGoalAction.performAction(MavenGoalTag.java:109)
	at org.apache.maven.werkz.Goal.fire(Goal.java:656)
	at org.apache.maven.werkz.Goal.attain(Goal.java:592)
	at org.apache.maven.plugin.PluginManager.attainGoals(PluginManager.java:693)
	at org.apache.maven.MavenSession.attainGoals(MavenSession.java:263)
	at org.apache.maven.jelly.tags.maven.ReactorTag.doTag(ReactorTag.java:368)
	at org.apache.commons.jelly.impl.TagScript.run(TagScript.java:247)
	at org.apache.commons.jelly.impl.ScriptBlock.run(ScriptBlock.java:95)
	at org.apache.maven.jelly.tags.werkz.MavenGoalTag.runBodyTag(MavenGoalTag.java:78)
	at org.apache.maven.jelly.tags.werkz.MavenGoalTag$MavenGoalAction.performAction(MavenGoalTag.java:109)
	at org.apache.maven.werkz.Goal.fire(Goal.java:656)
	at org.apache.maven.werkz.Goal.attain(Goal.java:592)
	at org.apache.maven.werkz.WerkzProject.attainGoal(WerkzProject.java:210)
	at org.apache.maven.jelly.tags.werkz.MavenAttainGoalTag.doTag(MavenAttainGoalTag.java:114)
	at org.apache.commons.jelly.impl.TagScript.run(TagScript.java:247)
	at org.apache.commons.jelly.impl.ScriptBlock.run(ScriptBlock.java:95)
	at org.apache.maven.jelly.tags.werkz.MavenGoalTag.runBodyTag(MavenGoalTag.java:78)
	at org.apache.maven.jelly.tags.werkz.MavenGoalTag$MavenGoalAction.performAction(MavenGoalTag.java:109)
	at org.apache.maven.werkz.Goal.fire(Goal.java:656)
	at org.apache.maven.werkz.Goal.attain(Goal.java:592)
	at org.apache.maven.plugin.PluginManager.attainGoals(PluginManager.java:693)
	at org.apache.maven.MavenSession.attainGoals(MavenSession.java:263)
	at org.apache.maven.cli.App.doMain(App.java:511)
	at org.apache.maven.cli.App.main(App.java:1258)
	at sun.reflect.NativeMethodAccessorImpl.invoke0(Native Method)
	at sun.reflect.NativeMethodAccessorImpl.invoke(NativeMethodAccessorImpl.java:39)
	at sun.reflect.DelegatingMethodAccessorImpl.invoke(DelegatingMethodAccessorImpl.java:25)
	at java.lang.reflect.Method.invoke(Method.java:324)
	at com.werken.forehead.Forehead.run(Forehead.java:551)
	at com.werken.forehead.Forehead.main(Forehead.java:581)
Caused by: java.lang.NoSuchMethodError: org.apache.geronimo.kernel.config.ConfigurationManager.loadConfiguration(Lorg/apache/geronimo/kernel/repository/Artifact;)V
	at org.apache.geronimo.plugin.packaging.PackageBuilder.execute(PackageBuilder.java:240)
	... 53 more
car:prepare-plan:

car:package:
00:10:14,018 ERROR [PlanProcessor] java.lang.reflect.InvocationTargetException: null
java.lang.reflect.InvocationTargetException
	at sun.reflect.NativeMethodAccessorImpl.invoke0(Native Method)
	at sun.reflect.NativeMethodAccessorImpl.invoke(NativeMethodAccessorImpl.java:39)
	at sun.reflect.DelegatingMethodAccessorImpl.invoke(DelegatingMethodAccessorImpl.java:25)
	at java.lang.reflect.Method.invoke(Method.java:324)
	at org.apache.geronimo.plugin.packaging.PackageBuilderShell.execute(PackageBuilderShell.java:220)
	at sun.reflect.NativeMethodAccessorImpl.invoke0(Native Method)
	at sun.reflect.NativeMethodAccessorImpl.invoke(NativeMethodAccessorImpl.java:39)
	at sun.reflect.DelegatingMethodAccessorImpl.invoke(DelegatingMethodAccessorImpl.java:25)
	at java.lang.reflect.Method.invoke(Method.java:324)
	at org.apache.commons.jelly.impl.DynamicBeanTag.doTag(DynamicBeanTag.java:180)
	at org.apache.commons.jelly.impl.StaticTagScript.run(StaticTagScript.java:102)
	at org.apache.commons.jelly.impl.ScriptBlock.run(ScriptBlock.java:95)
	at org.apache.maven.jelly.tags.werkz.MavenGoalTag.runBodyTag(MavenGoalTag.java:78)
	at org.apache.maven.jelly.tags.werkz.MavenGoalTag$MavenGoalAction.performAction(MavenGoalTag.java:109)
	at org.apache.maven.werkz.Goal.fire(Goal.java:656)
	at org.apache.maven.werkz.Goal.attain(Goal.java:592)
	at org.apache.maven.werkz.Goal.attainPrecursors(Goal.java:505)
	at org.apache.maven.werkz.Goal.attain(Goal.java:590)
	at org.apache.maven.werkz.WerkzProject.attainGoal(WerkzProject.java:210)
	at org.apache.maven.jelly.tags.werkz.MavenAttainGoalTag.doTag(MavenAttainGoalTag.java:114)
	at org.apache.commons.jelly.impl.TagScript.run(TagScript.java:247)
	at org.apache.commons.jelly.impl.ScriptBlock.run(ScriptBlock.java:95)
	at org.apache.maven.jelly.tags.werkz.MavenGoalTag.runBodyTag(MavenGoalTag.java:78)
	at org.apache.maven.jelly.tags.werkz.MavenGoalTag$MavenGoalAction.performAction(MavenGoalTag.java:109)
	at org.apache.maven.werkz.Goal.fire(Goal.java:656)
	at org.apache.maven.werkz.Goal.attain(Goal.java:592)
	at org.apache.maven.plugin.PluginManager.attainGoals(PluginManager.java:693)
	at org.apache.maven.MavenSession.attainGoals(MavenSession.java:263)
	at org.apache.maven.jelly.tags.maven.ReactorTag.doTag(ReactorTag.java:368)
	at org.apache.commons.jelly.impl.TagScript.run(TagScript.java:247)
	at org.apache.commons.jelly.impl.ScriptBlock.run(ScriptBlock.java:95)
	at org.apache.maven.jelly.tags.werkz.MavenGoalTag.runBodyTag(MavenGoalTag.java:78)
	at org.apache.maven.jelly.tags.werkz.MavenGoalTag$MavenGoalAction.performAction(MavenGoalTag.java:109)
	at org.apache.maven.werkz.Goal.fire(Goal.java:656)
	at org.apache.maven.werkz.Goal.attain(Goal.java:592)
	at org.apache.maven.werkz.WerkzProject.attainGoal(WerkzProject.java:210)
	at org.apache.maven.jelly.tags.werkz.MavenAttainGoalTag.doTag(MavenAttainGoalTag.java:114)
	at org.apache.commons.jelly.impl.TagScript.run(TagScript.java:247)
	at org.apache.commons.jelly.impl.ScriptBlock.run(ScriptBlock.java:95)
	at org.apache.maven.jelly.tags.werkz.MavenGoalTag.runBodyTag(MavenGoalTag.java:78)
	at org.apache.maven.jelly.tags.werkz.MavenGoalTag$MavenGoalAction.performAction(MavenGoalTag.java:109)
	at org.apache.maven.werkz.Goal.fire(Goal.java:656)
	at org.apache.maven.werkz.Goal.attain(Goal.java:592)
	at org.apache.maven.plugin.PluginManager.attainGoals(PluginManager.java:693)
	at org.apache.maven.MavenSession.attainGoals(MavenSession.java:263)
	at org.apache.maven.cli.App.doMain(App.java:511)
	at org.apache.maven.cli.App.main(App.java:1258)
	at sun.reflect.NativeMethodAccessorImpl.invoke0(Native Method)
	at sun.reflect.NativeMethodAccessorImpl.invoke(NativeMethodAccessorImpl.java:39)
	at sun.reflect.DelegatingMethodAccessorImpl.invoke(DelegatingMethodAccessorImpl.java:25)
	at java.lang.reflect.Method.invoke(Method.java:324)
	at com.werken.forehead.Forehead.run(Forehead.java:551)
	at com.werken.forehead.Forehead.main(Forehead.java:581)
Caused by: java.lang.NoSuchMethodError: org.apache.geronimo.kernel.config.ConfigurationManager.loadConfiguration(Lorg/apache/geronimo/kernel/repository/Artifact;)V
	at org.apache.geronimo.plugin.packaging.PackageBuilder.execute(PackageBuilder.java:240)
	... 53 more

BUILD FAILED
File...... /home/continuum/continuum-1.0.2/apps/continuum/work/68/maven.xml
Element... maven:reactor
Line...... 58
Column.... -1
Unable to obtain goal [multiproject:install-callback] -- /home/continuum/.geronimo-1.1-maven/cache/geronimo-packaging-plugin-1.1.0-4/plugin.jelly:64:-1: <car:package> null
Total time   : 8 minutes 21 seconds 
00:10:14,393 INFO  [App] Total time   : 8 minutes 21 seconds 
Finished at  : Tuesday, April 18, 2006 12:10:14 AM PDT
00:10:14,393 INFO  [App] Finished at  : Tuesday, April 18, 2006 12:10:14 AM PDT

00:10:14,393 INFO  [App] 

****************************************************************************



Mime
View raw message