geronimo-scm mailing list archives

Site index · List index
Message view « Date » · « Thread »
Top « Date » · « Thread »
From continuum <contin...@stan.gbuild.org>
Subject [continuum] BUILD FAILURE: Geronimo 1.1
Date Tue, 18 Apr 2006 15:33:43 GMT
Online report : http://ci.gbuild.org/continuum/servlet/continuum/target/ProjectBuild.vm/view/ProjectBuild/id/68/buildId/2407
Build statistics:
  State: Failed
  Previous State: Failed
  Started at: Tue, 18 Apr 2006 08:29:59 -0700
  Finished at: Tue, 18 Apr 2006 08:33:42 -0700
  Total time: 3m 43s
  Build Trigger: Forced
  Exit code: 70
  Building machine hostname: stan.gbuild.org
  Operating system : Linux(unknown)
  Java version : 1.4.2_08(Sun Microsystems Inc.)

Changes
                            modules/deployment/src/java/org/apache/geronimo/deployment/DeploymentContext.java
            modules/deployment/src/java/org/apache/geronimo/deployment/CopyResourceContext.java
            modules/deployment/src/java/org/apache/geronimo/deployment/InPlaceResourceContext.java
            modules/deployment/src/java/org/apache/geronimo/deployment/ResourceContext.java
            modules/deployment/src/java/org/apache/geronimo/deployment/util/NestedJarFile.java
            modules/deployment/src/java/org/apache/geronimo/deployment/util/DeploymentUtil.java
            modules/web-builder/src/java/org/apache/geronimo/web/deployment/AbstractWebModuleBuilder.java
            modules/j2ee-builder/src/java/org/apache/geronimo/j2ee/deployment/EARConfigBuilder.java
        
****************************************************************************
Output:
****************************************************************************
 __  __
|  \/  |__ _Apache__ ___
| |\/| / _` \ V / -_) ' \  ~ intelligent projects ~
|_|  |_\__,_|\_/\___|_||_|  v. 1.1-beta-2

DEPRECATED: the default goal should be specified in the <build> section of project.xml instead of maven.xml
DEPRECATED: the default goal should be specified in the <build> section of project.xml instead of maven.xml
build:start:

m:checkout:
    [exec] Checked out revision 2610.
Starting the reactor...
Our processing order:

new:
new0:

Starting the reactor...
Our processing order:
new00:

Starting the reactor...
Our processing order:
Geronimo :: Activation
Geronimo :: Kernel
Geronimo :: Common
Geronimo :: Util
Geronimo :: System
Geronimo :: Deployment
Geronimo :: Deploy :: Common Config
Geronimo :: Management API
Geronimo :: Core
Geronimo :: J2EE
Geronimo :: J2EE Schema
Geronimo :: Service :: Builder
Geronimo :: Maven Dependency Plugin
Geronimo :: Naming
Geronimo :: Security
Geronimo :: Web Services
Geronimo :: Axis
Geronimo :: Test :: DDBeans
Geronimo :: Transaction
Geronimo :: Connector
Geronimo :: Security :: Builder
Geronimo :: J2EE
Geronimo :: Naming :: Builder
Geronimo :: Connector :: Builder
Geronimo :: Axis :: Builder
Geronimo :: Client
Geronimo :: Client Builder
Geronimo :: Console Web
Geronimo :: Configuration Converter
Geronimo :: Web :: Builder
Geronimo :: Deploy :: JSR-88
Geronimo :: Deploy :: CLI Tool
Geronimo :: Derby
Geronimo :: Directory
Geronimo :: Deploy :: Hot Deployer
Geronimo :: Installer Processing
Geronimo :: Installer Support
Geronimo :: JavaMail Transport
Geronimo :: Jetty
Geronimo :: Jetty :: Builder
Geronimo :: JMX Remoting
Geronimo :: Mail
Geronimo :: Scripts
Geronimo :: Timer
Geronimo :: Tomcat
Geronimo :: Tomcat :: Builder
Geronimo :: Upgrade
Geronimo :: Maven Assembly Plugin
Geronimo :: Maven Deployment Plugin
Geronimo :: IZPack Installer Build Plugin
Geronimo :: Maven Packaging Plugin
+----------------------------------------
| geronimo and geronimo-plugins Geronimo :: Activation
| Memory: 4M/10M
+----------------------------------------
DEPRECATED: the default goal should be specified in the <build> section of project.xml instead of maven.xml
new1:
You are working offline so the build will continue, but geronimo-javamail_1.3.1_spec-1.1-SNAPSHOT.jar may be out of date!
build:start:

multiproject:install-callback:
    [echo] Running jar:install for Geronimo :: Activation
java:prepare-filesystem:

java:compile:
<depend closure="false" srcdir="1.4" dump="false" destdir="/home/continuum/continuum-1.0.2/apps/continuum/work/68/modules/activation/target/classes"></depend>    [echo] Compiling to /home/continuum/continuum-1.0.2/apps/continuum/work/68/modules/activation/target/classes

java:jar-resources:

test:prepare-filesystem:

test:test-resources:

test:compile:

test:test:
    [echo] NOTICE: Skipping tests; they seem to have passed already
    [echo] No tests to run.
Running post goal: test:test

jar:jar:

jar:install:
    [echo] Installing...
Uploading to geronimo/jars/geronimo-activation-1.1-SNAPSHOT.jar: 
.................... (13K)
Uploading to geronimo/poms/geronimo-activation-1.1-SNAPSHOT.pom: 
.................... (10K)

+----------------------------------------
| geronimo and geronimo-plugins Geronimo :: Kernel
| Memory: 7M/10M
+----------------------------------------
DEPRECATED: the default goal should be specified in the <build> section of project.xml instead of maven.xml
DEPRECATED: the default goal should be specified in the <build> section of project.xml instead of maven.xml

build:end:

build:start:

multiproject:install-callback:
    [echo] Running jar:install for Geronimo :: Kernel
Tag library requested that is not present: 'xmlbeans2:maven' in plugin: 'null'
java:prepare-filesystem:

java:compile:
<depend closure="false" srcdir="1.4" dump="false" destdir="/home/continuum/continuum-1.0.2/apps/continuum/work/68/modules/kernel/target/classes"></depend>    [echo] Compiling to /home/continuum/continuum-1.0.2/apps/continuum/work/68/modules/kernel/target/classes

java:jar-resources:

test:prepare-filesystem:

test:test-resources:

test:compile:

test:test:
    [echo] NOTICE: Skipping tests; they seem to have passed already
    [echo] No tests to run.
Running post goal: test:test

jar:jar:

jar:install:
    [echo] Installing...
Uploading to geronimo/jars/geronimo-kernel-1.1-SNAPSHOT.jar: 
.................... (330K)
Uploading to geronimo/poms/geronimo-kernel-1.1-SNAPSHOT.pom: 
.................... (11K)

+----------------------------------------
| geronimo and geronimo-plugins Geronimo :: Common
| Memory: 9M/10M
+----------------------------------------
DEPRECATED: the default goal should be specified in the <build> section of project.xml instead of maven.xml

build:end:

You are working offline so the build will continue, but geronimo-kernel-1.1-SNAPSHOT.jar may be out of date!
build:start:

multiproject:install-callback:
    [echo] Running jar:install for Geronimo :: Common
java:prepare-filesystem:

java:compile:
<depend closure="false" srcdir="1.4" dump="false" destdir="/home/continuum/continuum-1.0.2/apps/continuum/work/68/modules/common/target/classes"></depend>    [echo] Compiling to /home/continuum/continuum-1.0.2/apps/continuum/work/68/modules/common/target/classes

java:jar-resources:

test:prepare-filesystem:

test:test-resources:

test:compile:

test:test:
    [echo] NOTICE: Skipping tests; they seem to have passed already
    [echo] No tests to run.
Running post goal: test:test

jar:jar:

jar:install:
    [echo] Installing...
Uploading to geronimo/jars/geronimo-common-1.1-SNAPSHOT.jar: 
.................... (36K)
Uploading to geronimo/poms/geronimo-common-1.1-SNAPSHOT.pom: 
.................... (10K)

+----------------------------------------
| geronimo and geronimo-plugins Geronimo :: Util
| Memory: 9M/14M
+----------------------------------------
DEPRECATED: the default goal should be specified in the <build> section of project.xml instead of maven.xml

build:end:

build:start:

multiproject:install-callback:
    [echo] Running jar:install for Geronimo :: Util
java:prepare-filesystem:

java:compile:
<depend closure="false" srcdir="1.4" dump="false" destdir="/home/continuum/continuum-1.0.2/apps/continuum/work/68/modules/util/target/classes"></depend>    [echo] Compiling to /home/continuum/continuum-1.0.2/apps/continuum/work/68/modules/util/target/classes

java:jar-resources:

test:prepare-filesystem:

test:test-resources:

test:compile:

test:test:
    [echo] NOTICE: Skipping tests; they seem to have passed already
    [echo] No tests to run.
Running post goal: test:test

jar:jar:

jar:install:
    [echo] Installing...
Uploading to geronimo/jars/geronimo-util-1.1-SNAPSHOT.jar: 
.................... (243K)
Uploading to geronimo/poms/geronimo-util-1.1-SNAPSHOT.pom: 
.................... (10K)

+----------------------------------------
| geronimo and geronimo-plugins Geronimo :: System
| Memory: 10M/14M
+----------------------------------------
DEPRECATED: the default goal should be specified in the <build> section of project.xml instead of maven.xml
DEPRECATED: the default goal should be specified in the <build> section of project.xml instead of maven.xml

build:end:

You are working offline so the build will continue, but geronimo-common-1.1-SNAPSHOT.jar may be out of date!
You are working offline so the build will continue, but geronimo-util-1.1-SNAPSHOT.jar may be out of date!
build:start:

multiproject:install-callback:
    [echo] Running jar:install for Geronimo :: System
java:prepare-filesystem:

java:compile:
<depend closure="false" srcdir="1.4" dump="false" destdir="/home/continuum/continuum-1.0.2/apps/continuum/work/68/modules/system/target/classes"></depend>    [echo] Compiling to /home/continuum/continuum-1.0.2/apps/continuum/work/68/modules/system/target/classes
Running post goal: java:compile

java:jar-resources:

test:prepare-filesystem:

test:test-resources:
Running post goal: test:test-resources
    [delete] Deleting directory /home/continuum/continuum-1.0.2/apps/continuum/work/68/modules/system/target/tmp
    [mkdir] Created dir: /home/continuum/continuum-1.0.2/apps/continuum/work/68/modules/system/target/tmp

test:compile:

test:test:
    [echo] NOTICE: Skipping tests; they seem to have passed already
    [echo] No tests to run.
Running post goal: test:test

jar:jar:
    [jar] Building jar: /home/continuum/continuum-1.0.2/apps/continuum/work/68/modules/system/target/geronimo-system-1.1-SNAPSHOT.jar

jar:install:
    [echo] Installing...
Uploading to geronimo/jars/geronimo-system-1.1-SNAPSHOT.jar: 
.................... (202K)
Uploading to geronimo/poms/geronimo-system-1.1-SNAPSHOT.pom: 
.................... (11K)

+----------------------------------------
| geronimo and geronimo-plugins Geronimo :: Deployment
| Memory: 11M/14M
+----------------------------------------
DEPRECATED: the default goal should be specified in the <build> section of project.xml instead of maven.xml
DEPRECATED: the default goal should be specified in the <build> section of project.xml instead of maven.xml

build:end:

You are working offline so the build will continue, but geronimo-system-1.1-SNAPSHOT.jar may be out of date!
build:start:

multiproject:install-callback:
    [echo] Running jar:install for Geronimo :: Deployment
java:prepare-filesystem:

java:compile:
<depend closure="false" srcdir="1.4" dump="false" destdir="/home/continuum/continuum-1.0.2/apps/continuum/work/68/modules/deployment/target/classes"></depend>    [echo] Compiling to /home/continuum/continuum-1.0.2/apps/continuum/work/68/modules/deployment/target/classes
    [javac] Compiling 6 source files to /home/continuum/continuum-1.0.2/apps/continuum/work/68/modules/deployment/target/classes

java:jar-resources:

test:prepare-filesystem:

test:test-resources:

test:compile:

test:test:
    [junit] Running org.apache.geronimo.deployment.DeploymentContextTest
    [junit] Tests run: 1, Failures: 0, Errors: 0, Time elapsed: 0.866 sec
Running post goal: test:test
08:30:57,002 INFO  [PostGoalTag] Running post goal: test:test

jar:jar:
    [jar] Building jar: /home/continuum/continuum-1.0.2/apps/continuum/work/68/modules/deployment/target/geronimo-deployment-1.1-SNAPSHOT.jar

jar:install:
    [echo] Installing...
Uploading to geronimo/jars/geronimo-deployment-1.1-SNAPSHOT.jar: 
.................... (52K)
Uploading to geronimo/poms/geronimo-deployment-1.1-SNAPSHOT.pom: 
.................... (11K)

+----------------------------------------

build:end:

08:30:58,247 INFO  [ReactorTag] +----------------------------------------
| geronimo and geronimo-plugins Geronimo :: Deploy :: Common Config
08:30:58,247 INFO  [ReactorTag] | geronimo and geronimo-plugins Geronimo :: Deploy :: Common Config
| Memory: 9M/17M
08:30:58,247 INFO  [ReactorTag] | Memory: 9M/17M
+----------------------------------------
08:30:58,248 INFO  [ReactorTag] +----------------------------------------
DEPRECATED: the default goal should be specified in the <build> section of project.xml instead of maven.xml
08:30:58,259 WARN  [PluginScriptParser] DEPRECATED: the default goal should be specified in the <build> section of project.xml instead of maven.xml
DEPRECATED: the default goal should be specified in the <build> section of project.xml instead of maven.xml
08:30:58,260 WARN  [PluginScriptParser] DEPRECATED: the default goal should be specified in the <build> section of project.xml instead of maven.xml
build:start:

multiproject:install-callback:
    [echo] Running jar:install for Geronimo :: Deploy :: Common Config
java:prepare-filesystem:

java:compile:
<depend closure="false" srcdir="1.4" dump="false" destdir="/home/continuum/continuum-1.0.2/apps/continuum/work/68/modules/deploy-config/target/classes"></depend>    [echo] Compiling to /home/continuum/continuum-1.0.2/apps/continuum/work/68/modules/deploy-config/target/classes

java:jar-resources:

test:prepare-filesystem:

test:test-resources:

test:compile:

test:test:
    [echo] NOTICE: Skipping tests; they seem to have passed already
    [echo] No tests to run.
Running post goal: test:test
08:30:59,477 INFO  [PostGoalTag] Running post goal: test:test

jar:jar:

jar:install:
    [echo] Installing...
Uploading to geronimo/jars/geronimo-deploy-config-1.1-SNAPSHOT.jar: 
.................... (10K)
Uploading to geronimo/poms/geronimo-deploy-config-1.1-SNAPSHOT.pom: 
.................... (11K)

+----------------------------------------

build:end:

08:30:59,926 INFO  [ReactorTag] +----------------------------------------
| geronimo and geronimo-plugins Geronimo :: Management API
08:30:59,926 INFO  [ReactorTag] | geronimo and geronimo-plugins Geronimo :: Management API
| Memory: 10M/17M
08:30:59,926 INFO  [ReactorTag] | Memory: 10M/17M
+----------------------------------------
08:30:59,927 INFO  [ReactorTag] +----------------------------------------
DEPRECATED: the default goal should be specified in the <build> section of project.xml instead of maven.xml
08:30:59,943 WARN  [PluginScriptParser] DEPRECATED: the default goal should be specified in the <build> section of project.xml instead of maven.xml
DEPRECATED: the default goal should be specified in the <build> section of project.xml instead of maven.xml
08:30:59,944 WARN  [PluginScriptParser] DEPRECATED: the default goal should be specified in the <build> section of project.xml instead of maven.xml
build:start:

multiproject:install-callback:
    [echo] Running jar:install for Geronimo :: Management API
java:prepare-filesystem:

java:compile:
<depend closure="false" srcdir="1.4" dump="false" destdir="/home/continuum/continuum-1.0.2/apps/continuum/work/68/modules/management/target/classes"></depend>    [echo] Compiling to /home/continuum/continuum-1.0.2/apps/continuum/work/68/modules/management/target/classes

java:jar-resources:

test:prepare-filesystem:

test:test-resources:

test:compile:
    [echo] No test source files to compile.

test:test:
    [echo] NOTICE: Skipping tests; they seem to have passed already
    [echo] No tests to run.
Running post goal: test:test
08:31:01,129 INFO  [PostGoalTag] Running post goal: test:test

jar:jar:

jar:install:
    [echo] Installing...
Uploading to geronimo/jars/geronimo-management-1.1-SNAPSHOT.jar: 
.................... (39K)
Uploading to geronimo/poms/geronimo-management-1.1-SNAPSHOT.pom: 
.................... (10K)

+----------------------------------------

build:end:

08:31:01,427 INFO  [ReactorTag] +----------------------------------------
| geronimo and geronimo-plugins Geronimo :: Core
08:31:01,427 INFO  [ReactorTag] | geronimo and geronimo-plugins Geronimo :: Core
| Memory: 10M/17M
08:31:01,427 INFO  [ReactorTag] | Memory: 10M/17M
+----------------------------------------
08:31:01,428 INFO  [ReactorTag] +----------------------------------------
DEPRECATED: the default goal should be specified in the <build> section of project.xml instead of maven.xml
08:31:01,440 WARN  [PluginScriptParser] DEPRECATED: the default goal should be specified in the <build> section of project.xml instead of maven.xml
DEPRECATED: the default goal should be specified in the <build> section of project.xml instead of maven.xml
08:31:01,442 WARN  [PluginScriptParser] DEPRECATED: the default goal should be specified in the <build> section of project.xml instead of maven.xml
You are working offline so the build will continue, but geronimo-management-1.1-SNAPSHOT.jar may be out of date!
08:31:01,795 WARN  [DependencyVerifier] You are working offline so the build will continue, but geronimo-management-1.1-SNAPSHOT.jar may be out of date!
build:start:

multiproject:install-callback:
    [echo] Running jar:install for Geronimo :: Core
java:prepare-filesystem:

java:compile:
<depend closure="false" srcdir="1.4" dump="false" destdir="/home/continuum/continuum-1.0.2/apps/continuum/work/68/modules/core/target/classes"></depend>    [echo] Compiling to /home/continuum/continuum-1.0.2/apps/continuum/work/68/modules/core/target/classes

java:jar-resources:

test:prepare-filesystem:

test:test-resources:

test:compile:

test:test:
    [echo] NOTICE: Skipping tests; they seem to have passed already
    [echo] No tests to run.
Running post goal: test:test
08:31:03,634 INFO  [PostGoalTag] Running post goal: test:test

jar:jar:

jar:install:
    [echo] Installing...
Uploading to geronimo/jars/geronimo-core-1.1-SNAPSHOT.jar: 
.................... (39K)
Uploading to geronimo/poms/geronimo-core-1.1-SNAPSHOT.pom: 
.................... (11K)

+----------------------------------------

build:end:

08:31:04,014 INFO  [ReactorTag] +----------------------------------------
| geronimo and geronimo-plugins Geronimo :: J2EE
08:31:04,015 INFO  [ReactorTag] | geronimo and geronimo-plugins Geronimo :: J2EE
| Memory: 12M/17M
08:31:04,015 INFO  [ReactorTag] | Memory: 12M/17M
+----------------------------------------
08:31:04,015 INFO  [ReactorTag] +----------------------------------------
DEPRECATED: the default goal should be specified in the <build> section of project.xml instead of maven.xml
08:31:04,032 WARN  [PluginScriptParser] DEPRECATED: the default goal should be specified in the <build> section of project.xml instead of maven.xml
DEPRECATED: the default goal should be specified in the <build> section of project.xml instead of maven.xml
08:31:04,033 WARN  [PluginScriptParser] DEPRECATED: the default goal should be specified in the <build> section of project.xml instead of maven.xml
You are working offline so the build will continue, but geronimo-core-1.1-SNAPSHOT.jar may be out of date!
08:31:04,402 WARN  [DependencyVerifier] You are working offline so the build will continue, but geronimo-core-1.1-SNAPSHOT.jar may be out of date!
build:start:

multiproject:install-callback:
    [echo] Running jar:install for Geronimo :: J2EE
java:prepare-filesystem:

java:compile:
<depend closure="false" srcdir="1.4" dump="false" destdir="/home/continuum/continuum-1.0.2/apps/continuum/work/68/modules/j2ee/target/classes"></depend>    [echo] Compiling to /home/continuum/continuum-1.0.2/apps/continuum/work/68/modules/j2ee/target/classes

java:jar-resources:

test:prepare-filesystem:

test:test-resources:

test:compile:

test:test:
    [echo] NOTICE: Skipping tests; they seem to have passed already
    [echo] No tests to run.
Running post goal: test:test
08:31:09,434 INFO  [PostGoalTag] Running post goal: test:test

jar:jar:

jar:install:
    [echo] Installing...
Uploading to geronimo/jars/geronimo-j2ee-1.1-SNAPSHOT.jar: 
.................... (29K)
Uploading to geronimo/poms/geronimo-j2ee-1.1-SNAPSHOT.pom: 
.................... (12K)

+----------------------------------------

build:end:

08:31:09,841 INFO  [ReactorTag] +----------------------------------------
| geronimo and geronimo-plugins Geronimo :: J2EE Schema
08:31:09,841 INFO  [ReactorTag] | geronimo and geronimo-plugins Geronimo :: J2EE Schema
| Memory: 12M/17M
08:31:09,842 INFO  [ReactorTag] | Memory: 12M/17M
+----------------------------------------
08:31:09,842 INFO  [ReactorTag] +----------------------------------------
DEPRECATED: the default goal should be specified in the <build> section of project.xml instead of maven.xml
08:31:09,858 WARN  [PluginScriptParser] DEPRECATED: the default goal should be specified in the <build> section of project.xml instead of maven.xml
DEPRECATED: the default goal should be specified in the <build> section of project.xml instead of maven.xml
08:31:09,860 WARN  [PluginScriptParser] DEPRECATED: the default goal should be specified in the <build> section of project.xml instead of maven.xml
build:start:

multiproject:install-callback:
    [echo] Running jar:install for Geronimo :: J2EE Schema
java:prepare-filesystem:

java:compile:
<depend closure="false" srcdir="1.4" dump="false" destdir="/home/continuum/continuum-1.0.2/apps/continuum/work/68/modules/j2ee-schema/target/classes"></depend>    [echo] Compiling to /home/continuum/continuum-1.0.2/apps/continuum/work/68/modules/j2ee-schema/target/classes

java:jar-resources:

test:prepare-filesystem:

test:test-resources:

test:compile:

test:test:
    [echo] NOTICE: Skipping tests; they seem to have passed already
    [echo] No tests to run.
Running post goal: test:test
08:31:11,924 INFO  [PostGoalTag] Running post goal: test:test

jar:jar:

jar:install:
    [echo] Installing...
Uploading to geronimo/jars/geronimo-j2ee-schema-1.1-SNAPSHOT.jar: 
.................... (1501K)
Uploading to geronimo/poms/geronimo-j2ee-schema-1.1-SNAPSHOT.pom: 
.................... (11K)

+----------------------------------------

build:end:

08:31:12,930 INFO  [ReactorTag] +----------------------------------------
| geronimo and geronimo-plugins Geronimo :: Service :: Builder
08:31:12,930 INFO  [ReactorTag] | geronimo and geronimo-plugins Geronimo :: Service :: Builder
| Memory: 15M/17M
08:31:12,930 INFO  [ReactorTag] | Memory: 15M/17M
+----------------------------------------
08:31:12,931 INFO  [ReactorTag] +----------------------------------------
DEPRECATED: the default goal should be specified in the <build> section of project.xml instead of maven.xml
08:31:12,943 WARN  [PluginScriptParser] DEPRECATED: the default goal should be specified in the <build> section of project.xml instead of maven.xml
DEPRECATED: the default goal should be specified in the <build> section of project.xml instead of maven.xml
08:31:12,944 WARN  [PluginScriptParser] DEPRECATED: the default goal should be specified in the <build> section of project.xml instead of maven.xml
You are working offline so the build will continue, but geronimo-deployment-1.1-SNAPSHOT.jar may be out of date!
08:31:13,266 WARN  [DependencyVerifier] You are working offline so the build will continue, but geronimo-deployment-1.1-SNAPSHOT.jar may be out of date!
You are working offline so the build will continue, but geronimo-deploy-config-1.1-SNAPSHOT.jar may be out of date!
08:31:13,266 WARN  [DependencyVerifier] You are working offline so the build will continue, but geronimo-deploy-config-1.1-SNAPSHOT.jar may be out of date!
You are working offline so the build will continue, but geronimo-j2ee-1.1-SNAPSHOT.jar may be out of date!
08:31:13,266 WARN  [DependencyVerifier] You are working offline so the build will continue, but geronimo-j2ee-1.1-SNAPSHOT.jar may be out of date!
You are working offline so the build will continue, but geronimo-j2ee-schema-1.1-SNAPSHOT.jar may be out of date!
08:31:13,266 WARN  [DependencyVerifier] You are working offline so the build will continue, but geronimo-j2ee-schema-1.1-SNAPSHOT.jar may be out of date!
build:start:

multiproject:install-callback:
    [echo] Running jar:install for Geronimo :: Service :: Builder
java:prepare-filesystem:

java:compile:
<depend closure="false" srcdir="1.4" dump="false" destdir="/home/continuum/continuum-1.0.2/apps/continuum/work/68/modules/service-builder/target/classes"></depend>    [echo] Compiling to /home/continuum/continuum-1.0.2/apps/continuum/work/68/modules/service-builder/target/classes

java:jar-resources:

test:prepare-filesystem:

test:test-resources:

test:compile:

test:test:
    [echo] NOTICE: Skipping tests; they seem to have passed already
    [echo] No tests to run.
Running post goal: test:test
08:31:14,328 INFO  [PostGoalTag] Running post goal: test:test

jar:jar:

jar:install:
    [echo] Installing...
Uploading to geronimo/jars/geronimo-service-builder-1.1-SNAPSHOT.jar: 
.................... (179K)
Uploading to geronimo/poms/geronimo-service-builder-1.1-SNAPSHOT.pom: 
.................... (12K)

+----------------------------------------

build:end:

08:31:14,791 INFO  [ReactorTag] +----------------------------------------
| geronimo and geronimo-plugins Geronimo :: Maven Dependency Plugin
08:31:14,791 INFO  [ReactorTag] | geronimo and geronimo-plugins Geronimo :: Maven Dependency Plugin
| Memory: 16M/17M
08:31:14,791 INFO  [ReactorTag] | Memory: 16M/17M
+----------------------------------------
08:31:14,791 INFO  [ReactorTag] +----------------------------------------
DEPRECATED: the default goal should be specified in the <build> section of project.xml instead of maven.xml
08:31:14,803 WARN  [PluginScriptParser] DEPRECATED: the default goal should be specified in the <build> section of project.xml instead of maven.xml
You are working offline so the build will continue, but geronimo-service-builder-1.1-SNAPSHOT.jar may be out of date!
08:31:15,065 WARN  [DependencyVerifier] You are working offline so the build will continue, but geronimo-service-builder-1.1-SNAPSHOT.jar may be out of date!
build:start:

multiproject:install-callback:
    [echo] Running plugin:repository-install for Geronimo :: Maven Dependency Plugin
plugin:plugin:
java:prepare-filesystem:

java:compile:
    [echo] Compiling to /home/continuum/continuum-1.0.2/apps/continuum/work/68/plugins/geronimo-dependency-plugin/target/classes

java:jar-resources:

test:prepare-filesystem:

test:test-resources:

test:compile:
    [echo] No test source files to compile.

test:test:
    [echo] No tests to run.

jar:jar:


plugin:repository-install:
    [echo] Installing...
Uploading to geronimo/plugins/geronimo-dependency-plugin-1.1.0-1.jar: 
.................... (9K)
Uploading to geronimo/poms/geronimo-dependency-plugin-1.1.0-1.pom: 
.................... (1K)

+----------------------------------------

build:end:

08:31:16,011 INFO  [ReactorTag] +----------------------------------------
| geronimo and geronimo-plugins Geronimo :: Naming
08:31:16,011 INFO  [ReactorTag] | geronimo and geronimo-plugins Geronimo :: Naming
| Memory: 11M/18M
08:31:16,012 INFO  [ReactorTag] | Memory: 11M/18M
+----------------------------------------
08:31:16,012 INFO  [ReactorTag] +----------------------------------------
DEPRECATED: the default goal should be specified in the <build> section of project.xml instead of maven.xml
08:31:16,025 WARN  [PluginScriptParser] DEPRECATED: the default goal should be specified in the <build> section of project.xml instead of maven.xml
DEPRECATED: the default goal should be specified in the <build> section of project.xml instead of maven.xml
08:31:16,026 WARN  [PluginScriptParser] DEPRECATED: the default goal should be specified in the <build> section of project.xml instead of maven.xml
build:start:

multiproject:install-callback:
    [echo] Running jar:install for Geronimo :: Naming
java:prepare-filesystem:

java:compile:
<depend closure="false" srcdir="1.4" dump="false" destdir="/home/continuum/continuum-1.0.2/apps/continuum/work/68/modules/naming/target/classes"></depend>    [echo] Compiling to /home/continuum/continuum-1.0.2/apps/continuum/work/68/modules/naming/target/classes

java:jar-resources:

test:prepare-filesystem:

test:test-resources:

test:compile:

test:test:
    [echo] NOTICE: Skipping tests; they seem to have passed already
    [echo] No tests to run.
Running post goal: test:test
08:31:17,063 INFO  [PostGoalTag] Running post goal: test:test

jar:jar:

jar:install:
    [echo] Installing...
Uploading to geronimo/jars/geronimo-naming-1.1-SNAPSHOT.jar: 
.................... (46K)
Uploading to geronimo/poms/geronimo-naming-1.1-SNAPSHOT.pom: 
.................... (10K)

+----------------------------------------

build:end:

08:31:17,345 INFO  [ReactorTag] +----------------------------------------
| geronimo and geronimo-plugins Geronimo :: Security
08:31:17,345 INFO  [ReactorTag] | geronimo and geronimo-plugins Geronimo :: Security
| Memory: 11M/18M
08:31:17,345 INFO  [ReactorTag] | Memory: 11M/18M
+----------------------------------------
08:31:17,345 INFO  [ReactorTag] +----------------------------------------
DEPRECATED: the default goal should be specified in the <build> section of project.xml instead of maven.xml
08:31:17,357 WARN  [PluginScriptParser] DEPRECATED: the default goal should be specified in the <build> section of project.xml instead of maven.xml
DEPRECATED: the default goal should be specified in the <build> section of project.xml instead of maven.xml
08:31:17,358 WARN  [PluginScriptParser] DEPRECATED: the default goal should be specified in the <build> section of project.xml instead of maven.xml
build:start:

multiproject:install-callback:
    [echo] Running jar:install for Geronimo :: Security
java:prepare-filesystem:

java:compile:
<depend closure="false" srcdir="1.4" dump="false" destdir="/home/continuum/continuum-1.0.2/apps/continuum/work/68/modules/security/target/classes"></depend>    [echo] Compiling to /home/continuum/continuum-1.0.2/apps/continuum/work/68/modules/security/target/classes

java:jar-resources:

test:prepare-filesystem:

test:test-resources:
Running post goal: test:test-resources
08:31:18,255 INFO  [PostGoalTag] Running post goal: test:test-resources
    [delete] Deleting directory /home/continuum/continuum-1.0.2/apps/continuum/work/68/modules/security/target/database
    [mkdir] Created dir: /home/continuum/continuum-1.0.2/apps/continuum/work/68/modules/security/target/database

test:compile:

test:test:
    [echo] NOTICE: Skipping tests; they seem to have passed already
    [echo] No tests to run.
Running post goal: test:test
08:31:18,705 INFO  [PostGoalTag] Running post goal: test:test

jar:jar:

jar:install:
    [echo] Installing...
Uploading to geronimo/jars/geronimo-security-1.1-SNAPSHOT.jar: 
.................... (186K)
Uploading to geronimo/poms/geronimo-security-1.1-SNAPSHOT.pom: 
.................... (13K)

+----------------------------------------

build:end:

08:31:19,065 INFO  [ReactorTag] +----------------------------------------
| geronimo and geronimo-plugins Geronimo :: Web Services
08:31:19,065 INFO  [ReactorTag] | geronimo and geronimo-plugins Geronimo :: Web Services
| Memory: 13M/18M
08:31:19,066 INFO  [ReactorTag] | Memory: 13M/18M
+----------------------------------------
08:31:19,066 INFO  [ReactorTag] +----------------------------------------
DEPRECATED: the default goal should be specified in the <build> section of project.xml instead of maven.xml
08:31:19,079 WARN  [PluginScriptParser] DEPRECATED: the default goal should be specified in the <build> section of project.xml instead of maven.xml
build:start:

multiproject:install-callback:
    [echo] Running jar:install for Geronimo :: Web Services
java:prepare-filesystem:

java:compile:
<depend closure="false" srcdir="1.4" dump="false" destdir="/home/continuum/continuum-1.0.2/apps/continuum/work/68/modules/webservices/target/classes"></depend>    [echo] Compiling to /home/continuum/continuum-1.0.2/apps/continuum/work/68/modules/webservices/target/classes

java:jar-resources:

test:prepare-filesystem:

test:test-resources:

test:compile:
    [echo] No test source files to compile.

test:test:
    [echo] NOTICE: Skipping tests; they seem to have passed already
    [echo] No tests to run.
Running post goal: test:test
08:31:20,165 INFO  [PostGoalTag] Running post goal: test:test

jar:jar:

jar:install:
    [echo] Installing...
Uploading to geronimo/jars/geronimo-webservices-1.1-SNAPSHOT.jar: 
.................... (34K)
Uploading to geronimo/poms/geronimo-webservices-1.1-SNAPSHOT.pom: 
.................... (12K)

+----------------------------------------

build:end:

08:31:20,490 INFO  [ReactorTag] +----------------------------------------
| geronimo and geronimo-plugins Geronimo :: Axis
08:31:20,490 INFO  [ReactorTag] | geronimo and geronimo-plugins Geronimo :: Axis
| Memory: 13M/18M
08:31:20,490 INFO  [ReactorTag] | Memory: 13M/18M
+----------------------------------------
08:31:20,491 INFO  [ReactorTag] +----------------------------------------
DEPRECATED: the default goal should be specified in the <build> section of project.xml instead of maven.xml
08:31:20,502 WARN  [PluginScriptParser] DEPRECATED: the default goal should be specified in the <build> section of project.xml instead of maven.xml
DEPRECATED: the default goal should be specified in the <build> section of project.xml instead of maven.xml
08:31:20,503 WARN  [PluginScriptParser] DEPRECATED: the default goal should be specified in the <build> section of project.xml instead of maven.xml
You are working offline so the build will continue, but geronimo-naming-1.1-SNAPSHOT.jar may be out of date!
08:31:20,859 WARN  [DependencyVerifier] You are working offline so the build will continue, but geronimo-naming-1.1-SNAPSHOT.jar may be out of date!
You are working offline so the build will continue, but geronimo-security-1.1-SNAPSHOT.jar may be out of date!
08:31:20,859 WARN  [DependencyVerifier] You are working offline so the build will continue, but geronimo-security-1.1-SNAPSHOT.jar may be out of date!
You are working offline so the build will continue, but geronimo-webservices-1.1-SNAPSHOT.jar may be out of date!
08:31:20,859 WARN  [DependencyVerifier] You are working offline so the build will continue, but geronimo-webservices-1.1-SNAPSHOT.jar may be out of date!
build:start:

multiproject:install-callback:
    [echo] Running jar:install for Geronimo :: Axis
java:prepare-filesystem:

java:compile:
<depend closure="false" srcdir="1.4" dump="false" destdir="/home/continuum/continuum-1.0.2/apps/continuum/work/68/modules/axis/target/classes"></depend>    [echo] Compiling to /home/continuum/continuum-1.0.2/apps/continuum/work/68/modules/axis/target/classes
Running post goal: java:compile
08:31:21,201 INFO  [PostGoalTag] Running post goal: java:compile
geronimo:dependency:


java:jar-resources:
Copying 1 file to /home/continuum/continuum-1.0.2/apps/continuum/work/68/modules/axis/target/classes

test:prepare-filesystem:

test:test-resources:

test:compile:

test:test:
    [echo] NOTICE: Skipping tests; they seem to have passed already
    [echo] No tests to run.
Running post goal: test:test
08:31:22,403 INFO  [PostGoalTag] Running post goal: test:test

jar:jar:
    [jar] Building jar: /home/continuum/continuum-1.0.2/apps/continuum/work/68/modules/axis/target/geronimo-axis-1.1-SNAPSHOT.jar

jar:install:
    [echo] Installing...
Uploading to geronimo/jars/geronimo-axis-1.1-SNAPSHOT.jar: 
.................... (42K)
Uploading to geronimo/poms/geronimo-axis-1.1-SNAPSHOT.pom: 
.................... (12K)

+----------------------------------------

build:end:

08:31:22,735 INFO  [ReactorTag] +----------------------------------------
| geronimo and geronimo-plugins Geronimo :: Test :: DDBeans
08:31:22,735 INFO  [ReactorTag] | geronimo and geronimo-plugins Geronimo :: Test :: DDBeans
| Memory: 14M/18M
08:31:22,736 INFO  [ReactorTag] | Memory: 14M/18M
+----------------------------------------
08:31:22,736 INFO  [ReactorTag] +----------------------------------------
DEPRECATED: the default goal should be specified in the <build> section of project.xml instead of maven.xml
08:31:22,746 WARN  [PluginScriptParser] DEPRECATED: the default goal should be specified in the <build> section of project.xml instead of maven.xml
DEPRECATED: the default goal should be specified in the <build> section of project.xml instead of maven.xml
08:31:22,747 WARN  [PluginScriptParser] DEPRECATED: the default goal should be specified in the <build> section of project.xml instead of maven.xml
build:start:

multiproject:install-callback:
    [echo] Running jar:install for Geronimo :: Test :: DDBeans
java:prepare-filesystem:

java:compile:
<depend closure="false" srcdir="1.4" dump="false" destdir="/home/continuum/continuum-1.0.2/apps/continuum/work/68/modules/test-ddbean/target/classes"></depend>    [echo] Compiling to /home/continuum/continuum-1.0.2/apps/continuum/work/68/modules/test-ddbean/target/classes

java:jar-resources:

test:prepare-filesystem:

test:test-resources:

test:compile:

test:test:
    [echo] NOTICE: Skipping tests; they seem to have passed already
    [echo] No tests to run.
Running post goal: test:test
08:31:23,762 INFO  [PostGoalTag] Running post goal: test:test

jar:jar:

jar:install:
    [echo] Installing...
Uploading to geronimo/jars/geronimo-test-ddbean-1.1-SNAPSHOT.jar: 
.................... (17K)
Uploading to geronimo/poms/geronimo-test-ddbean-1.1-SNAPSHOT.pom: 
.................... (10K)

+----------------------------------------

build:end:

08:31:24,012 INFO  [ReactorTag] +----------------------------------------
| geronimo and geronimo-plugins Geronimo :: Transaction
08:31:24,012 INFO  [ReactorTag] | geronimo and geronimo-plugins Geronimo :: Transaction
| Memory: 14M/18M
08:31:24,013 INFO  [ReactorTag] | Memory: 14M/18M
+----------------------------------------
08:31:24,013 INFO  [ReactorTag] +----------------------------------------
DEPRECATED: the default goal should be specified in the <build> section of project.xml instead of maven.xml
08:31:24,025 WARN  [PluginScriptParser] DEPRECATED: the default goal should be specified in the <build> section of project.xml instead of maven.xml
build:start:

multiproject:install-callback:
    [echo] Running jar:install for Geronimo :: Transaction
java:prepare-filesystem:

java:compile:
<depend closure="false" srcdir="1.4" dump="false" destdir="/home/continuum/continuum-1.0.2/apps/continuum/work/68/modules/transaction/target/classes"></depend>    [echo] Compiling to /home/continuum/continuum-1.0.2/apps/continuum/work/68/modules/transaction/target/classes

java:jar-resources:

test:prepare-filesystem:

test:test-resources:

test:compile:

test:test:
    [echo] NOTICE: Skipping tests; they seem to have passed already
    [echo] No tests to run.
Running post goal: test:test
08:31:25,078 INFO  [PostGoalTag] Running post goal: test:test

jar:jar:

jar:install:
    [echo] Installing...
Uploading to geronimo/jars/geronimo-transaction-1.1-SNAPSHOT.jar: 
.................... (73K)
Uploading to geronimo/poms/geronimo-transaction-1.1-SNAPSHOT.pom: 
.................... (12K)

+----------------------------------------

build:end:

08:31:25,410 INFO  [ReactorTag] +----------------------------------------
| geronimo and geronimo-plugins Geronimo :: Connector
08:31:25,410 INFO  [ReactorTag] | geronimo and geronimo-plugins Geronimo :: Connector
| Memory: 15M/18M
08:31:25,410 INFO  [ReactorTag] | Memory: 15M/18M
+----------------------------------------
08:31:25,411 INFO  [ReactorTag] +----------------------------------------
DEPRECATED: the default goal should be specified in the <build> section of project.xml instead of maven.xml
08:31:25,421 WARN  [PluginScriptParser] DEPRECATED: the default goal should be specified in the <build> section of project.xml instead of maven.xml
DEPRECATED: the default goal should be specified in the <build> section of project.xml instead of maven.xml
08:31:25,423 WARN  [PluginScriptParser] DEPRECATED: the default goal should be specified in the <build> section of project.xml instead of maven.xml
You are working offline so the build will continue, but geronimo-transaction-1.1-SNAPSHOT.jar may be out of date!
08:31:25,749 WARN  [DependencyVerifier] You are working offline so the build will continue, but geronimo-transaction-1.1-SNAPSHOT.jar may be out of date!
build:start:

multiproject:install-callback:
    [echo] Running jar:install for Geronimo :: Connector
java:prepare-filesystem:

java:compile:
<depend closure="false" srcdir="1.4" dump="false" destdir="/home/continuum/continuum-1.0.2/apps/continuum/work/68/modules/connector/target/classes"></depend>    [echo] Compiling to /home/continuum/continuum-1.0.2/apps/continuum/work/68/modules/connector/target/classes

java:jar-resources:

test:prepare-filesystem:

test:test-resources:

test:compile:

test:test:
    [echo] NOTICE: Skipping tests; they seem to have passed already
    [echo] No tests to run.
Running post goal: test:test
08:31:26,543 INFO  [PostGoalTag] Running post goal: test:test

jar:jar:

jar:install:
    [echo] Installing...
Uploading to geronimo/jars/geronimo-connector-1.1-SNAPSHOT.jar: 
.................... (130K)
Uploading to geronimo/poms/geronimo-connector-1.1-SNAPSHOT.pom: 
.................... (13K)

+----------------------------------------

build:end:

08:31:26,854 INFO  [ReactorTag] +----------------------------------------
| geronimo and geronimo-plugins Geronimo :: Security :: Builder
08:31:26,855 INFO  [ReactorTag] | geronimo and geronimo-plugins Geronimo :: Security :: Builder
| Memory: 17M/18M
08:31:26,855 INFO  [ReactorTag] | Memory: 17M/18M
+----------------------------------------
08:31:26,855 INFO  [ReactorTag] +----------------------------------------
DEPRECATED: the default goal should be specified in the <build> section of project.xml instead of maven.xml
08:31:26,867 WARN  [PluginScriptParser] DEPRECATED: the default goal should be specified in the <build> section of project.xml instead of maven.xml
DEPRECATED: the default goal should be specified in the <build> section of project.xml instead of maven.xml
08:31:26,868 WARN  [PluginScriptParser] DEPRECATED: the default goal should be specified in the <build> section of project.xml instead of maven.xml
build:start:

multiproject:install-callback:
    [echo] Running jar:install for Geronimo :: Security :: Builder
java:prepare-filesystem:

java:compile:
<depend closure="false" srcdir="1.4" dump="false" destdir="/home/continuum/continuum-1.0.2/apps/continuum/work/68/modules/security-builder/target/classes"></depend>    [echo] Compiling to /home/continuum/continuum-1.0.2/apps/continuum/work/68/modules/security-builder/target/classes

java:jar-resources:

test:prepare-filesystem:

test:test-resources:
Running post goal: test:test-resources
08:31:27,937 INFO  [PostGoalTag] Running post goal: test:test-resources
    [delete] Deleting directory /home/continuum/continuum-1.0.2/apps/continuum/work/68/modules/security-builder/target/database
    [mkdir] Created dir: /home/continuum/continuum-1.0.2/apps/continuum/work/68/modules/security-builder/target/database

test:compile:
    [echo] No test source files to compile.

test:test:
    [echo] NOTICE: Skipping tests; they seem to have passed already
    [echo] No tests to run.
Running post goal: test:test
08:31:28,357 INFO  [PostGoalTag] Running post goal: test:test

jar:jar:

jar:install:
    [echo] Installing...
Uploading to geronimo/jars/geronimo-security-builder-1.1-SNAPSHOT.jar: 
.................... (172K)
Uploading to geronimo/poms/geronimo-security-builder-1.1-SNAPSHOT.pom: 
.................... (12K)

+----------------------------------------

build:end:

08:31:28,770 INFO  [ReactorTag] +----------------------------------------
| geronimo and geronimo-plugins Geronimo :: J2EE
08:31:28,770 INFO  [ReactorTag] | geronimo and geronimo-plugins Geronimo :: J2EE
| Memory: 18M/18M
08:31:28,770 INFO  [ReactorTag] | Memory: 18M/18M
+----------------------------------------
08:31:28,770 INFO  [ReactorTag] +----------------------------------------
DEPRECATED: the default goal should be specified in the <build> section of project.xml instead of maven.xml
08:31:28,783 WARN  [PluginScriptParser] DEPRECATED: the default goal should be specified in the <build> section of project.xml instead of maven.xml
DEPRECATED: the default goal should be specified in the <build> section of project.xml instead of maven.xml
08:31:28,924 WARN  [PluginScriptParser] DEPRECATED: the default goal should be specified in the <build> section of project.xml instead of maven.xml
You are working offline so the build will continue, but geronimo-security-builder-1.1-SNAPSHOT.jar may be out of date!
08:31:29,248 WARN  [DependencyVerifier] You are working offline so the build will continue, but geronimo-security-builder-1.1-SNAPSHOT.jar may be out of date!
build:start:

multiproject:install-callback:
    [echo] Running jar:install for Geronimo :: J2EE
java:prepare-filesystem:

java:compile:
<depend closure="false" srcdir="1.4" dump="false" destdir="/home/continuum/continuum-1.0.2/apps/continuum/work/68/modules/j2ee-builder/target/classes"></depend>    [echo] Compiling to /home/continuum/continuum-1.0.2/apps/continuum/work/68/modules/j2ee-builder/target/classes
    [javac] Compiling 1 source file to /home/continuum/continuum-1.0.2/apps/continuum/work/68/modules/j2ee-builder/target/classes

java:jar-resources:

test:prepare-filesystem:

test:test-resources:

test:compile:
setupEar:

setupEar:

setupUnpackedEar:
setupBaseUnpackedEar:

setupBaseUnpackedEar:

setupBaseUnpackedEar:



test:test:
    [junit] Running org.apache.geronimo.j2ee.deployment.EARConfigBuilderTest
    [junit] Tests run: 64, Failures: 0, Errors: 0, Time elapsed: 2.859 sec
    [junit] Running org.apache.geronimo.j2ee.deployment.EJBRefContextTest
    [junit] Tests run: 1, Failures: 0, Errors: 0, Time elapsed: 0.067 sec
Running post goal: test:test
08:31:38,586 INFO  [PostGoalTag] Running post goal: test:test

jar:jar:
    [jar] Building jar: /home/continuum/continuum-1.0.2/apps/continuum/work/68/modules/j2ee-builder/target/geronimo-j2ee-builder-1.1-SNAPSHOT.jar

jar:install:
    [echo] Installing...
Uploading to geronimo/jars/geronimo-j2ee-builder-1.1-SNAPSHOT.jar: 
.................... (90K)
Uploading to geronimo/poms/geronimo-j2ee-builder-1.1-SNAPSHOT.pom: 
.................... (13K)

+----------------------------------------

build:end:

08:31:40,587 INFO  [ReactorTag] +----------------------------------------
| geronimo and geronimo-plugins Geronimo :: Naming :: Builder
08:31:40,587 INFO  [ReactorTag] | geronimo and geronimo-plugins Geronimo :: Naming :: Builder
| Memory: 15M/20M
08:31:40,587 INFO  [ReactorTag] | Memory: 15M/20M
+----------------------------------------
08:31:40,587 INFO  [ReactorTag] +----------------------------------------
DEPRECATED: the default goal should be specified in the <build> section of project.xml instead of maven.xml
08:31:40,599 WARN  [PluginScriptParser] DEPRECATED: the default goal should be specified in the <build> section of project.xml instead of maven.xml
DEPRECATED: the default goal should be specified in the <build> section of project.xml instead of maven.xml
08:31:40,600 WARN  [PluginScriptParser] DEPRECATED: the default goal should be specified in the <build> section of project.xml instead of maven.xml
You are working offline so the build will continue, but geronimo-j2ee-builder-1.1-SNAPSHOT.jar may be out of date!
08:31:40,934 WARN  [DependencyVerifier] You are working offline so the build will continue, but geronimo-j2ee-builder-1.1-SNAPSHOT.jar may be out of date!
build:start:

multiproject:install-callback:
    [echo] Running jar:install for Geronimo :: Naming :: Builder
java:prepare-filesystem:

java:compile:
<depend closure="false" srcdir="1.4" dump="false" destdir="/home/continuum/continuum-1.0.2/apps/continuum/work/68/modules/naming-builder/target/classes"></depend>    [echo] Compiling to /home/continuum/continuum-1.0.2/apps/continuum/work/68/modules/naming-builder/target/classes

java:jar-resources:

test:prepare-filesystem:

test:test-resources:

test:compile:

test:test:
    [echo] NOTICE: Skipping tests; they seem to have passed already
    [echo] No tests to run.
Running post goal: test:test
08:31:43,459 INFO  [PostGoalTag] Running post goal: test:test

jar:jar:

jar:install:
    [echo] Installing...
Uploading to geronimo/jars/geronimo-naming-builder-1.1-SNAPSHOT.jar: 
.................... (160K)
Uploading to geronimo/poms/geronimo-naming-builder-1.1-SNAPSHOT.pom: 
.................... (13K)

+----------------------------------------

build:end:

08:31:43,933 INFO  [ReactorTag] +----------------------------------------
| geronimo and geronimo-plugins Geronimo :: Connector :: Builder
08:31:43,933 INFO  [ReactorTag] | geronimo and geronimo-plugins Geronimo :: Connector :: Builder
| Memory: 16M/20M
08:31:43,933 INFO  [ReactorTag] | Memory: 16M/20M
+----------------------------------------
08:31:43,933 INFO  [ReactorTag] +----------------------------------------
DEPRECATED: the default goal should be specified in the <build> section of project.xml instead of maven.xml
08:31:43,946 WARN  [PluginScriptParser] DEPRECATED: the default goal should be specified in the <build> section of project.xml instead of maven.xml
DEPRECATED: the default goal should be specified in the <build> section of project.xml instead of maven.xml
08:31:43,947 WARN  [PluginScriptParser] DEPRECATED: the default goal should be specified in the <build> section of project.xml instead of maven.xml
You are working offline so the build will continue, but geronimo-test-ddbean-1.1-SNAPSHOT.jar may be out of date!
08:31:44,269 WARN  [DependencyVerifier] You are working offline so the build will continue, but geronimo-test-ddbean-1.1-SNAPSHOT.jar may be out of date!
You are working offline so the build will continue, but geronimo-connector-1.1-SNAPSHOT.jar may be out of date!
08:31:44,270 WARN  [DependencyVerifier] You are working offline so the build will continue, but geronimo-connector-1.1-SNAPSHOT.jar may be out of date!
You are working offline so the build will continue, but geronimo-naming-builder-1.1-SNAPSHOT.jar may be out of date!
08:31:44,270 WARN  [DependencyVerifier] You are working offline so the build will continue, but geronimo-naming-builder-1.1-SNAPSHOT.jar may be out of date!
build:start:

multiproject:install-callback:
    [echo] Running jar:install for Geronimo :: Connector :: Builder
java:prepare-filesystem:

java:compile:
<depend closure="false" srcdir="1.4" dump="false" destdir="/home/continuum/continuum-1.0.2/apps/continuum/work/68/modules/connector-builder/target/classes"></depend>    [echo] Compiling to /home/continuum/continuum-1.0.2/apps/continuum/work/68/modules/connector-builder/target/classes

java:jar-resources:

test:prepare-filesystem:

test:test-resources:

test:compile:

test:test:
    [echo] NOTICE: Skipping tests; they seem to have passed already
    [echo] No tests to run.
Running post goal: test:test
08:31:48,283 INFO  [PostGoalTag] Running post goal: test:test

jar:jar:

jar:install:
    [echo] Installing...
Uploading to geronimo/jars/geronimo-connector-builder-1.1-SNAPSHOT.jar: 
.................... (202K)
Uploading to geronimo/poms/geronimo-connector-builder-1.1-SNAPSHOT.pom: 
.................... (15K)

+----------------------------------------

build:end:

08:31:48,657 INFO  [ReactorTag] +----------------------------------------
| geronimo and geronimo-plugins Geronimo :: Axis :: Builder
08:31:48,657 INFO  [ReactorTag] | geronimo and geronimo-plugins Geronimo :: Axis :: Builder
| Memory: 18M/20M
08:31:48,657 INFO  [ReactorTag] | Memory: 18M/20M
+----------------------------------------
08:31:48,657 INFO  [ReactorTag] +----------------------------------------
DEPRECATED: the default goal should be specified in the <build> section of project.xml instead of maven.xml
08:31:48,668 WARN  [PluginScriptParser] DEPRECATED: the default goal should be specified in the <build> section of project.xml instead of maven.xml
DEPRECATED: the default goal should be specified in the <build> section of project.xml instead of maven.xml
08:31:48,669 WARN  [PluginScriptParser] DEPRECATED: the default goal should be specified in the <build> section of project.xml instead of maven.xml
You are working offline so the build will continue, but geronimo-axis-1.1-SNAPSHOT.jar may be out of date!
08:31:49,000 WARN  [DependencyVerifier] You are working offline so the build will continue, but geronimo-axis-1.1-SNAPSHOT.jar may be out of date!
You are working offline so the build will continue, but geronimo-connector-builder-1.1-SNAPSHOT.jar may be out of date!
08:31:49,000 WARN  [DependencyVerifier] You are working offline so the build will continue, but geronimo-connector-builder-1.1-SNAPSHOT.jar may be out of date!
build:start:

multiproject:install-callback:
    [echo] Running jar:install for Geronimo :: Axis :: Builder
java:prepare-filesystem:

java:compile:
<depend closure="false" srcdir="1.4" dump="false" destdir="/home/continuum/continuum-1.0.2/apps/continuum/work/68/modules/axis-builder/target/classes"></depend>    [echo] Compiling to /home/continuum/continuum-1.0.2/apps/continuum/work/68/modules/axis-builder/target/classes

java:jar-resources:

test:prepare-filesystem:

test:test-resources:

test:compile:

test:test:
    [echo] NOTICE: Skipping tests; they seem to have passed already
    [echo] No tests to run.
Running post goal: test:test
08:31:49,999 INFO  [PostGoalTag] Running post goal: test:test

jar:jar:

jar:install:
    [echo] Installing...
Uploading to geronimo/jars/geronimo-axis-builder-1.1-SNAPSHOT.jar: 
.................... (219K)
Uploading to geronimo/poms/geronimo-axis-builder-1.1-SNAPSHOT.pom: 
.................... (15K)

+----------------------------------------

build:end:

08:31:50,604 INFO  [ReactorTag] +----------------------------------------
| geronimo and geronimo-plugins Geronimo :: Client
08:31:50,604 INFO  [ReactorTag] | geronimo and geronimo-plugins Geronimo :: Client
| Memory: 14M/23M
08:31:50,605 INFO  [ReactorTag] | Memory: 14M/23M
+----------------------------------------
08:31:50,605 INFO  [ReactorTag] +----------------------------------------
DEPRECATED: the default goal should be specified in the <build> section of project.xml instead of maven.xml
08:31:50,617 WARN  [PluginScriptParser] DEPRECATED: the default goal should be specified in the <build> section of project.xml instead of maven.xml
build:start:

multiproject:install-callback:
    [echo] Running jar:install for Geronimo :: Client
java:prepare-filesystem:

java:compile:
<depend closure="false" srcdir="1.4" dump="false" destdir="/home/continuum/continuum-1.0.2/apps/continuum/work/68/modules/client/target/classes"></depend>    [echo] Compiling to /home/continuum/continuum-1.0.2/apps/continuum/work/68/modules/client/target/classes

java:jar-resources:

test:prepare-filesystem:

test:test-resources:

test:compile:
    [echo] No test source files to compile.

test:test:
    [echo] NOTICE: Skipping tests; they seem to have passed already
    [echo] No tests to run.
Running post goal: test:test
08:31:51,605 INFO  [PostGoalTag] Running post goal: test:test

jar:jar:

jar:install:
    [echo] Installing...
Uploading to geronimo/jars/geronimo-client-1.1-SNAPSHOT.jar: 
.................... (14K)
Uploading to geronimo/poms/geronimo-client-1.1-SNAPSHOT.pom: 
.................... (12K)

+----------------------------------------

build:end:

08:31:51,871 INFO  [ReactorTag] +----------------------------------------
| geronimo and geronimo-plugins Geronimo :: Client Builder
08:31:51,871 INFO  [ReactorTag] | geronimo and geronimo-plugins Geronimo :: Client Builder
| Memory: 14M/23M
08:31:51,871 INFO  [ReactorTag] | Memory: 14M/23M
+----------------------------------------
08:31:51,871 INFO  [ReactorTag] +----------------------------------------
DEPRECATED: the default goal should be specified in the <build> section of project.xml instead of maven.xml
08:31:51,882 WARN  [PluginScriptParser] DEPRECATED: the default goal should be specified in the <build> section of project.xml instead of maven.xml
DEPRECATED: the default goal should be specified in the <build> section of project.xml instead of maven.xml
08:31:51,883 WARN  [PluginScriptParser] DEPRECATED: the default goal should be specified in the <build> section of project.xml instead of maven.xml
You are working offline so the build will continue, but geronimo-client-1.1-SNAPSHOT.jar may be out of date!
08:31:52,206 WARN  [DependencyVerifier] You are working offline so the build will continue, but geronimo-client-1.1-SNAPSHOT.jar may be out of date!
build:start:

multiproject:install-callback:
    [echo] Running jar:install for Geronimo :: Client Builder
java:prepare-filesystem:

java:compile:
<depend closure="false" srcdir="1.4" dump="false" destdir="/home/continuum/continuum-1.0.2/apps/continuum/work/68/modules/client-builder/target/classes"></depend>    [echo] Compiling to /home/continuum/continuum-1.0.2/apps/continuum/work/68/modules/client-builder/target/classes

java:jar-resources:

test:prepare-filesystem:

test:test-resources:

test:compile:

test:test:
    [echo] NOTICE: Skipping tests; they seem to have passed already
    [echo] No tests to run.
Running post goal: test:test
08:31:53,192 INFO  [PostGoalTag] Running post goal: test:test

jar:jar:

jar:install:
    [echo] Installing...
Uploading to geronimo/jars/geronimo-client-builder-1.1-SNAPSHOT.jar: 
.................... (46K)
Uploading to geronimo/poms/geronimo-client-builder-1.1-SNAPSHOT.pom: 
.................... (14K)

+----------------------------------------

build:end:

08:31:53,495 INFO  [ReactorTag] +----------------------------------------
| geronimo and geronimo-plugins Geronimo :: Console Web
08:31:53,495 INFO  [ReactorTag] | geronimo and geronimo-plugins Geronimo :: Console Web
| Memory: 16M/23M
08:31:53,495 INFO  [ReactorTag] | Memory: 16M/23M
+----------------------------------------
08:31:53,495 INFO  [ReactorTag] +----------------------------------------
DEPRECATED: the default goal should be specified in the <build> section of project.xml instead of maven.xml
08:31:53,507 WARN  [PluginScriptParser] DEPRECATED: the default goal should be specified in the <build> section of project.xml instead of maven.xml
DEPRECATED: the default goal should be specified in the <build> section of project.xml instead of maven.xml
08:31:53,508 WARN  [PluginScriptParser] DEPRECATED: the default goal should be specified in the <build> section of project.xml instead of maven.xml
build:start:

multiproject:install-callback:
    [echo] Running jar:install for Geronimo :: Console Web
java:prepare-filesystem:

java:compile:
<depend closure="false" srcdir="1.4" dump="false" destdir="/home/continuum/continuum-1.0.2/apps/continuum/work/68/modules/console-web/target/classes"></depend>    [echo] Compiling to /home/continuum/continuum-1.0.2/apps/continuum/work/68/modules/console-web/target/classes

java:jar-resources:

test:prepare-filesystem:

test:test-resources:

test:compile:
    [echo] No test source files to compile.

test:test:
    [echo] NOTICE: Skipping tests; they seem to have passed already
    [echo] No tests to run.
Running post goal: test:test
08:31:54,522 INFO  [PostGoalTag] Running post goal: test:test

jar:jar:

jar:install:
    [echo] Installing...
Uploading to geronimo/jars/geronimo-console-web-1.1-SNAPSHOT.jar: 
.................... (17K)
Uploading to geronimo/poms/geronimo-console-web-1.1-SNAPSHOT.pom: 
.................... (11K)

+----------------------------------------

build:end:

08:31:54,777 INFO  [ReactorTag] +----------------------------------------
| geronimo and geronimo-plugins Geronimo :: Configuration Converter
08:31:54,778 INFO  [ReactorTag] | geronimo and geronimo-plugins Geronimo :: Configuration Converter
| Memory: 16M/23M
08:31:54,778 INFO  [ReactorTag] | Memory: 16M/23M
+----------------------------------------
08:31:54,778 INFO  [ReactorTag] +----------------------------------------
DEPRECATED: the default goal should be specified in the <build> section of project.xml instead of maven.xml
08:31:54,789 WARN  [PluginScriptParser] DEPRECATED: the default goal should be specified in the <build> section of project.xml instead of maven.xml
DEPRECATED: the default goal should be specified in the <build> section of project.xml instead of maven.xml
08:31:54,790 WARN  [PluginScriptParser] DEPRECATED: the default goal should be specified in the <build> section of project.xml instead of maven.xml
build:start:

multiproject:install-callback:
    [echo] Running jar:install for Geronimo :: Configuration Converter
java:prepare-filesystem:

java:compile:
<depend closure="false" srcdir="1.4" dump="false" destdir="/home/continuum/continuum-1.0.2/apps/continuum/work/68/modules/converter/target/classes"></depend>    [echo] Compiling to /home/continuum/continuum-1.0.2/apps/continuum/work/68/modules/converter/target/classes

java:jar-resources:

test:prepare-filesystem:

test:test-resources:

test:compile:
    [echo] No test source files to compile.

test:test:
    [echo] NOTICE: Skipping tests; they seem to have passed already
    [echo] No tests to run.
Running post goal: test:test
08:31:55,776 INFO  [PostGoalTag] Running post goal: test:test

jar:jar:

jar:install:
    [echo] Installing...
Uploading to geronimo/jars/geronimo-converter-1.1-SNAPSHOT.jar: 
.................... (25K)
Uploading to geronimo/poms/geronimo-converter-1.1-SNAPSHOT.pom: 
.................... (11K)

+----------------------------------------

build:end:

08:31:56,019 INFO  [ReactorTag] +----------------------------------------
| geronimo and geronimo-plugins Geronimo :: Web :: Builder
08:31:56,019 INFO  [ReactorTag] | geronimo and geronimo-plugins Geronimo :: Web :: Builder
| Memory: 17M/23M
08:31:56,019 INFO  [ReactorTag] | Memory: 17M/23M
+----------------------------------------
08:31:56,019 INFO  [ReactorTag] +----------------------------------------
DEPRECATED: the default goal should be specified in the <build> section of project.xml instead of maven.xml
08:31:56,031 WARN  [PluginScriptParser] DEPRECATED: the default goal should be specified in the <build> section of project.xml instead of maven.xml
DEPRECATED: the default goal should be specified in the <build> section of project.xml instead of maven.xml
08:31:56,032 WARN  [PluginScriptParser] DEPRECATED: the default goal should be specified in the <build> section of project.xml instead of maven.xml
build:start:

multiproject:install-callback:
    [echo] Running jar:install for Geronimo :: Web :: Builder
java:prepare-filesystem:

java:compile:
<depend closure="false" srcdir="1.4" dump="false" destdir="/home/continuum/continuum-1.0.2/apps/continuum/work/68/modules/web-builder/target/classes"></depend>    [echo] Compiling to /home/continuum/continuum-1.0.2/apps/continuum/work/68/modules/web-builder/target/classes
    [javac] Compiling 1 source file to /home/continuum/continuum-1.0.2/apps/continuum/work/68/modules/web-builder/target/classes
    [javac] Note: /home/continuum/continuum-1.0.2/apps/continuum/work/68/modules/web-builder/src/java/org/apache/geronimo/web/deployment/AbstractWebModuleBuilder.java uses or overrides a deprecated API.
    [javac] Note: Recompile with -deprecation for details.

java:jar-resources:

test:prepare-filesystem:

test:test-resources:

test:compile:

test:test:
    [junit] Running org.apache.geronimo.web.deployment.GenericToSpecificPlanConverterTest
    [junit] Tests run: 3, Failures: 0, Errors: 0, Time elapsed: 1.356 sec
    [junit] Running org.apache.geronimo.web.deployment.WebAppDConfigTest
    [junit] Tests run: 2, Failures: 0, Errors: 0, Time elapsed: 1.226 sec
Running post goal: test:test
08:32:01,364 INFO  [PostGoalTag] Running post goal: test:test

jar:jar:
    [jar] Building jar: /home/continuum/continuum-1.0.2/apps/continuum/work/68/modules/web-builder/target/geronimo-web-builder-1.1-SNAPSHOT.jar

jar:install:
    [echo] Installing...
Uploading to geronimo/jars/geronimo-web-builder-1.1-SNAPSHOT.jar: 
.................... (46K)
Uploading to geronimo/poms/geronimo-web-builder-1.1-SNAPSHOT.pom: 
.................... (13K)

+----------------------------------------

build:end:

08:32:01,756 INFO  [ReactorTag] +----------------------------------------
| geronimo and geronimo-plugins Geronimo :: Deploy :: JSR-88
08:32:01,756 INFO  [ReactorTag] | geronimo and geronimo-plugins Geronimo :: Deploy :: JSR-88
| Memory: 15M/23M
08:32:01,756 INFO  [ReactorTag] | Memory: 15M/23M
+----------------------------------------
08:32:01,756 INFO  [ReactorTag] +----------------------------------------
DEPRECATED: the default goal should be specified in the <build> section of project.xml instead of maven.xml
08:32:01,769 WARN  [PluginScriptParser] DEPRECATED: the default goal should be specified in the <build> section of project.xml instead of maven.xml
DEPRECATED: the default goal should be specified in the <build> section of project.xml instead of maven.xml
08:32:01,770 WARN  [PluginScriptParser] DEPRECATED: the default goal should be specified in the <build> section of project.xml instead of maven.xml
You are working offline so the build will continue, but geronimo-web-builder-1.1-SNAPSHOT.jar may be out of date!
08:32:02,096 WARN  [DependencyVerifier] You are working offline so the build will continue, but geronimo-web-builder-1.1-SNAPSHOT.jar may be out of date!
build:start:

multiproject:install-callback:
    [echo] Running jar:install for Geronimo :: Deploy :: JSR-88
java:prepare-filesystem:

java:compile:
<depend closure="false" srcdir="1.4" dump="false" destdir="/home/continuum/continuum-1.0.2/apps/continuum/work/68/modules/deploy-jsr88/target/classes"></depend>    [echo] Compiling to /home/continuum/continuum-1.0.2/apps/continuum/work/68/modules/deploy-jsr88/target/classes

java:jar-resources:

test:prepare-filesystem:

test:test-resources:

test:compile:

test:test:
    [echo] NOTICE: Skipping tests; they seem to have passed already
    [echo] No tests to run.
Running post goal: test:test
08:32:02,910 INFO  [PostGoalTag] Running post goal: test:test

jar:jar:
    [echo] Generating Manifest file for JSR88-Deployer

jar:install:
    [echo] Installing...
Uploading to geronimo/jars/geronimo-deploy-jsr88-1.1-SNAPSHOT.jar: 
.................... (59K)
Uploading to geronimo/poms/geronimo-deploy-jsr88-1.1-SNAPSHOT.pom: 
.................... (13K)

+----------------------------------------

build:end:

08:32:03,521 INFO  [ReactorTag] +----------------------------------------
| geronimo and geronimo-plugins Geronimo :: Deploy :: CLI Tool
08:32:03,522 INFO  [ReactorTag] | geronimo and geronimo-plugins Geronimo :: Deploy :: CLI Tool
| Memory: 18M/23M
08:32:03,522 INFO  [ReactorTag] | Memory: 18M/23M
+----------------------------------------
08:32:03,522 INFO  [ReactorTag] +----------------------------------------
DEPRECATED: the default goal should be specified in the <build> section of project.xml instead of maven.xml
08:32:03,540 WARN  [PluginScriptParser] DEPRECATED: the default goal should be specified in the <build> section of project.xml instead of maven.xml
DEPRECATED: the default goal should be specified in the <build> section of project.xml instead of maven.xml
08:32:03,540 WARN  [PluginScriptParser] DEPRECATED: the default goal should be specified in the <build> section of project.xml instead of maven.xml
You are working offline so the build will continue, but geronimo-deploy-jsr88-1.1-SNAPSHOT.jar may be out of date!
08:32:03,864 WARN  [DependencyVerifier] You are working offline so the build will continue, but geronimo-deploy-jsr88-1.1-SNAPSHOT.jar may be out of date!
build:start:

multiproject:install-callback:
    [echo] Running jar:install for Geronimo :: Deploy :: CLI Tool
java:prepare-filesystem:

java:compile:
<depend closure="false" srcdir="1.4" dump="false" destdir="/home/continuum/continuum-1.0.2/apps/continuum/work/68/modules/deploy-tool/target/classes"></depend>    [echo] Compiling to /home/continuum/continuum-1.0.2/apps/continuum/work/68/modules/deploy-tool/target/classes

java:jar-resources:

test:prepare-filesystem:

test:test-resources:

test:compile:

test:test:
    [echo] NOTICE: Skipping tests; they seem to have passed already
    [echo] No tests to run.
Running post goal: test:test
08:32:04,602 INFO  [PostGoalTag] Running post goal: test:test

jar:jar:

jar:install:
    [echo] Installing...
Uploading to geronimo/jars/geronimo-deploy-tool-1.1-SNAPSHOT.jar: 
.................... (60K)
Uploading to geronimo/poms/geronimo-deploy-tool-1.1-SNAPSHOT.pom: 
.................... (12K)

+----------------------------------------

build:end:

08:32:04,879 INFO  [ReactorTag] +----------------------------------------
| geronimo and geronimo-plugins Geronimo :: Derby
08:32:04,879 INFO  [ReactorTag] | geronimo and geronimo-plugins Geronimo :: Derby
| Memory: 19M/23M
08:32:04,879 INFO  [ReactorTag] | Memory: 19M/23M
+----------------------------------------
08:32:04,879 INFO  [ReactorTag] +----------------------------------------
DEPRECATED: the default goal should be specified in the <build> section of project.xml instead of maven.xml
08:32:04,891 WARN  [PluginScriptParser] DEPRECATED: the default goal should be specified in the <build> section of project.xml instead of maven.xml
build:start:

multiproject:install-callback:
    [echo] Running jar:install for Geronimo :: Derby
java:prepare-filesystem:

java:compile:
<depend closure="false" srcdir="1.4" dump="false" destdir="/home/continuum/continuum-1.0.2/apps/continuum/work/68/modules/derby/target/classes"></depend>    [echo] Compiling to /home/continuum/continuum-1.0.2/apps/continuum/work/68/modules/derby/target/classes

java:jar-resources:

test:prepare-filesystem:

test:test-resources:

test:compile:

test:test:
    [echo] NOTICE: Skipping tests; they seem to have passed already
    [echo] No tests to run.
Running post goal: test:test
08:32:05,943 INFO  [PostGoalTag] Running post goal: test:test

jar:jar:

jar:install:
    [echo] Installing...
Uploading to geronimo/jars/geronimo-derby-1.1-SNAPSHOT.jar: 
.................... (12K)
Uploading to geronimo/poms/geronimo-derby-1.1-SNAPSHOT.pom: 
.................... (11K)

+----------------------------------------

build:end:

08:32:06,186 INFO  [ReactorTag] +----------------------------------------
| geronimo and geronimo-plugins Geronimo :: Directory
08:32:06,186 INFO  [ReactorTag] | geronimo and geronimo-plugins Geronimo :: Directory
| Memory: 18M/23M
08:32:06,186 INFO  [ReactorTag] | Memory: 18M/23M
+----------------------------------------
08:32:06,186 INFO  [ReactorTag] +----------------------------------------
DEPRECATED: the default goal should be specified in the <build> section of project.xml instead of maven.xml
08:32:06,197 WARN  [PluginScriptParser] DEPRECATED: the default goal should be specified in the <build> section of project.xml instead of maven.xml
DEPRECATED: the default goal should be specified in the <build> section of project.xml instead of maven.xml
08:32:06,199 WARN  [PluginScriptParser] DEPRECATED: the default goal should be specified in the <build> section of project.xml instead of maven.xml
build:start:

multiproject:install-callback:
    [echo] Running jar:install for Geronimo :: Directory
java:prepare-filesystem:

java:compile:
<depend closure="false" srcdir="1.4" dump="false" destdir="/home/continuum/continuum-1.0.2/apps/continuum/work/68/modules/directory/target/classes"></depend>    [echo] Compiling to /home/continuum/continuum-1.0.2/apps/continuum/work/68/modules/directory/target/classes
Running post goal: java:compile
08:32:07,131 INFO  [PostGoalTag] Running post goal: java:compile
geronimo:dependency:


java:jar-resources:
Copying 1 file to /home/continuum/continuum-1.0.2/apps/continuum/work/68/modules/directory/target/classes

test:prepare-filesystem:

test:test-resources:

test:compile:

test:test:
    [echo] NOTICE: Skipping tests; they seem to have passed already
    [echo] No tests to run.
Running post goal: test:test
08:32:07,713 INFO  [PostGoalTag] Running post goal: test:test

jar:jar:
    [jar] Building jar: /home/continuum/continuum-1.0.2/apps/continuum/work/68/modules/directory/target/geronimo-directory-1.1-SNAPSHOT.jar

jar:install:
    [echo] Installing...
Uploading to geronimo/jars/geronimo-directory-1.1-SNAPSHOT.jar: 
.................... (113K)
Uploading to geronimo/poms/geronimo-directory-1.1-SNAPSHOT.pom: 
.................... (16K)

+----------------------------------------

build:end:

08:32:08,366 INFO  [ReactorTag] +----------------------------------------
| geronimo and geronimo-plugins Geronimo :: Deploy :: Hot Deployer
08:32:08,366 INFO  [ReactorTag] | geronimo and geronimo-plugins Geronimo :: Deploy :: Hot Deployer
| Memory: 20M/23M
08:32:08,366 INFO  [ReactorTag] | Memory: 20M/23M
+----------------------------------------
08:32:08,366 INFO  [ReactorTag] +----------------------------------------
DEPRECATED: the default goal should be specified in the <build> section of project.xml instead of maven.xml
08:32:08,378 WARN  [PluginScriptParser] DEPRECATED: the default goal should be specified in the <build> section of project.xml instead of maven.xml
DEPRECATED: the default goal should be specified in the <build> section of project.xml instead of maven.xml
08:32:08,379 WARN  [PluginScriptParser] DEPRECATED: the default goal should be specified in the <build> section of project.xml instead of maven.xml
You are working offline so the build will continue, but geronimo-deploy-tool-1.1-SNAPSHOT.jar may be out of date!
08:32:08,657 WARN  [DependencyVerifier] You are working offline so the build will continue, but geronimo-deploy-tool-1.1-SNAPSHOT.jar may be out of date!
build:start:

multiproject:install-callback:
    [echo] Running jar:install for Geronimo :: Deploy :: Hot Deployer
java:prepare-filesystem:

java:compile:
<depend closure="false" srcdir="1.4" dump="false" destdir="/home/continuum/continuum-1.0.2/apps/continuum/work/68/modules/hot-deploy/target/classes"></depend>    [echo] Compiling to /home/continuum/continuum-1.0.2/apps/continuum/work/68/modules/hot-deploy/target/classes

java:jar-resources:

test:prepare-filesystem:

test:test-resources:

test:compile:
    [echo] No test source files to compile.

test:test:
    [echo] NOTICE: Skipping tests; they seem to have passed already
    [echo] No tests to run.
Running post goal: test:test
08:32:09,369 INFO  [PostGoalTag] Running post goal: test:test

jar:jar:

jar:install:
    [echo] Installing...
Uploading to geronimo/jars/geronimo-hot-deploy-1.1-SNAPSHOT.jar: 
.................... (19K)
Uploading to geronimo/poms/geronimo-hot-deploy-1.1-SNAPSHOT.pom: 
.................... (12K)

+----------------------------------------

build:end:

08:32:09,641 INFO  [ReactorTag] +----------------------------------------
| geronimo and geronimo-plugins Geronimo :: Installer Processing
08:32:09,641 INFO  [ReactorTag] | geronimo and geronimo-plugins Geronimo :: Installer Processing
| Memory: 21M/23M
08:32:09,641 INFO  [ReactorTag] | Memory: 21M/23M
+----------------------------------------
08:32:09,641 INFO  [ReactorTag] +----------------------------------------
DEPRECATED: the default goal should be specified in the <build> section of project.xml instead of maven.xml
08:32:09,652 WARN  [PluginScriptParser] DEPRECATED: the default goal should be specified in the <build> section of project.xml instead of maven.xml
DEPRECATED: the default goal should be specified in the <build> section of project.xml instead of maven.xml
08:32:09,653 WARN  [PluginScriptParser] DEPRECATED: the default goal should be specified in the <build> section of project.xml instead of maven.xml
build:start:

multiproject:install-callback:
    [echo] Running jar:install for Geronimo :: Installer Processing
java:prepare-filesystem:

java:compile:
<depend closure="false" srcdir="1.4" dump="false" destdir="/home/continuum/continuum-1.0.2/apps/continuum/work/68/modules/installer-processing/target/classes"></depend>    [echo] Compiling to /home/continuum/continuum-1.0.2/apps/continuum/work/68/modules/installer-processing/target/classes
Running post goal: java:compile
08:32:10,232 INFO  [PostGoalTag] Running post goal: java:compile
geronimo:dependency:

    [echo] Maven local repo is: /home/continuum/.geronimo-1.1-maven/repository
    [echo] Maven build dir is: /home/continuum/continuum-1.0.2/apps/continuum/work/68/modules/installer-processing/target

java:jar-resources:

test:prepare-filesystem:

test:test-resources:

test:compile:
    [echo] No test source files to compile.

test:test:
    [echo] NOTICE: Skipping tests; they seem to have passed already
    [echo] No tests to run.
Running post goal: test:test
08:32:10,757 INFO  [PostGoalTag] Running post goal: test:test

jar:jar:

jar:install:
    [echo] Installing...
Uploading to geronimo/jars/geronimo-installer-processing-1.1-SNAPSHOT.jar: 
.................... (15K)
Uploading to geronimo/poms/geronimo-installer-processing-1.1-SNAPSHOT.pom: 
.................... (10K)

+----------------------------------------

build:end:

08:32:10,990 INFO  [ReactorTag] +----------------------------------------
| geronimo and geronimo-plugins Geronimo :: Installer Support
08:32:10,990 INFO  [ReactorTag] | geronimo and geronimo-plugins Geronimo :: Installer Support
| Memory: 21M/23M
08:32:10,990 INFO  [ReactorTag] | Memory: 21M/23M
+----------------------------------------
08:32:10,990 INFO  [ReactorTag] +----------------------------------------
DEPRECATED: the default goal should be specified in the <build> section of project.xml instead of maven.xml
08:32:11,000 WARN  [PluginScriptParser] DEPRECATED: the default goal should be specified in the <build> section of project.xml instead of maven.xml
DEPRECATED: the default goal should be specified in the <build> section of project.xml instead of maven.xml
08:32:11,001 WARN  [PluginScriptParser] DEPRECATED: the default goal should be specified in the <build> section of project.xml instead of maven.xml
build:start:

multiproject:install-callback:
    [echo] Running jar:install for Geronimo :: Installer Support
java:prepare-filesystem:

java:compile:
<depend closure="false" srcdir="1.4" dump="false" destdir="/home/continuum/continuum-1.0.2/apps/continuum/work/68/modules/installer-support/target/classes"></depend>    [echo] Compiling to /home/continuum/continuum-1.0.2/apps/continuum/work/68/modules/installer-support/target/classes
Running post goal: java:compile
08:32:11,581 INFO  [PostGoalTag] Running post goal: java:compile
geronimo:dependency:

    [echo] Maven local repo is: /home/continuum/.geronimo-1.1-maven/repository
    [echo] Maven build dir is: /home/continuum/continuum-1.0.2/apps/continuum/work/68/modules/installer-support/target
    [unjar] Expanding: /home/continuum/continuum-1.0.2/apps/continuum/work/68/modules/installer-support/target/standalone-compiler-custom-3.8.0.jar into /home/continuum/continuum-1.0.2/apps/continuum/work/68/modules/installer-support/target/tmp
    [echo] Built Geronimo custom IzPack installer jar
    [echo] Copying standalone-compiler-custom-3.8.0 to local repo

java:jar-resources:

test:prepare-filesystem:

test:test-resources:

test:compile:
    [echo] No test source files to compile.

test:test:
    [echo] NOTICE: Skipping tests; they seem to have passed already
    [echo] No tests to run.
Running post goal: test:test
08:32:13,336 INFO  [PostGoalTag] Running post goal: test:test

jar:jar:

jar:install:
    [echo] Installing...
Uploading to geronimo/jars/geronimo-installer-support-1.1-SNAPSHOT.jar: 
.................... (50K)
Uploading to geronimo/poms/geronimo-installer-support-1.1-SNAPSHOT.pom: 
.................... (10K)

+----------------------------------------

build:end:

08:32:13,588 INFO  [ReactorTag] +----------------------------------------
| geronimo and geronimo-plugins Geronimo :: JavaMail Transport
08:32:13,588 INFO  [ReactorTag] | geronimo and geronimo-plugins Geronimo :: JavaMail Transport
| Memory: 16M/28M
08:32:13,588 INFO  [ReactorTag] | Memory: 16M/28M
+----------------------------------------
08:32:13,588 INFO  [ReactorTag] +----------------------------------------
DEPRECATED: the default goal should be specified in the <build> section of project.xml instead of maven.xml
08:32:13,598 WARN  [PluginScriptParser] DEPRECATED: the default goal should be specified in the <build> section of project.xml instead of maven.xml
build:start:

multiproject:install-callback:
    [echo] Running jar:install for Geronimo :: JavaMail Transport
java:prepare-filesystem:

java:compile:
<depend closure="false" srcdir="1.4" dump="false" destdir="/home/continuum/continuum-1.0.2/apps/continuum/work/68/modules/javamail-transport/target/classes"></depend>    [echo] Compiling to /home/continuum/continuum-1.0.2/apps/continuum/work/68/modules/javamail-transport/target/classes

java:jar-resources:

test:prepare-filesystem:

test:test-resources:

test:compile:
    [echo] No test source files to compile.

test:test:
    [echo] NOTICE: Skipping tests; they seem to have passed already
    [echo] No tests to run.
Running post goal: test:test
08:32:14,605 INFO  [PostGoalTag] Running post goal: test:test

jar:jar:

jar:install:
    [echo] Installing...
Uploading to geronimo/jars/geronimo-javamail-transport-1.1-SNAPSHOT.jar: 
.................... (13K)
Uploading to geronimo/poms/geronimo-javamail-transport-1.1-SNAPSHOT.pom: 
.................... (10K)

+----------------------------------------

build:end:

08:32:14,848 INFO  [ReactorTag] +----------------------------------------
| geronimo and geronimo-plugins Geronimo :: Jetty
08:32:14,849 INFO  [ReactorTag] | geronimo and geronimo-plugins Geronimo :: Jetty
| Memory: 16M/28M
08:32:14,849 INFO  [ReactorTag] | Memory: 16M/28M
+----------------------------------------
08:32:14,849 INFO  [ReactorTag] +----------------------------------------
DEPRECATED: the default goal should be specified in the <build> section of project.xml instead of maven.xml
08:32:14,860 WARN  [PluginScriptParser] DEPRECATED: the default goal should be specified in the <build> section of project.xml instead of maven.xml
DEPRECATED: the default goal should be specified in the <build> section of project.xml instead of maven.xml
08:32:14,860 WARN  [PluginScriptParser] DEPRECATED: the default goal should be specified in the <build> section of project.xml instead of maven.xml
build:start:

multiproject:install-callback:
    [echo] Running jar:install for Geronimo :: Jetty
java:prepare-filesystem:

java:compile:
<depend closure="false" srcdir="1.4" dump="false" destdir="/home/continuum/continuum-1.0.2/apps/continuum/work/68/modules/jetty/target/classes"></depend>    [echo] Compiling to /home/continuum/continuum-1.0.2/apps/continuum/work/68/modules/jetty/target/classes
Running post goal: java:compile
08:32:15,502 INFO  [PostGoalTag] Running post goal: java:compile
geronimo:dependency:


java:jar-resources:
Copying 1 file to /home/continuum/continuum-1.0.2/apps/continuum/work/68/modules/jetty/target/classes

test:prepare-filesystem:

test:test-resources:

test:compile:

test:test:
    [echo] NOTICE: Skipping tests; they seem to have passed already
    [echo] No tests to run.
Running post goal: test:test
08:32:15,963 INFO  [PostGoalTag] Running post goal: test:test

jar:jar:
    [jar] Building jar: /home/continuum/continuum-1.0.2/apps/continuum/work/68/modules/jetty/target/geronimo-jetty-1.1-SNAPSHOT.jar

jar:install:
    [echo] Installing...
Uploading to geronimo/jars/geronimo-jetty-1.1-SNAPSHOT.jar: 
.................... (79K)
Uploading to geronimo/poms/geronimo-jetty-1.1-SNAPSHOT.pom: 
.................... (16K)

+----------------------------------------

build:end:

08:32:16,435 INFO  [ReactorTag] +----------------------------------------
| geronimo and geronimo-plugins Geronimo :: Jetty :: Builder
08:32:16,435 INFO  [ReactorTag] | geronimo and geronimo-plugins Geronimo :: Jetty :: Builder
| Memory: 19M/28M
08:32:16,435 INFO  [ReactorTag] | Memory: 19M/28M
+----------------------------------------
08:32:16,435 INFO  [ReactorTag] +----------------------------------------
DEPRECATED: the default goal should be specified in the <build> section of project.xml instead of maven.xml
08:32:16,448 WARN  [PluginScriptParser] DEPRECATED: the default goal should be specified in the <build> section of project.xml instead of maven.xml
DEPRECATED: the default goal should be specified in the <build> section of project.xml instead of maven.xml
08:32:16,449 WARN  [PluginScriptParser] DEPRECATED: the default goal should be specified in the <build> section of project.xml instead of maven.xml
You are working offline so the build will continue, but geronimo-jetty-1.1-SNAPSHOT.jar may be out of date!
08:32:16,774 WARN  [DependencyVerifier] You are working offline so the build will continue, but geronimo-jetty-1.1-SNAPSHOT.jar may be out of date!
build:start:

multiproject:install-callback:
    [echo] Running jar:install for Geronimo :: Jetty :: Builder
java:prepare-filesystem:

java:compile:
<depend closure="false" srcdir="1.4" dump="false" destdir="/home/continuum/continuum-1.0.2/apps/continuum/work/68/modules/jetty-builder/target/classes"></depend>    [echo] Compiling to /home/continuum/continuum-1.0.2/apps/continuum/work/68/modules/jetty-builder/target/classes

java:jar-resources:

test:prepare-filesystem:

test:test-resources:

test:compile:

test:test:
    [echo] NOTICE: Skipping tests; they seem to have passed already
    [echo] No tests to run.
Running post goal: test:test
08:32:17,805 INFO  [PostGoalTag] Running post goal: test:test

jar:jar:

jar:install:
    [echo] Installing...
Uploading to geronimo/jars/geronimo-jetty-builder-1.1-SNAPSHOT.jar: 
.................... (64K)
Uploading to geronimo/poms/geronimo-jetty-builder-1.1-SNAPSHOT.pom: 
.................... (18K)

+----------------------------------------

build:end:

08:32:18,083 INFO  [ReactorTag] +----------------------------------------
| geronimo and geronimo-plugins Geronimo :: JMX Remoting
08:32:18,083 INFO  [ReactorTag] | geronimo and geronimo-plugins Geronimo :: JMX Remoting
| Memory: 20M/28M
08:32:18,083 INFO  [ReactorTag] | Memory: 20M/28M
+----------------------------------------
08:32:18,083 INFO  [ReactorTag] +----------------------------------------
DEPRECATED: the default goal should be specified in the <build> section of project.xml instead of maven.xml
08:32:18,093 WARN  [PluginScriptParser] DEPRECATED: the default goal should be specified in the <build> section of project.xml instead of maven.xml
build:start:

multiproject:install-callback:
    [echo] Running jar:install for Geronimo :: JMX Remoting
java:prepare-filesystem:

java:compile:
<depend closure="false" srcdir="1.4" dump="false" destdir="/home/continuum/continuum-1.0.2/apps/continuum/work/68/modules/jmx-remoting/target/classes"></depend>    [echo] Compiling to /home/continuum/continuum-1.0.2/apps/continuum/work/68/modules/jmx-remoting/target/classes

java:jar-resources:

test:prepare-filesystem:

test:test-resources:

test:compile:

test:test:
    [echo] NOTICE: Skipping tests; they seem to have passed already
    [echo] No tests to run.
Running post goal: test:test
08:32:19,166 INFO  [PostGoalTag] Running post goal: test:test

jar:jar:

jar:install:
    [echo] Installing...
Uploading to geronimo/jars/geronimo-jmxremoting-1.1-SNAPSHOT.jar: 
.................... (10K)
Uploading to geronimo/poms/geronimo-jmxremoting-1.1-SNAPSHOT.pom: 
.................... (11K)

+----------------------------------------

build:end:

08:32:19,418 INFO  [ReactorTag] +----------------------------------------
| geronimo and geronimo-plugins Geronimo :: Mail
08:32:19,418 INFO  [ReactorTag] | geronimo and geronimo-plugins Geronimo :: Mail
| Memory: 21M/28M
08:32:19,418 INFO  [ReactorTag] | Memory: 21M/28M
+----------------------------------------
08:32:19,418 INFO  [ReactorTag] +----------------------------------------
DEPRECATED: the default goal should be specified in the <build> section of project.xml instead of maven.xml
08:32:19,430 WARN  [PluginScriptParser] DEPRECATED: the default goal should be specified in the <build> section of project.xml instead of maven.xml
build:start:

multiproject:install-callback:
    [echo] Running jar:install for Geronimo :: Mail
java:prepare-filesystem:

java:compile:
<depend closure="false" srcdir="1.4" dump="false" destdir="/home/continuum/continuum-1.0.2/apps/continuum/work/68/modules/mail/target/classes"></depend>    [echo] Compiling to /home/continuum/continuum-1.0.2/apps/continuum/work/68/modules/mail/target/classes

java:jar-resources:

test:prepare-filesystem:

test:test-resources:

test:compile:

test:test:
    [echo] NOTICE: Skipping tests; they seem to have passed already
    [echo] No tests to run.
Running post goal: test:test
08:32:21,377 INFO  [PostGoalTag] Running post goal: test:test

jar:jar:

jar:install:
    [echo] Installing...
Uploading to geronimo/jars/geronimo-mail-1.1-SNAPSHOT.jar: 
.................... (21K)
Uploading to geronimo/poms/geronimo-mail-1.1-SNAPSHOT.pom: 
.................... (11K)

+----------------------------------------

build:end:

08:32:21,637 INFO  [ReactorTag] +----------------------------------------
| geronimo and geronimo-plugins Geronimo :: Scripts
08:32:21,637 INFO  [ReactorTag] | geronimo and geronimo-plugins Geronimo :: Scripts
| Memory: 21M/28M
08:32:21,638 INFO  [ReactorTag] | Memory: 21M/28M
+----------------------------------------
08:32:21,638 INFO  [ReactorTag] +----------------------------------------
DEPRECATED: the default goal should be specified in the <build> section of project.xml instead of maven.xml
08:32:21,650 WARN  [PluginScriptParser] DEPRECATED: the default goal should be specified in the <build> section of project.xml instead of maven.xml
build:start:

multiproject:install-callback:
    [echo] Running jar:install for Geronimo :: Scripts
java:prepare-filesystem:

java:compile:
    [echo] Compiling to /home/continuum/continuum-1.0.2/apps/continuum/work/68/modules/scripts/target/classes
    [echo] No java source files to compile.

java:jar-resources:

test:prepare-filesystem:

test:test-resources:

test:compile:
    [echo] No test source files to compile.

test:test:
    [echo] NOTICE: Skipping tests; they seem to have passed already
    [echo] No tests to run.
Running post goal: test:test
08:32:22,631 INFO  [PostGoalTag] Running post goal: test:test

jar:jar:

jar:install:
    [echo] Installing...
Uploading to geronimo/jars/geronimo-scripts-1.1-SNAPSHOT.jar: 
.................... (3214K)
Uploading to geronimo/poms/geronimo-scripts-1.1-SNAPSHOT.pom: 
.................... (10K)

+----------------------------------------

build:end:

08:32:23,262 INFO  [ReactorTag] +----------------------------------------
| geronimo and geronimo-plugins Geronimo :: Timer
08:32:23,262 INFO  [ReactorTag] | geronimo and geronimo-plugins Geronimo :: Timer
| Memory: 21M/28M
08:32:23,262 INFO  [ReactorTag] | Memory: 21M/28M
+----------------------------------------
08:32:23,262 INFO  [ReactorTag] +----------------------------------------
DEPRECATED: the default goal should be specified in the <build> section of project.xml instead of maven.xml
08:32:23,273 WARN  [PluginScriptParser] DEPRECATED: the default goal should be specified in the <build> section of project.xml instead of maven.xml
build:start:

multiproject:install-callback:
    [echo] Running jar:install for Geronimo :: Timer
java:prepare-filesystem:

java:compile:
<depend closure="false" srcdir="1.4" dump="false" destdir="/home/continuum/continuum-1.0.2/apps/continuum/work/68/modules/timer/target/classes"></depend>    [echo] Compiling to /home/continuum/continuum-1.0.2/apps/continuum/work/68/modules/timer/target/classes

java:jar-resources:

test:prepare-filesystem:

test:test-resources:

test:compile:

test:test:
    [echo] NOTICE: Skipping tests; they seem to have passed already
    [echo] No tests to run.
Running post goal: test:test
08:32:24,346 INFO  [PostGoalTag] Running post goal: test:test

jar:jar:

jar:install:
    [echo] Installing...
Uploading to geronimo/jars/geronimo-timer-1.1-SNAPSHOT.jar: 
.................... (38K)
Uploading to geronimo/poms/geronimo-timer-1.1-SNAPSHOT.pom: 
.................... (12K)

+----------------------------------------

build:end:

08:32:24,626 INFO  [ReactorTag] +----------------------------------------
| geronimo and geronimo-plugins Geronimo :: Tomcat
08:32:24,626 INFO  [ReactorTag] | geronimo and geronimo-plugins Geronimo :: Tomcat
| Memory: 21M/28M
08:32:24,626 INFO  [ReactorTag] | Memory: 21M/28M
+----------------------------------------
08:32:24,627 INFO  [ReactorTag] +----------------------------------------
DEPRECATED: the default goal should be specified in the <build> section of project.xml instead of maven.xml
08:32:24,638 WARN  [PluginScriptParser] DEPRECATED: the default goal should be specified in the <build> section of project.xml instead of maven.xml
DEPRECATED: the default goal should be specified in the <build> section of project.xml instead of maven.xml
08:32:24,640 WARN  [PluginScriptParser] DEPRECATED: the default goal should be specified in the <build> section of project.xml instead of maven.xml
build:start:

multiproject:install-callback:
    [echo] Running jar:install for Geronimo :: Tomcat
java:prepare-filesystem:

java:compile:
<depend closure="false" srcdir="1.4" dump="false" destdir="/home/continuum/continuum-1.0.2/apps/continuum/work/68/modules/tomcat/target/classes"></depend>    [echo] Compiling to /home/continuum/continuum-1.0.2/apps/continuum/work/68/modules/tomcat/target/classes
Running post goal: java:compile
08:32:25,292 INFO  [PostGoalTag] Running post goal: java:compile
geronimo:dependency:


java:jar-resources:
Copying 1 file to /home/continuum/continuum-1.0.2/apps/continuum/work/68/modules/tomcat/target/classes

test:prepare-filesystem:

test:test-resources:

test:compile:

test:test:
    [echo] NOTICE: Skipping tests; they seem to have passed already
    [echo] No tests to run.
Running post goal: test:test
08:32:26,250 INFO  [PostGoalTag] Running post goal: test:test

jar:jar:
    [jar] Building jar: /home/continuum/continuum-1.0.2/apps/continuum/work/68/modules/tomcat/target/geronimo-tomcat-1.1-SNAPSHOT.jar

jar:install:
    [echo] Installing...
Uploading to geronimo/jars/geronimo-tomcat-1.1-SNAPSHOT.jar: 
.................... (130K)
Uploading to geronimo/poms/geronimo-tomcat-1.1-SNAPSHOT.pom: 
.................... (21K)

+----------------------------------------

build:end:

08:32:26,793 INFO  [ReactorTag] +----------------------------------------
| geronimo and geronimo-plugins Geronimo :: Tomcat :: Builder
08:32:26,793 INFO  [ReactorTag] | geronimo and geronimo-plugins Geronimo :: Tomcat :: Builder
| Memory: 23M/28M
08:32:26,793 INFO  [ReactorTag] | Memory: 23M/28M
+----------------------------------------
08:32:26,793 INFO  [ReactorTag] +----------------------------------------
DEPRECATED: the default goal should be specified in the <build> section of project.xml instead of maven.xml
08:32:26,807 WARN  [PluginScriptParser] DEPRECATED: the default goal should be specified in the <build> section of project.xml instead of maven.xml
DEPRECATED: the default goal should be specified in the <build> section of project.xml instead of maven.xml
08:32:26,808 WARN  [PluginScriptParser] DEPRECATED: the default goal should be specified in the <build> section of project.xml instead of maven.xml
You are working offline so the build will continue, but geronimo-tomcat-1.1-SNAPSHOT.jar may be out of date!
08:32:27,133 WARN  [DependencyVerifier] You are working offline so the build will continue, but geronimo-tomcat-1.1-SNAPSHOT.jar may be out of date!
You are working offline so the build will continue, but geronimo-axis-builder-1.1-SNAPSHOT.jar may be out of date!
08:32:27,133 WARN  [DependencyVerifier] You are working offline so the build will continue, but geronimo-axis-builder-1.1-SNAPSHOT.jar may be out of date!
build:start:

multiproject:install-callback:
    [echo] Running jar:install for Geronimo :: Tomcat :: Builder
java:prepare-filesystem:

java:compile:
<depend closure="false" srcdir="1.4" dump="false" destdir="/home/continuum/continuum-1.0.2/apps/continuum/work/68/modules/tomcat-builder/target/classes"></depend>    [echo] Compiling to /home/continuum/continuum-1.0.2/apps/continuum/work/68/modules/tomcat-builder/target/classes

java:jar-resources:

test:prepare-filesystem:

test:test-resources:

test:compile:

test:test:
    [echo] NOTICE: Skipping tests; they seem to have passed already
    [echo] No tests to run.
Running post goal: test:test
08:32:28,602 INFO  [PostGoalTag] Running post goal: test:test

jar:jar:

jar:install:
    [echo] Installing...
Uploading to geronimo/jars/geronimo-tomcat-builder-1.1-SNAPSHOT.jar: 
.................... (65K)
Uploading to geronimo/poms/geronimo-tomcat-builder-1.1-SNAPSHOT.pom: 
.................... (20K)

+----------------------------------------

build:end:

08:32:28,927 INFO  [ReactorTag] +----------------------------------------
| geronimo and geronimo-plugins Geronimo :: Upgrade
08:32:28,927 INFO  [ReactorTag] | geronimo and geronimo-plugins Geronimo :: Upgrade
| Memory: 27M/28M
08:32:28,927 INFO  [ReactorTag] | Memory: 27M/28M
+----------------------------------------
08:32:28,927 INFO  [ReactorTag] +----------------------------------------
DEPRECATED: the default goal should be specified in the <build> section of project.xml instead of maven.xml
08:32:28,940 WARN  [PluginScriptParser] DEPRECATED: the default goal should be specified in the <build> section of project.xml instead of maven.xml
You are working offline so the build will continue, but geronimo-client-builder-1.1-SNAPSHOT.jar may be out of date!
08:32:29,267 WARN  [DependencyVerifier] You are working offline so the build will continue, but geronimo-client-builder-1.1-SNAPSHOT.jar may be out of date!
You are working offline so the build will continue, but geronimo-jetty-builder-1.1-SNAPSHOT.jar may be out of date!
08:32:29,267 WARN  [DependencyVerifier] You are working offline so the build will continue, but geronimo-jetty-builder-1.1-SNAPSHOT.jar may be out of date!
You are working offline so the build will continue, but geronimo-tomcat-builder-1.1-SNAPSHOT.jar may be out of date!
08:32:29,267 WARN  [DependencyVerifier] You are working offline so the build will continue, but geronimo-tomcat-builder-1.1-SNAPSHOT.jar may be out of date!
You are working offline so the build will continue, but openejb-builder-2.1-SNAPSHOT.jar may be out of date!
08:32:29,267 WARN  [DependencyVerifier] You are working offline so the build will continue, but openejb-builder-2.1-SNAPSHOT.jar may be out of date!
build:start:

multiproject:install-callback:
    [echo] Running jar:install for Geronimo :: Upgrade
java:prepare-filesystem:

java:compile:
<depend closure="false" srcdir="1.4" dump="false" destdir="/home/continuum/continuum-1.0.2/apps/continuum/work/68/modules/upgrade/target/classes"></depend>    [echo] Compiling to /home/continuum/continuum-1.0.2/apps/continuum/work/68/modules/upgrade/target/classes

java:jar-resources:

test:prepare-filesystem:

test:test-resources:

test:compile:

test:test:
    [echo] NOTICE: Skipping tests; they seem to have passed already
    [echo] No tests to run.
Running post goal: test:test
08:32:29,959 INFO  [PostGoalTag] Running post goal: test:test

jar:jar:

jar:install:
    [echo] Installing...
Uploading to geronimo/jars/geronimo-upgrade-1.1-SNAPSHOT.jar: 
.................... (9K)
Uploading to geronimo/poms/geronimo-upgrade-1.1-SNAPSHOT.pom: 
.................... (11K)

+----------------------------------------

build:end:

08:32:30,210 INFO  [ReactorTag] +----------------------------------------
| geronimo and geronimo-plugins Geronimo :: Maven Assembly Plugin
08:32:30,210 INFO  [ReactorTag] | geronimo and geronimo-plugins Geronimo :: Maven Assembly Plugin
| Memory: 27M/28M
08:32:30,210 INFO  [ReactorTag] | Memory: 27M/28M
+----------------------------------------
08:32:30,210 INFO  [ReactorTag] +----------------------------------------
DEPRECATED: the default goal should be specified in the <build> section of project.xml instead of maven.xml
08:32:30,220 WARN  [PluginScriptParser] DEPRECATED: the default goal should be specified in the <build> section of project.xml instead of maven.xml
build:start:

multiproject:install-callback:
    [echo] Running plugin:repository-install for Geronimo :: Maven Assembly Plugin
plugin:plugin:
java:prepare-filesystem:

java:compile:
    [echo] Compiling to /home/continuum/continuum-1.0.2/apps/continuum/work/68/plugins/geronimo-assembly-plugin/target/classes

java:jar-resources:

test:prepare-filesystem:

test:test-resources:

test:compile:
    [echo] No test source files to compile.

test:test:
    [echo] No tests to run.

jar:jar:


plugin:repository-install:
    [echo] Installing...
Uploading to geronimo/plugins/geronimo-assembly-plugin-1.1.0-9.jar: 
.................... (16K)
Uploading to geronimo/poms/geronimo-assembly-plugin-1.1.0-9.pom: 
.................... (1K)

+----------------------------------------

build:end:

08:32:31,301 INFO  [ReactorTag] +----------------------------------------
| geronimo and geronimo-plugins Geronimo :: Maven Deployment Plugin
08:32:31,302 INFO  [ReactorTag] | geronimo and geronimo-plugins Geronimo :: Maven Deployment Plugin
| Memory: 15M/28M
08:32:31,302 INFO  [ReactorTag] | Memory: 15M/28M
+----------------------------------------
08:32:31,302 INFO  [ReactorTag] +----------------------------------------
DEPRECATED: the default goal should be specified in the <build> section of project.xml instead of maven.xml
08:32:31,312 WARN  [PluginScriptParser] DEPRECATED: the default goal should be specified in the <build> section of project.xml instead of maven.xml
build:start:

multiproject:install-callback:
    [echo] Running plugin:repository-install for Geronimo :: Maven Deployment Plugin
plugin:plugin:
java:prepare-filesystem:

java:compile:
    [echo] Compiling to /home/continuum/continuum-1.0.2/apps/continuum/work/68/plugins/geronimo-deployment-plugin/target/classes

java:jar-resources:

test:prepare-filesystem:

test:test-resources:

test:compile:
    [echo] No test source files to compile.

test:test:
    [echo] No tests to run.

jar:jar:


plugin:repository-install:
    [echo] Installing...
Uploading to geronimo/plugins/geronimo-deployment-plugin-1.1.0-1.jar: 
.................... (31K)
Uploading to geronimo/poms/geronimo-deployment-plugin-1.1.0-1.pom: 
.................... (3K)

+----------------------------------------

build:end:

08:32:32,203 INFO  [ReactorTag] +----------------------------------------
| geronimo and geronimo-plugins Geronimo :: IZPack Installer Build Plugin
08:32:32,203 INFO  [ReactorTag] | geronimo and geronimo-plugins Geronimo :: IZPack Installer Build Plugin
| Memory: 16M/28M
08:32:32,203 INFO  [ReactorTag] | Memory: 16M/28M
+----------------------------------------
08:32:32,203 INFO  [ReactorTag] +----------------------------------------
DEPRECATED: the default goal should be specified in the <build> section of project.xml instead of maven.xml
08:32:32,215 WARN  [PluginScriptParser] DEPRECATED: the default goal should be specified in the <build> section of project.xml instead of maven.xml
build:start:

multiproject:install-callback:
    [echo] Running plugin:repository-install for Geronimo :: IZPack Installer Build Plugin
plugin:plugin:
java:prepare-filesystem:

java:compile:
    [echo] Compiling to /home/continuum/continuum-1.0.2/apps/continuum/work/68/plugins/geronimo-izpack-plugin/target/classes
    [echo] No java source files to compile.

java:jar-resources:

test:prepare-filesystem:

test:test-resources:

test:compile:
    [echo] No test source files to compile.

test:test:
    [echo] No tests to run.

jar:jar:


plugin:repository-install:
    [echo] Installing...
Uploading to geronimo/plugins/geronimo-izpack-plugin-1.1-SNAPSHOT.jar: 
.................... (7K)
Uploading to geronimo/poms/geronimo-izpack-plugin-1.1-SNAPSHOT.pom: 
.................... (1K)

+----------------------------------------

build:end:

08:32:33,041 INFO  [ReactorTag] +----------------------------------------
| geronimo and geronimo-plugins Geronimo :: Maven Packaging Plugin
08:32:33,041 INFO  [ReactorTag] | geronimo and geronimo-plugins Geronimo :: Maven Packaging Plugin
| Memory: 16M/28M
08:32:33,041 INFO  [ReactorTag] | Memory: 16M/28M
+----------------------------------------
08:32:33,041 INFO  [ReactorTag] +----------------------------------------
DEPRECATED: the default goal should be specified in the <build> section of project.xml instead of maven.xml
08:32:33,053 WARN  [PluginScriptParser] DEPRECATED: the default goal should be specified in the <build> section of project.xml instead of maven.xml
build:start:

multiproject:install-callback:
    [echo] Running plugin:repository-install for Geronimo :: Maven Packaging Plugin
plugin:plugin:
java:prepare-filesystem:

java:compile:
    [echo] Compiling to /home/continuum/continuum-1.0.2/apps/continuum/work/68/plugins/geronimo-packaging-plugin/target/classes

java:jar-resources:

test:prepare-filesystem:

test:test-resources:

test:compile:

test:test:
    [junit] Running org.apache.geronimo.plugin.packaging.PlanProcessorTest
    [junit] Tests run: 1, Failures: 0, Errors: 0, Time elapsed: 0.863 sec

jar:jar:


plugin:repository-install:
    [echo] Installing...
Uploading to geronimo/plugins/geronimo-packaging-plugin-1.1.0-4.jar: 
.................... (28K)
Uploading to geronimo/poms/geronimo-packaging-plugin-1.1.0-4.pom: 
.................... (4K)


build:end:


Starting the reactor...
new2:
08:32:35,098 INFO  [ReactorTag] Starting the reactor...
Our processing order:
08:32:35,258 INFO  [ReactorTag] Our processing order:
OpenEJB :: Core
08:32:35,259 INFO  [ReactorTag] OpenEJB :: Core
OpenEJB :: PK Generation :: Builder
08:32:35,259 INFO  [ReactorTag] OpenEJB :: PK Generation :: Builder
OpenEJB :: Builder
08:32:35,259 INFO  [ReactorTag] OpenEJB :: Builder
+----------------------------------------
08:32:35,259 INFO  [ReactorTag] +----------------------------------------
| openejb OpenEJB :: Core
08:32:35,259 INFO  [ReactorTag] | openejb OpenEJB :: Core
| Memory: 19M/28M
08:32:35,260 INFO  [ReactorTag] | Memory: 19M/28M
+----------------------------------------
08:32:35,260 INFO  [ReactorTag] +----------------------------------------
DEPRECATED: the default goal should be specified in the <build> section of project.xml instead of maven.xml
08:32:35,273 WARN  [PluginScriptParser] DEPRECATED: the default goal should be specified in the <build> section of project.xml instead of maven.xml
DEPRECATED: the default goal should be specified in the <build> section of project.xml instead of maven.xml
08:32:35,274 WARN  [PluginScriptParser] DEPRECATED: the default goal should be specified in the <build> section of project.xml instead of maven.xml
You are working offline so the build will continue, but geronimo-timer-1.1-SNAPSHOT.jar may be out of date!
08:32:35,605 WARN  [DependencyVerifier] You are working offline so the build will continue, but geronimo-timer-1.1-SNAPSHOT.jar may be out of date!
You are working offline so the build will continue, but geronimo-corba_2.3_spec-1.1-SNAPSHOT.jar may be out of date!
08:32:35,605 WARN  [DependencyVerifier] You are working offline so the build will continue, but geronimo-corba_2.3_spec-1.1-SNAPSHOT.jar may be out of date!
build:start:

multiproject:install-callback:
    [echo] Running jar:install for OpenEJB :: Core
java:prepare-filesystem:

java:compile:
<depend closure="false" srcdir="1.4" dump="false" destdir="/home/continuum/continuum-1.0.2/apps/continuum/work/68/openejb/modules/core/target/classes"></depend>    [echo] Compiling to /home/continuum/continuum-1.0.2/apps/continuum/work/68/openejb/modules/core/target/classes
Running post goal: java:compile
08:32:36,077 INFO  [PostGoalTag] Running post goal: java:compile
geronimo:dependency:


java:jar-resources:
Copying 1 file to /home/continuum/continuum-1.0.2/apps/continuum/work/68/openejb/modules/core/target/classes

test:prepare-filesystem:

test:test-resources:

test:compile:

test:test:
    [echo] NOTICE: Skipping tests; they seem to have passed already
    [echo] No tests to run.
Running post goal: test:test
08:32:37,136 INFO  [PostGoalTag] Running post goal: test:test

jar:jar:
    [jar] Building jar: /home/continuum/continuum-1.0.2/apps/continuum/work/68/openejb/modules/core/target/openejb-core-2.1-SNAPSHOT.jar

jar:install:
    [echo] Installing...
Uploading to openejb/jars/openejb-core-2.1-SNAPSHOT.jar: 
.................... (1186K)
Uploading to openejb/poms/openejb-core-2.1-SNAPSHOT.pom: 
.................... (13K)

+----------------------------------------

build:end:

08:32:38,668 INFO  [ReactorTag] +----------------------------------------
| openejb OpenEJB :: PK Generation :: Builder
08:32:38,668 INFO  [ReactorTag] | openejb OpenEJB :: PK Generation :: Builder
| Memory: 21M/28M
08:32:38,668 INFO  [ReactorTag] | Memory: 21M/28M
+----------------------------------------
08:32:38,668 INFO  [ReactorTag] +----------------------------------------
DEPRECATED: the default goal should be specified in the <build> section of project.xml instead of maven.xml
08:32:38,680 WARN  [PluginScriptParser] DEPRECATED: the default goal should be specified in the <build> section of project.xml instead of maven.xml
DEPRECATED: the default goal should be specified in the <build> section of project.xml instead of maven.xml
08:32:38,681 WARN  [PluginScriptParser] DEPRECATED: the default goal should be specified in the <build> section of project.xml instead of maven.xml
You are working offline so the build will continue, but openejb-core-2.1-SNAPSHOT.jar may be out of date!
08:32:38,965 WARN  [DependencyVerifier] You are working offline so the build will continue, but openejb-core-2.1-SNAPSHOT.jar may be out of date!
build:start:

multiproject:install-callback:
    [echo] Running jar:install for OpenEJB :: PK Generation :: Builder
java:prepare-filesystem:

java:compile:
<depend closure="false" srcdir="1.4" dump="false" destdir="/home/continuum/continuum-1.0.2/apps/continuum/work/68/openejb/modules/pkgen-builder/target/classes"></depend>    [echo] Compiling to /home/continuum/continuum-1.0.2/apps/continuum/work/68/openejb/modules/pkgen-builder/target/classes

java:jar-resources:

test:prepare-filesystem:

test:test-resources:

test:compile:
    [echo] No test source files to compile.

test:test:
    [echo] NOTICE: Skipping tests; they seem to have passed already
    [echo] No tests to run.
Running post goal: test:test
08:32:40,111 INFO  [PostGoalTag] Running post goal: test:test

jar:jar:

jar:install:
    [echo] Installing...
Uploading to openejb/jars/openejb-pkgen-builder-2.1-SNAPSHOT.jar: 
.................... (52K)
Uploading to openejb/poms/openejb-pkgen-builder-2.1-SNAPSHOT.pom: 
.................... (6K)

+----------------------------------------

build:end:

08:32:40,373 INFO  [ReactorTag] +----------------------------------------
| openejb OpenEJB :: Builder
08:32:40,373 INFO  [ReactorTag] | openejb OpenEJB :: Builder
| Memory: 16M/28M
08:32:40,373 INFO  [ReactorTag] | Memory: 16M/28M
+----------------------------------------
08:32:40,373 INFO  [ReactorTag] +----------------------------------------
DEPRECATED: the default goal should be specified in the <build> section of project.xml instead of maven.xml
08:32:40,385 WARN  [PluginScriptParser] DEPRECATED: the default goal should be specified in the <build> section of project.xml instead of maven.xml
DEPRECATED: the default goal should be specified in the <build> section of project.xml instead of maven.xml
08:32:40,386 WARN  [PluginScriptParser] DEPRECATED: the default goal should be specified in the <build> section of project.xml instead of maven.xml
You are working offline so the build will continue, but openejb-pkgen-builder-2.1-SNAPSHOT.jar may be out of date!
08:32:40,716 WARN  [DependencyVerifier] You are working offline so the build will continue, but openejb-pkgen-builder-2.1-SNAPSHOT.jar may be out of date!
build:start:

multiproject:install-callback:
    [echo] Running jar:install for OpenEJB :: Builder
java:prepare-filesystem:

java:compile:
<depend closure="false" srcdir="1.4" dump="false" destdir="/home/continuum/continuum-1.0.2/apps/continuum/work/68/openejb/modules/openejb-builder/target/classes"></depend>    [echo] Compiling to /home/continuum/continuum-1.0.2/apps/continuum/work/68/openejb/modules/openejb-builder/target/classes

java:jar-resources:

test:prepare-filesystem:

test:test-resources:

test:compile:

test:test:
    [echo] NOTICE: Skipping tests; they seem to have passed already
    [echo] No tests to run.
Running post goal: test:test
08:32:42,248 INFO  [PostGoalTag] Running post goal: test:test

jar:jar:

jar:install:
    [echo] Installing...
Uploading to openejb/jars/openejb-builder-2.1-SNAPSHOT.jar: 
.................... (605K)
Uploading to openejb/poms/openejb-builder-2.1-SNAPSHOT.pom: 
.................... (16K)


build:end:


Starting the reactor...
new3:
08:32:42,734 INFO  [ReactorTag] Starting the reactor...
Our processing order:
08:32:43,167 INFO  [ReactorTag] Our processing order:
Geronimo :: Console :: Common Code
08:32:43,168 INFO  [ReactorTag] Geronimo :: Console :: Common Code
Geronimo :: Console :: Portal Framework
08:32:43,168 INFO  [ReactorTag] Geronimo :: Console :: Portal Framework
Geronimo :: Console :: Standard Portlets
08:32:43,168 INFO  [ReactorTag] Geronimo :: Console :: Standard Portlets
Geronimo :: Console :: Application EAR
08:32:43,168 INFO  [ReactorTag] Geronimo :: Console :: Application EAR
DayTrader :: Core
08:32:43,168 INFO  [ReactorTag] DayTrader :: Core
DayTrader :: Derby Database
08:32:43,168 INFO  [ReactorTag] DayTrader :: Derby Database
DayTrader :: WS Application Client
08:32:43,168 INFO  [ReactorTag] DayTrader :: WS Application Client
DayTrader :: EJBs
08:32:43,168 INFO  [ReactorTag] DayTrader :: EJBs
DayTrader :: Web Application
08:32:43,168 INFO  [ReactorTag] DayTrader :: Web Application
DayTrader :: Quote Streamer
08:32:43,168 INFO  [ReactorTag] DayTrader :: Quote Streamer
DayTrader :: Enterprise Application
08:32:43,168 INFO  [ReactorTag] DayTrader :: Enterprise Application
Geronimo :: Demo Webapp
08:32:43,168 INFO  [ReactorTag] Geronimo :: Demo Webapp
Geronimo :: JMX Debug Webapp
08:32:43,169 INFO  [ReactorTag] Geronimo :: JMX Debug Webapp
Geronimo :: LDAP Demo Application
08:32:43,169 INFO  [ReactorTag] Geronimo :: LDAP Demo Application
Geronimo :: The Magic G Ball Sample Application
08:32:43,169 INFO  [ReactorTag] Geronimo :: The Magic G Ball Sample Application
Geronimo :: Remote Deploy GBean
08:32:43,169 INFO  [ReactorTag] Geronimo :: Remote Deploy GBean
Geronimo :: Remote Deploy Application
08:32:43,169 INFO  [ReactorTag] Geronimo :: Remote Deploy Application
Geronimo :: UDDI-Server database
08:32:43,169 INFO  [ReactorTag] Geronimo :: UDDI-Server database
Geronimo :: UDDI-Server
08:32:43,169 INFO  [ReactorTag] Geronimo :: UDDI-Server
Geronimo :: Welcome Application
08:32:43,169 INFO  [ReactorTag] Geronimo :: Welcome Application
+----------------------------------------
08:32:43,169 INFO  [ReactorTag] +----------------------------------------
| applications Geronimo :: Console :: Common Code
08:32:43,169 INFO  [ReactorTag] | applications Geronimo :: Console :: Common Code
| Memory: 21M/28M
08:32:43,169 INFO  [ReactorTag] | Memory: 21M/28M
+----------------------------------------
08:32:43,169 INFO  [ReactorTag] +----------------------------------------
DEPRECATED: the default goal should be specified in the <build> section of project.xml instead of maven.xml
08:32:43,181 WARN  [PluginScriptParser] DEPRECATED: the default goal should be specified in the <build> section of project.xml instead of maven.xml
DEPRECATED: the default goal should be specified in the <build> section of project.xml instead of maven.xml
08:32:43,182 WARN  [PluginScriptParser] DEPRECATED: the default goal should be specified in the <build> section of project.xml instead of maven.xml
build:start:

multiproject:install-callback:
    [echo] Running jar:install for Geronimo :: Console :: Common Code
java:prepare-filesystem:

java:compile:
<depend closure="false" srcdir="1.4" dump="false" destdir="/home/continuum/continuum-1.0.2/apps/continuum/work/68/applications/console-core/target/classes"></depend>    [echo] Compiling to /home/continuum/continuum-1.0.2/apps/continuum/work/68/applications/console-core/target/classes
Running post goal: java:compile
08:32:43,790 INFO  [PostGoalTag] Running post goal: java:compile

java:jar-resources:

test:prepare-filesystem:

test:test-resources:

test:compile:
    [echo] No test source files to compile.

test:test:
    [echo] NOTICE: Skipping tests; they seem to have passed already
    [echo] No tests to run.
Running post goal: test:test
08:32:44,258 INFO  [PostGoalTag] Running post goal: test:test

jar:jar:
    [jar] Building jar: /home/continuum/continuum-1.0.2/apps/continuum/work/68/applications/console-core/target/geronimo-console-core-1.1-SNAPSHOT.jar

jar:install:
    [echo] Installing...
Uploading to geronimo/jars/geronimo-console-core-1.1-SNAPSHOT.jar: 
.................... (40K)
Uploading to geronimo/poms/geronimo-console-core-1.1-SNAPSHOT.pom: 
.................... (13K)

+----------------------------------------

build:end:

08:32:44,564 INFO  [ReactorTag] +----------------------------------------
| applications Geronimo :: Console :: Portal Framework
08:32:44,564 INFO  [ReactorTag] | applications Geronimo :: Console :: Portal Framework
| Memory: 22M/28M
08:32:44,564 INFO  [ReactorTag] | Memory: 22M/28M
+----------------------------------------
08:32:44,564 INFO  [ReactorTag] +----------------------------------------
DEPRECATED: the default goal should be specified in the <build> section of project.xml instead of maven.xml
08:32:44,574 WARN  [PluginScriptParser] DEPRECATED: the default goal should be specified in the <build> section of project.xml instead of maven.xml
DEPRECATED: the default goal should be specified in the <build> section of project.xml instead of maven.xml
08:32:44,576 WARN  [PluginScriptParser] DEPRECATED: the default goal should be specified in the <build> section of project.xml instead of maven.xml
You are working offline so the build will continue, but geronimo-j2ee_1.4_spec-1.1-SNAPSHOT.jar may be out of date!
08:32:44,864 WARN  [DependencyVerifier] You are working offline so the build will continue, but geronimo-j2ee_1.4_spec-1.1-SNAPSHOT.jar may be out of date!
build:start:

multiproject:install-callback:
    [echo] Running war:install for Geronimo :: Console :: Portal Framework
Tag library requested that is not present: 'caller' in plugin: 'maven-war-plugin-1.6.1'
08:32:44,952 WARN  [GoalToJellyScriptHousingMapper] Tag library requested that is not present: 'caller' in plugin: 'maven-war-plugin-1.6.1'
war:init:

war:war-resources:
    [copy] Copying 1 file to /home/continuum/continuum-1.0.2/apps/continuum/work/68/applications/console-framework/target/geronimo-console-framework
    [copy] Copying 1 file to /home/continuum/continuum-1.0.2/apps/continuum/work/68/applications/console-framework/target/geronimo-console-framework/WEB-INF

java:prepare-filesystem:

java:compile:
    [echo] Compiling to /home/continuum/continuum-1.0.2/apps/continuum/work/68/applications/console-framework/target/classes
    [echo] No java source files to compile.

java:jar-resources:

test:prepare-filesystem:

test:test-resources:

test:compile:
    [echo] No test source files to compile.

test:test:
    [echo] NOTICE: Skipping tests; they seem to have passed already
    [echo] No tests to run.
Running post goal: test:test
08:32:45,873 INFO  [PostGoalTag] Running post goal: test:test

war:webapp:
    [echo] Assembling webapp geronimo-console-framework
Running post goal: war:webapp
08:32:46,501 INFO  [PostGoalTag] Running post goal: war:webapp
    [echo] Use classes.jar ? true
    [copy] Copying 1 file to /home/continuum/continuum-1.0.2/apps/continuum/work/68/applications/console-framework/target/work
    [delete] Deleting 1 files from /home/continuum/continuum-1.0.2/apps/continuum/work/68/applications/console-framework/target/geronimo-console-framework/WEB-INF/classes
    [delete] Deleting 1 files from /home/continuum/continuum-1.0.2/apps/continuum/work/68/applications/console-framework/target/work

war:war:
    [echo] Building WAR geronimo-console-framework
    [jar] Building jar: /home/continuum/continuum-1.0.2/apps/continuum/work/68/applications/console-framework/target/geronimo-console-framework-1.1-SNAPSHOT.war

war:install:
    [echo] Installing...
Uploading to geronimo/wars/geronimo-console-framework-1.1-SNAPSHOT.war: 
.................... (2515K)
Uploading to geronimo/poms/geronimo-console-framework-1.1-SNAPSHOT.pom: 
.................... (12K)

+----------------------------------------

build:end:

08:32:47,906 INFO  [ReactorTag] +----------------------------------------
| applications Geronimo :: Console :: Standard Portlets
08:32:47,906 INFO  [ReactorTag] | applications Geronimo :: Console :: Standard Portlets
| Memory: 22M/28M
08:32:47,906 INFO  [ReactorTag] | Memory: 22M/28M
+----------------------------------------
08:32:47,906 INFO  [ReactorTag] +----------------------------------------
DEPRECATED: the default goal should be specified in the <build> section of project.xml instead of maven.xml
08:32:47,918 WARN  [PluginScriptParser] DEPRECATED: the default goal should be specified in the <build> section of project.xml instead of maven.xml
DEPRECATED: the default goal should be specified in the <build> section of project.xml instead of maven.xml
08:32:47,919 WARN  [PluginScriptParser] DEPRECATED: the default goal should be specified in the <build> section of project.xml instead of maven.xml
You are working offline so the build will continue, but geronimo-derby-1.1-SNAPSHOT.jar may be out of date!
08:32:48,255 WARN  [DependencyVerifier] You are working offline so the build will continue, but geronimo-derby-1.1-SNAPSHOT.jar may be out of date!
You are working offline so the build will continue, but geronimo-converter-1.1-SNAPSHOT.jar may be out of date!
08:32:48,255 WARN  [DependencyVerifier] You are working offline so the build will continue, but geronimo-converter-1.1-SNAPSHOT.jar may be out of date!
You are working offline so the build will continue, but activemq-core-3.2.4-SNAPSHOT.jar may be out of date!
08:32:48,256 WARN  [DependencyVerifier] You are working offline so the build will continue, but activemq-core-3.2.4-SNAPSHOT.jar may be out of date!
You are working offline so the build will continue, but geronimo-console-core-1.1-SNAPSHOT.jar may be out of date!
08:32:48,256 WARN  [DependencyVerifier] You are working offline so the build will continue, but geronimo-console-core-1.1-SNAPSHOT.jar may be out of date!
build:start:

multiproject:install-callback:
    [echo] Running war:install for Geronimo :: Console :: Standard Portlets
Tag library requested that is not present: 'caller' in plugin: 'maven-war-plugin-1.6.1'
08:32:48,348 WARN  [GoalToJellyScriptHousingMapper] Tag library requested that is not present: 'caller' in plugin: 'maven-war-plugin-1.6.1'
war:init:

war:war-resources:
    [copy] Copying 1 file to /home/continuum/continuum-1.0.2/apps/continuum/work/68/applications/console-standard/target/geronimo-console-standard
    [copy] Copying 1 file to /home/continuum/continuum-1.0.2/apps/continuum/work/68/applications/console-standard/target/geronimo-console-standard/WEB-INF

java:prepare-filesystem:

java:compile:
<depend closure="false" srcdir="1.4" dump="false" destdir="/home/continuum/continuum-1.0.2/apps/continuum/work/68/applications/console-standard/target/classes"></depend>    [echo] Compiling to /home/continuum/continuum-1.0.2/apps/continuum/work/68/applications/console-standard/target/classes

java:jar-resources:

test:prepare-filesystem:

test:test-resources:

test:compile:

test:test:
    [echo] NOTICE: Skipping tests; they seem to have passed already
    [echo] No tests to run.
Running post goal: test:test
08:32:49,482 INFO  [PostGoalTag] Running post goal: test:test

war:webapp:
    [echo] Assembling webapp geronimo-console-standard
    [copy] Copying 166 files to /home/continuum/continuum-1.0.2/apps/continuum/work/68/applications/console-standard/target/geronimo-console-standard/WEB-INF/classes
Running post goal: war:webapp
08:32:50,387 INFO  [PostGoalTag] Running post goal: war:webapp
    [echo] Use classes.jar ? true
    [copy] Copying 168 files to /home/continuum/continuum-1.0.2/apps/continuum/work/68/applications/console-standard/target/work
    [jar] Building jar: /home/continuum/continuum-1.0.2/apps/continuum/work/68/applications/console-standard/target/geronimo-console-standard/WEB-INF/lib/classes.jar
    [delete] Deleting 168 files from /home/continuum/continuum-1.0.2/apps/continuum/work/68/applications/console-standard/target/geronimo-console-standard/WEB-INF/classes
    [delete] Deleted 32 directories from /home/continuum/continuum-1.0.2/apps/continuum/work/68/applications/console-standard/target/geronimo-console-standard/WEB-INF/classes
    [delete] Deleting 168 files from /home/continuum/continuum-1.0.2/apps/continuum/work/68/applications/console-standard/target/work
    [delete] Deleted 32 directories from /home/continuum/continuum-1.0.2/apps/continuum/work/68/applications/console-standard/target/work

war:war:
substitute:

    [echo] Building WAR geronimo-console-standard
    [jar] Building jar: /home/continuum/continuum-1.0.2/apps/continuum/work/68/applications/console-standard/target/geronimo-console-standard-1.1-SNAPSHOT.war

war:install:
    [echo] Installing...
Uploading to geronimo/wars/geronimo-console-standard-1.1-SNAPSHOT.war: 
.................... (4390K)
Uploading to geronimo/poms/geronimo-console-standard-1.1-SNAPSHOT.pom: 
.................... (17K)

+----------------------------------------

build:end:

08:32:53,746 INFO  [ReactorTag] +----------------------------------------
| applications Geronimo :: Console :: Application EAR
08:32:53,746 INFO  [ReactorTag] | applications Geronimo :: Console :: Application EAR
| Memory: 20M/31M
08:32:53,746 INFO  [ReactorTag] | Memory: 20M/31M
+----------------------------------------
08:32:53,747 INFO  [ReactorTag] +----------------------------------------
DEPRECATED: the default goal should be specified in the <build> section of project.xml instead of maven.xml
08:32:53,756 WARN  [PluginScriptParser] DEPRECATED: the default goal should be specified in the <build> section of project.xml instead of maven.xml
DEPRECATED: the default goal should be specified in the <build> section of project.xml instead of maven.xml
08:32:53,758 WARN  [PluginScriptParser] DEPRECATED: the default goal should be specified in the <build> section of project.xml instead of maven.xml
You are working offline so the build will continue, but geronimo-console-framework-1.1-SNAPSHOT.war may be out of date!
08:32:54,043 WARN  [DependencyVerifier] You are working offline so the build will continue, but geronimo-console-framework-1.1-SNAPSHOT.war may be out of date!
You are working offline so the build will continue, but geronimo-console-standard-1.1-SNAPSHOT.war may be out of date!
08:32:54,043 WARN  [DependencyVerifier] You are working offline so the build will continue, but geronimo-console-standard-1.1-SNAPSHOT.war may be out of date!
build:start:

multiproject:install-callback:
    [echo] Running ear:install for Geronimo :: Console :: Application EAR
ear:init:

ear:ear:
ear:generate-ear-descriptor:
    [echo] Generating /home/continuum/continuum-1.0.2/apps/continuum/work/68/applications/console-ear/target/application.xml

    [echo] Building EAR geronimo-console-1.1-SNAPSHOT.ear with appxml "/home/continuum/continuum-1.0.2/apps/continuum/work/68/applications/console-ear/target/application.xml"
    [ear] Building ear: /home/continuum/continuum-1.0.2/apps/continuum/work/68/applications/console-ear/target/geronimo-console-1.1-SNAPSHOT.ear

ear:install:
    [echo] Installing...
Uploading to geronimo/ears/geronimo-console-1.1-SNAPSHOT.ear: 
.................... (6813K)
Uploading to geronimo/poms/geronimo-console-1.1-SNAPSHOT.pom: 
.................... (12K)

+----------------------------------------

build:end:

08:32:56,464 INFO  [ReactorTag] +----------------------------------------
| applications DayTrader :: Core
08:32:56,464 INFO  [ReactorTag] | applications DayTrader :: Core
| Memory: 23M/31M
08:32:56,464 INFO  [ReactorTag] | Memory: 23M/31M
+----------------------------------------
08:32:56,464 INFO  [ReactorTag] +----------------------------------------
DEPRECATED: the default goal should be specified in the <build> section of project.xml instead of maven.xml
08:32:56,473 WARN  [PluginScriptParser] DEPRECATED: the default goal should be specified in the <build> section of project.xml instead of maven.xml
DEPRECATED: the default goal should be specified in the <build> section of project.xml instead of maven.xml
08:32:56,474 WARN  [PluginScriptParser] DEPRECATED: the default goal should be specified in the <build> section of project.xml instead of maven.xml
build:start:

multiproject:install-callback:
    [echo] Running jar:install for DayTrader :: Core
java:prepare-filesystem:

java:compile:
<depend closure="false" srcdir="1.4" dump="false" destdir="/home/continuum/continuum-1.0.2/apps/continuum/work/68/applications/daytrader/core/target/classes"></depend>    [echo] Compiling to /home/continuum/continuum-1.0.2/apps/continuum/work/68/applications/daytrader/core/target/classes

java:jar-resources:

test:prepare-filesystem:

test:test-resources:

test:compile:

test:test:
    [echo] NOTICE: Skipping tests; they seem to have passed already
    [echo] No tests to run.
Running post goal: test:test
08:32:57,505 INFO  [PostGoalTag] Running post goal: test:test

jar:jar:

jar:install:
    [echo] Installing...
Uploading to geronimo/jars/daytrader-core-1.1-SNAPSHOT.jar: 
.................... (1K)
Uploading to geronimo/poms/daytrader-core-1.1-SNAPSHOT.pom: 
.................... (10K)

+----------------------------------------

build:end:

08:32:57,740 INFO  [ReactorTag] +----------------------------------------
| applications DayTrader :: Derby Database
08:32:57,741 INFO  [ReactorTag] | applications DayTrader :: Derby Database
| Memory: 24M/31M
08:32:57,741 INFO  [ReactorTag] | Memory: 24M/31M
+----------------------------------------
08:32:57,741 INFO  [ReactorTag] +----------------------------------------
DEPRECATED: the default goal should be specified in the <build> section of project.xml instead of maven.xml
08:32:57,750 WARN  [PluginScriptParser] DEPRECATED: the default goal should be specified in the <build> section of project.xml instead of maven.xml
DEPRECATED: the default goal should be specified in the <build> section of project.xml instead of maven.xml
08:32:57,754 WARN  [PluginScriptParser] DEPRECATED: the default goal should be specified in the <build> section of project.xml instead of maven.xml
build:start:

multiproject:install-callback:
    [echo] Running jar:install for DayTrader :: Derby Database
java:prepare-filesystem:
init-database:
    [delete] Deleting directory /home/continuum/continuum-1.0.2/apps/continuum/work/68/applications/daytrader/derby/target/resources/META-INF/geronimo-daytrader-derby-db/var/derby
    [mkdir] Created dir: /home/continuum/continuum-1.0.2/apps/continuum/work/68/applications/daytrader/derby/target/resources/META-INF/geronimo-daytrader-derby-db/var/derby
    [sql] Executing file: /home/continuum/continuum-1.0.2/apps/continuum/work/68/applications/daytrader/derby/src/sql/daytrader.sql
    [sql] 18 of 18 SQL statements executed successfully


java:compile:
    [echo] Compiling to /home/continuum/continuum-1.0.2/apps/continuum/work/68/applications/daytrader/derby/target/classes
    [echo] No java source files to compile.

java:jar-resources:
Copying 71 files to /home/continuum/continuum-1.0.2/apps/continuum/work/68/applications/daytrader/derby/target/classes

test:prepare-filesystem:

test:test-resources:

test:compile:
    [echo] No test source files to compile.

test:test:
    [echo] NOTICE: Skipping tests; they seem to have passed already
    [echo] No tests to run.
Running post goal: test:test
08:33:02,840 INFO  [PostGoalTag] Running post goal: test:test

jar:jar:
    [jar] Building jar: /home/continuum/continuum-1.0.2/apps/continuum/work/68/applications/daytrader/derby/target/geronimo-daytrader-derby-db-1.1-SNAPSHOT.jar

jar:install:
    [echo] Installing...
Uploading to geronimo/jars/geronimo-daytrader-derby-db-1.1-SNAPSHOT.jar: 
.................... (67K)
Uploading to geronimo/poms/geronimo-daytrader-derby-db-1.1-SNAPSHOT.pom: 
.................... (10K)

+----------------------------------------

build:end:

08:33:03,206 INFO  [ReactorTag] +----------------------------------------
| applications DayTrader :: WS Application Client
08:33:03,206 INFO  [ReactorTag] | applications DayTrader :: WS Application Client
| Memory: 20M/36M
08:33:03,206 INFO  [ReactorTag] | Memory: 20M/36M
+----------------------------------------
08:33:03,206 INFO  [ReactorTag] +----------------------------------------
DEPRECATED: the default goal should be specified in the <build> section of project.xml instead of maven.xml
08:33:03,216 WARN  [PluginScriptParser] DEPRECATED: the default goal should be specified in the <build> section of project.xml instead of maven.xml
DEPRECATED: the default goal should be specified in the <build> section of project.xml instead of maven.xml
08:33:03,217 WARN  [PluginScriptParser] DEPRECATED: the default goal should be specified in the <build> section of project.xml instead of maven.xml
build:start:

multiproject:install-callback:
    [echo] Running jar:install for DayTrader :: WS Application Client
java:prepare-filesystem:

java:compile:
<depend closure="false" srcdir="1.4" dump="false" destdir="/home/continuum/continuum-1.0.2/apps/continuum/work/68/applications/daytrader/wsappclient/target/classes"></depend>    [echo] Compiling to /home/continuum/continuum-1.0.2/apps/continuum/work/68/applications/daytrader/wsappclient/target/classes

java:jar-resources:

test:prepare-filesystem:

test:test-resources:

test:compile:

test:test:
    [echo] NOTICE: Skipping tests; they seem to have passed already
    [echo] No tests to run.
Running post goal: test:test
08:33:04,265 INFO  [PostGoalTag] Running post goal: test:test

jar:jar:
    [echo] Generating Manifest file for Streamer Application
    [echo] And this is found in /client/META-INF

jar:install:
    [echo] Installing...
Uploading to geronimo/jars/daytrader-wsappclient-1.1-SNAPSHOT.jar: 
.................... (40K)
Uploading to geronimo/poms/daytrader-wsappclient-1.1-SNAPSHOT.pom: 
.................... (10K)

+----------------------------------------

build:end:

08:33:04,681 INFO  [ReactorTag] +----------------------------------------
| applications DayTrader :: EJBs
08:33:04,681 INFO  [ReactorTag] | applications DayTrader :: EJBs
| Memory: 24M/36M
08:33:04,682 INFO  [ReactorTag] | Memory: 24M/36M
+----------------------------------------
08:33:04,682 INFO  [ReactorTag] +----------------------------------------
DEPRECATED: the default goal should be specified in the <build> section of project.xml instead of maven.xml
08:33:04,692 WARN  [PluginScriptParser] DEPRECATED: the default goal should be specified in the <build> section of project.xml instead of maven.xml
DEPRECATED: the default goal should be specified in the <build> section of project.xml instead of maven.xml
08:33:04,693 WARN  [PluginScriptParser] DEPRECATED: the default goal should be specified in the <build> section of project.xml instead of maven.xml
You are working offline so the build will continue, but daytrader-core-1.1-SNAPSHOT.jar may be out of date!
08:33:05,043 WARN  [DependencyVerifier] You are working offline so the build will continue, but daytrader-core-1.1-SNAPSHOT.jar may be out of date!
You are working offline so the build will continue, but daytrader-wsappclient-1.1-SNAPSHOT.jar may be out of date!
08:33:05,043 WARN  [DependencyVerifier] You are working offline so the build will continue, but daytrader-wsappclient-1.1-SNAPSHOT.jar may be out of date!
build:start:

multiproject:install-callback:
    [echo] Running ejb:install for DayTrader :: EJBs
ejb:init:
java:prepare-filesystem:

java:compile:
<depend closure="false" srcdir="1.4" dump="false" destdir="/home/continuum/continuum-1.0.2/apps/continuum/work/68/applications/daytrader/ejb/target/classes"></depend>    [echo] Compiling to /home/continuum/continuum-1.0.2/apps/continuum/work/68/applications/daytrader/ejb/target/classes

java:jar-resources:

test:prepare-filesystem:

test:test-resources:

test:compile:

test:test:
    [echo] NOTICE: Skipping tests; they seem to have passed already
    [echo] No tests to run.
Running post goal: test:test
08:33:06,016 INFO  [PostGoalTag] Running post goal: test:test


ejb:ejb:
ejb:ejb-jar-internal:
    [echo] Building ejb daytrader-ejb-1.1-SNAPSHOT
    [echo] Bundling: jar - commons-logging:commons-logging


ejb:install:
    [echo] Installing...
Uploading to geronimo/ejbs/daytrader-ejb-1.1-SNAPSHOT.jar: 
.................... (140K)
Uploading to geronimo/poms/daytrader-ejb-1.1-SNAPSHOT.pom: 
.................... (10K)

+----------------------------------------

build:end:

08:33:06,538 INFO  [ReactorTag] +----------------------------------------
| applications DayTrader :: Web Application
08:33:06,538 INFO  [ReactorTag] | applications DayTrader :: Web Application
| Memory: 23M/36M
08:33:06,538 INFO  [ReactorTag] | Memory: 23M/36M
+----------------------------------------
08:33:06,538 INFO  [ReactorTag] +----------------------------------------
DEPRECATED: the default goal should be specified in the <build> section of project.xml instead of maven.xml
08:33:06,549 WARN  [PluginScriptParser] DEPRECATED: the default goal should be specified in the <build> section of project.xml instead of maven.xml
DEPRECATED: the default goal should be specified in the <build> section of project.xml instead of maven.xml
08:33:06,549 WARN  [PluginScriptParser] DEPRECATED: the default goal should be specified in the <build> section of project.xml instead of maven.xml
You are working offline so the build will continue, but daytrader-ejb-1.1-SNAPSHOT.jar may be out of date!
08:33:06,887 WARN  [DependencyVerifier] You are working offline so the build will continue, but daytrader-ejb-1.1-SNAPSHOT.jar may be out of date!
build:start:

multiproject:install-callback:
    [echo] Running war:install for DayTrader :: Web Application
Tag library requested that is not present: 'caller' in plugin: 'maven-war-plugin-1.6.1'
08:33:06,974 WARN  [GoalToJellyScriptHousingMapper] Tag library requested that is not present: 'caller' in plugin: 'maven-war-plugin-1.6.1'
war:init:

war:war-resources:

java:prepare-filesystem:

java:compile:
<depend closure="false" srcdir="1.4" dump="false" destdir="/home/continuum/continuum-1.0.2/apps/continuum/work/68/applications/daytrader/web/target/classes"></depend>    [echo] Compiling to /home/continuum/continuum-1.0.2/apps/continuum/work/68/applications/daytrader/web/target/classes

java:jar-resources:

test:prepare-filesystem:

test:test-resources:

test:compile:

test:test:
    [echo] NOTICE: Skipping tests; they seem to have passed already
    [echo] No tests to run.
Running post goal: test:test
08:33:07,846 INFO  [PostGoalTag] Running post goal: test:test

war:webapp:
    [echo] Assembling webapp daytrader-web
    [copy] Copying 33 files to /home/continuum/continuum-1.0.2/apps/continuum/work/68/applications/daytrader/web/target/daytrader-web/WEB-INF/classes
Running post goal: war:webapp
08:33:08,230 INFO  [PostGoalTag] Running post goal: war:webapp
    [echo] Generating /web.xml
Running post goal: war:webapp
08:33:08,326 INFO  [PostGoalTag] Running post goal: war:webapp
    [echo] Use classes.jar ? true
    [copy] Copying 33 files to /home/continuum/continuum-1.0.2/apps/continuum/work/68/applications/daytrader/web/target/work
    [jar] Building jar: /home/continuum/continuum-1.0.2/apps/continuum/work/68/applications/daytrader/web/target/daytrader-web/WEB-INF/lib/classes.jar
    [delete] Deleting 33 files from /home/continuum/continuum-1.0.2/apps/continuum/work/68/applications/daytrader/web/target/daytrader-web/WEB-INF/classes
    [delete] Deleted 7 directories from /home/continuum/continuum-1.0.2/apps/continuum/work/68/applications/daytrader/web/target/daytrader-web/WEB-INF/classes
    [delete] Deleting 33 files from /home/continuum/continuum-1.0.2/apps/continuum/work/68/applications/daytrader/web/target/work
    [delete] Deleted 7 directories from /home/continuum/continuum-1.0.2/apps/continuum/work/68/applications/daytrader/web/target/work

war:war:
    [echo] Building WAR daytrader-web
    [jar] Building jar: /home/continuum/continuum-1.0.2/apps/continuum/work/68/applications/daytrader/web/target/daytrader-web-1.1-SNAPSHOT.war

war:install:
    [echo] Installing...
Uploading to geronimo/wars/daytrader-web-1.1-SNAPSHOT.war: 
.................... (446K)
Uploading to geronimo/poms/daytrader-web-1.1-SNAPSHOT.pom: 
.................... (10K)

+----------------------------------------

build:end:

08:33:09,166 INFO  [ReactorTag] +----------------------------------------
| applications DayTrader :: Quote Streamer
08:33:09,166 INFO  [ReactorTag] | applications DayTrader :: Quote Streamer
| Memory: 27M/36M
08:33:09,166 INFO  [ReactorTag] | Memory: 27M/36M
+----------------------------------------
08:33:09,166 INFO  [ReactorTag] +----------------------------------------
DEPRECATED: the default goal should be specified in the <build> section of project.xml instead of maven.xml
08:33:09,176 WARN  [PluginScriptParser] DEPRECATED: the default goal should be specified in the <build> section of project.xml instead of maven.xml
DEPRECATED: the default goal should be specified in the <build> section of project.xml instead of maven.xml
08:33:09,177 WARN  [PluginScriptParser] DEPRECATED: the default goal should be specified in the <build> section of project.xml instead of maven.xml
build:start:

multiproject:install-callback:
    [echo] Running jar:install for DayTrader :: Quote Streamer
java:prepare-filesystem:

java:compile:
<depend closure="false" srcdir="1.4" dump="false" destdir="/home/continuum/continuum-1.0.2/apps/continuum/work/68/applications/daytrader/streamer/target/classes"></depend>    [echo] Compiling to /home/continuum/continuum-1.0.2/apps/continuum/work/68/applications/daytrader/streamer/target/classes

java:jar-resources:

test:prepare-filesystem:

test:test-resources:

test:compile:

test:test:
    [echo] NOTICE: Skipping tests; they seem to have passed already
    [echo] No tests to run.
Running post goal: test:test
08:33:10,224 INFO  [PostGoalTag] Running post goal: test:test

jar:jar:
    [echo] Generating Manifest file for Streamer Application
    [echo] And this is found in /client/META-INF

jar:install:
    [echo] Installing...
Uploading to geronimo/jars/daytrader-streamer-1.1-SNAPSHOT.jar: 
.................... (24K)
Uploading to geronimo/poms/daytrader-streamer-1.1-SNAPSHOT.pom: 
.................... (10K)

+----------------------------------------

build:end:

08:33:10,634 INFO  [ReactorTag] +----------------------------------------
| applications DayTrader :: Enterprise Application
08:33:10,634 INFO  [ReactorTag] | applications DayTrader :: Enterprise Application
| Memory: 28M/36M
08:33:10,634 INFO  [ReactorTag] | Memory: 28M/36M
+----------------------------------------
08:33:10,634 INFO  [ReactorTag] +----------------------------------------
DEPRECATED: the default goal should be specified in the <build> section of project.xml instead of maven.xml
08:33:10,644 WARN  [PluginScriptParser] DEPRECATED: the default goal should be specified in the <build> section of project.xml instead of maven.xml
DEPRECATED: the default goal should be specified in the <build> section of project.xml instead of maven.xml
08:33:10,646 WARN  [PluginScriptParser] DEPRECATED: the default goal should be specified in the <build> section of project.xml instead of maven.xml
You are working offline so the build will continue, but daytrader-web-1.1-SNAPSHOT.war may be out of date!
08:33:10,980 WARN  [DependencyVerifier] You are working offline so the build will continue, but daytrader-web-1.1-SNAPSHOT.war may be out of date!
You are working offline so the build will continue, but daytrader-streamer-1.1-SNAPSHOT.jar may be out of date!
08:33:10,982 WARN  [DependencyVerifier] You are working offline so the build will continue, but daytrader-streamer-1.1-SNAPSHOT.jar may be out of date!
build:start:

multiproject:install-callback:
    [echo] Running ear:install for DayTrader :: Enterprise Application
ear:init:

ear:ear:
ear:generate-ear-descriptor:
    [echo] Generating /home/continuum/continuum-1.0.2/apps/continuum/work/68/applications/daytrader/ear/target/application.xml

    [echo] Building EAR daytrader-ear-1.1-SNAPSHOT.ear with appxml "/home/continuum/continuum-1.0.2/apps/continuum/work/68/applications/daytrader/ear/target/application.xml"
    [ear] Building ear: /home/continuum/continuum-1.0.2/apps/continuum/work/68/applications/daytrader/ear/target/daytrader-ear-1.1-SNAPSHOT.ear

ear:install:
    [echo] Installing...
Uploading to geronimo/ears/daytrader-ear-1.1-SNAPSHOT.ear: 
.................... (634K)
Uploading to geronimo/poms/daytrader-ear-1.1-SNAPSHOT.pom: 
.................... (11K)

+----------------------------------------

build:end:

08:33:11,686 INFO  [ReactorTag] +----------------------------------------
| applications Geronimo :: Demo Webapp
08:33:11,686 INFO  [ReactorTag] | applications Geronimo :: Demo Webapp
| Memory: 30M/36M
08:33:11,686 INFO  [ReactorTag] | Memory: 30M/36M
+----------------------------------------
08:33:11,686 INFO  [ReactorTag] +----------------------------------------
DEPRECATED: the default goal should be specified in the <build> section of project.xml instead of maven.xml
08:33:11,696 WARN  [PluginScriptParser] DEPRECATED: the default goal should be specified in the <build> section of project.xml instead of maven.xml
DEPRECATED: the default goal should be specified in the <build> section of project.xml instead of maven.xml
08:33:11,698 WARN  [PluginScriptParser] DEPRECATED: the default goal should be specified in the <build> section of project.xml instead of maven.xml
build:start:

multiproject:install-callback:
    [echo] Running war:install for Geronimo :: Demo Webapp
Tag library requested that is not present: 'caller' in plugin: 'maven-war-plugin-1.6.1'
08:33:12,071 WARN  [GoalToJellyScriptHousingMapper] Tag library requested that is not present: 'caller' in plugin: 'maven-war-plugin-1.6.1'
war:init:

war:war-resources:
    [copy] Copying 1 file to /home/continuum/continuum-1.0.2/apps/continuum/work/68/applications/demo/target/geronimo-demo/WEB-INF

java:prepare-filesystem:

java:compile:
    [echo] Compiling to /home/continuum/continuum-1.0.2/apps/continuum/work/68/applications/demo/target/classes
    [echo] No java source files to compile.

java:jar-resources:

test:prepare-filesystem:

test:test-resources:

test:compile:
    [echo] No test source files to compile.

test:test:
    [echo] NOTICE: Skipping tests; they seem to have passed already
    [echo] No tests to run.
Running post goal: test:test
08:33:12,908 INFO  [PostGoalTag] Running post goal: test:test

war:webapp:
    [echo] Assembling webapp geronimo-demo
Running post goal: war:webapp
08:33:13,213 INFO  [PostGoalTag] Running post goal: war:webapp
    [echo] Use classes.jar ? true

war:war:
    [echo] Building WAR geronimo-demo
    [jar] Building jar: /home/continuum/continuum-1.0.2/apps/continuum/work/68/applications/demo/target/geronimo-demo-1.1-SNAPSHOT.war

war:install:
    [echo] Installing...
Uploading to geronimo/wars/geronimo-demo-1.1-SNAPSHOT.war: 
.................... (4K)
Uploading to geronimo/poms/geronimo-demo-1.1-SNAPSHOT.pom: 
.................... (10K)

+----------------------------------------

build:end:

08:33:13,661 INFO  [ReactorTag] +----------------------------------------
| applications Geronimo :: JMX Debug Webapp
08:33:13,661 INFO  [ReactorTag] | applications Geronimo :: JMX Debug Webapp
| Memory: 32M/36M
08:33:13,661 INFO  [ReactorTag] | Memory: 32M/36M
+----------------------------------------
08:33:13,661 INFO  [ReactorTag] +----------------------------------------
DEPRECATED: the default goal should be specified in the <build> section of project.xml instead of maven.xml
08:33:13,671 WARN  [PluginScriptParser] DEPRECATED: the default goal should be specified in the <build> section of project.xml instead of maven.xml
DEPRECATED: the default goal should be specified in the <build> section of project.xml instead of maven.xml
08:33:13,673 WARN  [PluginScriptParser] DEPRECATED: the default goal should be specified in the <build> section of project.xml instead of maven.xml
build:start:

multiproject:install-callback:
    [echo] Running war:install for Geronimo :: JMX Debug Webapp
Tag library requested that is not present: 'caller' in plugin: 'maven-war-plugin-1.6.1'
08:33:14,046 WARN  [GoalToJellyScriptHousingMapper] Tag library requested that is not present: 'caller' in plugin: 'maven-war-plugin-1.6.1'
war:init:

war:war-resources:
    [copy] Copying 1 file to /home/continuum/continuum-1.0.2/apps/continuum/work/68/applications/jmxdebug/target/geronimo-jmxdebug/WEB-INF

java:prepare-filesystem:

java:compile:
<depend closure="false" srcdir="1.4" dump="false" destdir="/home/continuum/continuum-1.0.2/apps/continuum/work/68/applications/jmxdebug/target/classes"></depend>    [echo] Compiling to /home/continuum/continuum-1.0.2/apps/continuum/work/68/applications/jmxdebug/target/classes

java:jar-resources:

test:prepare-filesystem:

test:test-resources:

test:compile:
    [echo] No test source files to compile.

test:test:
    [echo] NOTICE: Skipping tests; they seem to have passed already
    [echo] No tests to run.
Running post goal: test:test
08:33:14,949 INFO  [PostGoalTag] Running post goal: test:test

war:webapp:
    [echo] Assembling webapp geronimo-jmxdebug
    [copy] Copying 11 files to /home/continuum/continuum-1.0.2/apps/continuum/work/68/applications/jmxdebug/target/geronimo-jmxdebug/WEB-INF/classes
Running post goal: war:webapp
08:33:15,325 INFO  [PostGoalTag] Running post goal: war:webapp
    [echo] Use classes.jar ? true
    [copy] Copying 11 files to /home/continuum/continuum-1.0.2/apps/continuum/work/68/applications/jmxdebug/target/work
    [jar] Building jar: /home/continuum/continuum-1.0.2/apps/continuum/work/68/applications/jmxdebug/target/geronimo-jmxdebug/WEB-INF/lib/classes.jar
    [delete] Deleting 11 files from /home/continuum/continuum-1.0.2/apps/continuum/work/68/applications/jmxdebug/target/geronimo-jmxdebug/WEB-INF/classes
    [delete] Deleted 8 directories from /home/continuum/continuum-1.0.2/apps/continuum/work/68/applications/jmxdebug/target/geronimo-jmxdebug/WEB-INF/classes
    [delete] Deleting 11 files from /home/continuum/continuum-1.0.2/apps/continuum/work/68/applications/jmxdebug/target/work
    [delete] Deleted 8 directories from /home/continuum/continuum-1.0.2/apps/continuum/work/68/applications/jmxdebug/target/work

war:war:
    [echo] Building WAR geronimo-jmxdebug
    [jar] Building jar: /home/continuum/continuum-1.0.2/apps/continuum/work/68/applications/jmxdebug/target/geronimo-jmxdebug-1.1-SNAPSHOT.war

war:install:
    [echo] Installing...
Uploading to geronimo/wars/geronimo-jmxdebug-1.1-SNAPSHOT.war: 
.................... (470K)
Uploading to geronimo/poms/geronimo-jmxdebug-1.1-SNAPSHOT.pom: 
.................... (10K)

+----------------------------------------

build:end:

08:33:16,062 INFO  [ReactorTag] +----------------------------------------
| applications Geronimo :: LDAP Demo Application
08:33:16,062 INFO  [ReactorTag] | applications Geronimo :: LDAP Demo Application
| Memory: 32M/36M
08:33:16,062 INFO  [ReactorTag] | Memory: 32M/36M
+----------------------------------------
08:33:16,062 INFO  [ReactorTag] +----------------------------------------
DEPRECATED: the default goal should be specified in the <build> section of project.xml instead of maven.xml
08:33:16,072 WARN  [PluginScriptParser] DEPRECATED: the default goal should be specified in the <build> section of project.xml instead of maven.xml
DEPRECATED: the default goal should be specified in the <build> section of project.xml instead of maven.xml
08:33:16,073 WARN  [PluginScriptParser] DEPRECATED: the default goal should be specified in the <build> section of project.xml instead of maven.xml
build:start:

multiproject:install-callback:
    [echo] Running war:install for Geronimo :: LDAP Demo Application
Tag library requested that is not present: 'caller' in plugin: 'maven-war-plugin-1.6.1'
08:33:16,448 WARN  [GoalToJellyScriptHousingMapper] Tag library requested that is not present: 'caller' in plugin: 'maven-war-plugin-1.6.1'
war:init:

war:war-resources:
    [copy] Copying 1 file to /home/continuum/continuum-1.0.2/apps/continuum/work/68/applications/ldap-realm-demo/target/geronimo-ldap-demo/WEB-INF

java:prepare-filesystem:

java:compile:
    [echo] Compiling to /home/continuum/continuum-1.0.2/apps/continuum/work/68/applications/ldap-realm-demo/target/classes
    [echo] No java source files to compile.

java:jar-resources:

test:prepare-filesystem:

test:test-resources:

test:compile:
    [echo] No test source files to compile.

test:test:
    [echo] NOTICE: Skipping tests; they seem to have passed already
    [echo] No tests to run.
Running post goal: test:test
08:33:17,278 INFO  [PostGoalTag] Running post goal: test:test

war:webapp:
    [echo] Assembling webapp geronimo-ldap-demo
Running post goal: war:webapp
08:33:17,589 INFO  [PostGoalTag] Running post goal: war:webapp
    [echo] Use classes.jar ? true

war:war:
    [echo] Building WAR geronimo-ldap-demo
    [jar] Building jar: /home/continuum/continuum-1.0.2/apps/continuum/work/68/applications/ldap-realm-demo/target/geronimo-ldap-demo-1.1-SNAPSHOT.war

war:install:
    [echo] Installing...
Uploading to geronimo/wars/geronimo-ldap-demo-1.1-SNAPSHOT.war: 
.................... (4K)
Uploading to geronimo/poms/geronimo-ldap-demo-1.1-SNAPSHOT.pom: 
.................... (10K)

+----------------------------------------

build:end:

08:33:18,040 INFO  [ReactorTag] +----------------------------------------
| applications Geronimo :: The Magic G Ball Sample Application
08:33:18,040 INFO  [ReactorTag] | applications Geronimo :: The Magic G Ball Sample Application
| Memory: 31M/36M
08:33:18,040 INFO  [ReactorTag] | Memory: 31M/36M
+----------------------------------------
08:33:18,040 INFO  [ReactorTag] +----------------------------------------
DEPRECATED: the default goal should be specified in the <build> section of project.xml instead of maven.xml
08:33:18,053 WARN  [PluginScriptParser] DEPRECATED: the default goal should be specified in the <build> section of project.xml instead of maven.xml
DEPRECATED: the default goal should be specified in the <build> section of project.xml instead of maven.xml
08:33:18,061 WARN  [PluginScriptParser] DEPRECATED: the default goal should be specified in the <build> section of project.xml instead of maven.xml
build:start:

multiproject:install-callback:
    [echo] Running war:install for Geronimo :: The Magic G Ball Sample Application
Tag library requested that is not present: 'caller' in plugin: 'maven-war-plugin-1.6.1'
08:33:18,485 WARN  [GoalToJellyScriptHousingMapper] Tag library requested that is not present: 'caller' in plugin: 'maven-war-plugin-1.6.1'
war:init:

war:war-resources:
    [copy] Copying 1 file to /home/continuum/continuum-1.0.2/apps/continuum/work/68/applications/magicGball/target/magicGball/WEB-INF

java:prepare-filesystem:

java:compile:
<depend closure="false" srcdir="1.4" dump="false" destdir="/home/continuum/continuum-1.0.2/apps/continuum/work/68/applications/magicGball/target/classes"></depend>    [echo] Compiling to /home/continuum/continuum-1.0.2/apps/continuum/work/68/applications/magicGball/target/classes

java:jar-resources:

test:prepare-filesystem:

test:test-resources:

test:compile:
    [echo] No test source files to compile.

test:test:
    [echo] NOTICE: Skipping tests; they seem to have passed already
    [echo] No tests to run.
Running post goal: test:test
08:33:19,380 INFO  [PostGoalTag] Running post goal: test:test

war:webapp:
    [echo] Assembling webapp magicGball
    [copy] Copying 1 file to /home/continuum/continuum-1.0.2/apps/continuum/work/68/applications/magicGball/target/magicGball/WEB-INF/classes
Running post goal: war:webapp
08:33:19,692 INFO  [PostGoalTag] Running post goal: war:webapp
    [echo] Use classes.jar ? true
    [copy] Copying 1 file to /home/continuum/continuum-1.0.2/apps/continuum/work/68/applications/magicGball/target/work
    [jar] Building jar: /home/continuum/continuum-1.0.2/apps/continuum/work/68/applications/magicGball/target/magicGball/WEB-INF/lib/classes.jar
    [delete] Deleting 1 files from /home/continuum/continuum-1.0.2/apps/continuum/work/68/applications/magicGball/target/magicGball/WEB-INF/classes
    [delete] Deleted 2 directories from /home/continuum/continuum-1.0.2/apps/continuum/work/68/applications/magicGball/target/magicGball/WEB-INF/classes
    [delete] Deleting 1 files from /home/continuum/continuum-1.0.2/apps/continuum/work/68/applications/magicGball/target/work
    [delete] Deleted 2 directories from /home/continuum/continuum-1.0.2/apps/continuum/work/68/applications/magicGball/target/work

war:war:
    [echo] Building WAR magicGball
    [jar] Building jar: /home/continuum/continuum-1.0.2/apps/continuum/work/68/applications/magicGball/target/magicGball-1.1-SNAPSHOT.war

war:install:
    [echo] Installing...
Uploading to geronimo/wars/magicGball-1.1-SNAPSHOT.war: 
.................... (2K)
Uploading to geronimo/poms/magicGball-1.1-SNAPSHOT.pom: 
.................... (10K)

+----------------------------------------

build:end:

08:33:20,253 INFO  [ReactorTag] +----------------------------------------
| applications Geronimo :: Remote Deploy GBean
08:33:20,253 INFO  [ReactorTag] | applications Geronimo :: Remote Deploy GBean
| Memory: 34M/36M
08:33:20,253 INFO  [ReactorTag] | Memory: 34M/36M
+----------------------------------------
08:33:20,254 INFO  [ReactorTag] +----------------------------------------
DEPRECATED: the default goal should be specified in the <build> section of project.xml instead of maven.xml
08:33:20,265 WARN  [PluginScriptParser] DEPRECATED: the default goal should be specified in the <build> section of project.xml instead of maven.xml
DEPRECATED: the default goal should be specified in the <build> section of project.xml instead of maven.xml
08:33:20,266 WARN  [PluginScriptParser] DEPRECATED: the default goal should be specified in the <build> section of project.xml instead of maven.xml
build:start:

multiproject:install-callback:
    [echo] Running jar:install for Geronimo :: Remote Deploy GBean
java:prepare-filesystem:

java:compile:
<depend closure="false" srcdir="1.4" dump="false" destdir="/home/continuum/continuum-1.0.2/apps/continuum/work/68/applications/remote-deploy-lib/target/classes"></depend>    [echo] Compiling to /home/continuum/continuum-1.0.2/apps/continuum/work/68/applications/remote-deploy-lib/target/classes

java:jar-resources:

test:prepare-filesystem:

test:test-resources:

test:compile:
    [echo] No test source files to compile.

test:test:
    [echo] NOTICE: Skipping tests; they seem to have passed already
    [echo] No tests to run.
Running post goal: test:test
08:33:21,257 INFO  [PostGoalTag] Running post goal: test:test

jar:jar:

jar:install:
    [echo] Installing...
Uploading to geronimo/jars/geronimo-remote-deploy-lib-1.1-SNAPSHOT.jar: 
.................... (6K)
Uploading to geronimo/poms/geronimo-remote-deploy-lib-1.1-SNAPSHOT.pom: 
.................... (10K)

+----------------------------------------

build:end:

08:33:21,496 INFO  [ReactorTag] +----------------------------------------
| applications Geronimo :: Remote Deploy Application
08:33:21,496 INFO  [ReactorTag] | applications Geronimo :: Remote Deploy Application
| Memory: 34M/36M
08:33:21,496 INFO  [ReactorTag] | Memory: 34M/36M
+----------------------------------------
08:33:21,496 INFO  [ReactorTag] +----------------------------------------
DEPRECATED: the default goal should be specified in the <build> section of project.xml instead of maven.xml
08:33:21,506 WARN  [PluginScriptParser] DEPRECATED: the default goal should be specified in the <build> section of project.xml instead of maven.xml
DEPRECATED: the default goal should be specified in the <build> section of project.xml instead of maven.xml
08:33:21,507 WARN  [PluginScriptParser] DEPRECATED: the default goal should be specified in the <build> section of project.xml instead of maven.xml
You are working offline so the build will continue, but geronimo-remote-deploy-lib-1.1-SNAPSHOT.jar may be out of date!
08:33:21,793 WARN  [DependencyVerifier] You are working offline so the build will continue, but geronimo-remote-deploy-lib-1.1-SNAPSHOT.jar may be out of date!
build:start:

multiproject:install-callback:
    [echo] Running war:install for Geronimo :: Remote Deploy Application
Tag library requested that is not present: 'caller' in plugin: 'maven-war-plugin-1.6.1'
08:33:21,880 WARN  [GoalToJellyScriptHousingMapper] Tag library requested that is not present: 'caller' in plugin: 'maven-war-plugin-1.6.1'
war:init:

war:war-resources:
    [copy] Copying 1 file to /home/continuum/continuum-1.0.2/apps/continuum/work/68/applications/remote-deploy/target/geronimo-remote-deploy/WEB-INF

java:prepare-filesystem:

java:compile:
<depend closure="false" srcdir="1.4" dump="false" destdir="/home/continuum/continuum-1.0.2/apps/continuum/work/68/applications/remote-deploy/target/classes"></depend>    [echo] Compiling to /home/continuum/continuum-1.0.2/apps/continuum/work/68/applications/remote-deploy/target/classes

java:jar-resources:

test:prepare-filesystem:

test:test-resources:

test:compile:
    [echo] No test source files to compile.

test:test:
    [echo] NOTICE: Skipping tests; they seem to have passed already
    [echo] No tests to run.
Running post goal: test:test
08:33:22,761 INFO  [PostGoalTag] Running post goal: test:test

war:webapp:
    [echo] Assembling webapp geronimo-remote-deploy
    [copy] Copying 2 files to /home/continuum/continuum-1.0.2/apps/continuum/work/68/applications/remote-deploy/target/geronimo-remote-deploy/WEB-INF/classes
Running post goal: war:webapp
08:33:23,070 INFO  [PostGoalTag] Running post goal: war:webapp
    [echo] Use classes.jar ? true
    [copy] Copying 2 files to /home/continuum/continuum-1.0.2/apps/continuum/work/68/applications/remote-deploy/target/work
    [jar] Building jar: /home/continuum/continuum-1.0.2/apps/continuum/work/68/applications/remote-deploy/target/geronimo-remote-deploy/WEB-INF/lib/classes.jar
    [delete] Deleting 2 files from /home/continuum/continuum-1.0.2/apps/continuum/work/68/applications/remote-deploy/target/geronimo-remote-deploy/WEB-INF/classes
    [delete] Deleted 5 directories from /home/continuum/continuum-1.0.2/apps/continuum/work/68/applications/remote-deploy/target/geronimo-remote-deploy/WEB-INF/classes
    [delete] Deleting 2 files from /home/continuum/continuum-1.0.2/apps/continuum/work/68/applications/remote-deploy/target/work
    [delete] Deleted 5 directories from /home/continuum/continuum-1.0.2/apps/continuum/work/68/applications/remote-deploy/target/work

war:war:
    [echo] Building WAR geronimo-remote-deploy
    [jar] Building jar: /home/continuum/continuum-1.0.2/apps/continuum/work/68/applications/remote-deploy/target/geronimo-remote-deploy-1.1-SNAPSHOT.war

war:install:
    [echo] Installing...
Uploading to geronimo/wars/geronimo-remote-deploy-1.1-SNAPSHOT.war: 
.................... (4K)
Uploading to geronimo/poms/geronimo-remote-deploy-1.1-SNAPSHOT.pom: 
.................... (11K)

+----------------------------------------

build:end:

08:33:23,637 INFO  [ReactorTag] +----------------------------------------
| applications Geronimo :: UDDI-Server database
08:33:23,638 INFO  [ReactorTag] | applications Geronimo :: UDDI-Server database
| Memory: 33M/36M
08:33:23,638 INFO  [ReactorTag] | Memory: 33M/36M
+----------------------------------------
08:33:23,638 INFO  [ReactorTag] +----------------------------------------
DEPRECATED: the default goal should be specified in the <build> section of project.xml instead of maven.xml
08:33:23,647 WARN  [PluginScriptParser] DEPRECATED: the default goal should be specified in the <build> section of project.xml instead of maven.xml
DEPRECATED: the default goal should be specified in the <build> section of project.xml instead of maven.xml
08:33:23,649 WARN  [PluginScriptParser] DEPRECATED: the default goal should be specified in the <build> section of project.xml instead of maven.xml
build:start:

multiproject:install-callback:
    [echo] Running jar:install for Geronimo :: UDDI-Server database
java:prepare-filesystem:
init-database:
    [delete] Deleting directory /home/continuum/continuum-1.0.2/apps/continuum/work/68/applications/uddi-db/target/resources/META-INF/geronimo-uddi-db/var/derby
    [mkdir] Created dir: /home/continuum/continuum-1.0.2/apps/continuum/work/68/applications/uddi-db/target/resources/META-INF/geronimo-uddi-db/var/derby
    [sql] Executing file: /home/continuum/continuum-1.0.2/apps/continuum/work/68/applications/uddi-db/src/sql/juddi.sql
    [sql] 87 of 87 SQL statements executed successfully


java:compile:
    [echo] Compiling to /home/continuum/continuum-1.0.2/apps/continuum/work/68/applications/uddi-db/target/classes
    [echo] No java source files to compile.

java:jar-resources:
Copying 142 files to /home/continuum/continuum-1.0.2/apps/continuum/work/68/applications/uddi-db/target/classes

test:prepare-filesystem:

test:test-resources:

test:compile:
    [echo] No test source files to compile.

test:test:
    [echo] NOTICE: Skipping tests; they seem to have passed already
    [echo] No tests to run.
Running post goal: test:test
08:33:31,012 INFO  [PostGoalTag] Running post goal: test:test

jar:jar:
    [jar] Building jar: /home/continuum/continuum-1.0.2/apps/continuum/work/68/applications/uddi-db/target/geronimo-uddi-db-1.1-SNAPSHOT.jar

jar:install:
    [echo] Installing...
Uploading to geronimo/jars/geronimo-uddi-db-1.1-SNAPSHOT.jar: 
.................... (140K)
Uploading to geronimo/poms/geronimo-uddi-db-1.1-SNAPSHOT.pom: 
.................... (10K)

+----------------------------------------

build:end:

08:33:31,524 INFO  [ReactorTag] +----------------------------------------
| applications Geronimo :: UDDI-Server
08:33:31,525 INFO  [ReactorTag] | applications Geronimo :: UDDI-Server
| Memory: 25M/41M
08:33:31,525 INFO  [ReactorTag] | Memory: 25M/41M
+----------------------------------------
08:33:31,525 INFO  [ReactorTag] +----------------------------------------
DEPRECATED: the default goal should be specified in the <build> section of project.xml instead of maven.xml
08:33:31,534 WARN  [PluginScriptParser] DEPRECATED: the default goal should be specified in the <build> section of project.xml instead of maven.xml
DEPRECATED: the default goal should be specified in the <build> section of project.xml instead of maven.xml
08:33:31,536 WARN  [PluginScriptParser] DEPRECATED: the default goal should be specified in the <build> section of project.xml instead of maven.xml
build:start:

multiproject:install-callback:
    [echo] Running war:install for Geronimo :: UDDI-Server
Tag library requested that is not present: 'caller' in plugin: 'maven-war-plugin-1.6.1'
08:33:31,913 WARN  [GoalToJellyScriptHousingMapper] Tag library requested that is not present: 'caller' in plugin: 'maven-war-plugin-1.6.1'
war:init:

war:war-resources:
    [copy] Copying 1 file to /home/continuum/continuum-1.0.2/apps/continuum/work/68/applications/uddi-server/target/geronimo-uddi-server/WEB-INF

java:prepare-filesystem:

java:compile:
    [echo] Compiling to /home/continuum/continuum-1.0.2/apps/continuum/work/68/applications/uddi-server/target/classes
    [echo] No java source files to compile.

java:jar-resources:

test:prepare-filesystem:

test:test-resources:

test:compile:
    [echo] No test source files to compile.

test:test:
    [echo] NOTICE: Skipping tests; they seem to have passed already
    [echo] No tests to run.
Running post goal: test:test
08:33:32,743 INFO  [PostGoalTag] Running post goal: test:test

war:webapp:
    [echo] Assembling webapp geronimo-uddi-server
Running post goal: war:webapp
08:33:33,054 INFO  [PostGoalTag] Running post goal: war:webapp
    [echo] Use classes.jar ? true

war:war:
    [echo] Building WAR geronimo-uddi-server
    [jar] Building jar: /home/continuum/continuum-1.0.2/apps/continuum/work/68/applications/uddi-server/target/geronimo-uddi-server-1.1-SNAPSHOT.war

war:install:
    [echo] Installing...
Uploading to geronimo/wars/geronimo-uddi-server-1.1-SNAPSHOT.war: 
.................... (5K)
Uploading to geronimo/poms/geronimo-uddi-server-1.1-SNAPSHOT.pom: 
.................... (10K)

+----------------------------------------

build:end:

08:33:33,508 INFO  [ReactorTag] +----------------------------------------
| applications Geronimo :: Welcome Application
08:33:33,508 INFO  [ReactorTag] | applications Geronimo :: Welcome Application
| Memory: 25M/41M
08:33:33,508 INFO  [ReactorTag] | Memory: 25M/41M
+----------------------------------------
08:33:33,508 INFO  [ReactorTag] +----------------------------------------
DEPRECATED: the default goal should be specified in the <build> section of project.xml instead of maven.xml
08:33:33,518 WARN  [PluginScriptParser] DEPRECATED: the default goal should be specified in the <build> section of project.xml instead of maven.xml
DEPRECATED: the default goal should be specified in the <build> section of project.xml instead of maven.xml
08:33:33,519 WARN  [PluginScriptParser] DEPRECATED: the default goal should be specified in the <build> section of project.xml instead of maven.xml
build:start:

multiproject:install-callback:
    [echo] Running war:install for Geronimo :: Welcome Application
Tag library requested that is not present: 'caller' in plugin: 'maven-war-plugin-1.6.1'
08:33:33,893 WARN  [GoalToJellyScriptHousingMapper] Tag library requested that is not present: 'caller' in plugin: 'maven-war-plugin-1.6.1'
war:init:

war:war-resources:
    [copy] Copying 1 file to /home/continuum/continuum-1.0.2/apps/continuum/work/68/applications/welcome/target/geronimo-welcome/WEB-INF

java:prepare-filesystem:

java:compile:
    [echo] Compiling to /home/continuum/continuum-1.0.2/apps/continuum/work/68/applications/welcome/target/classes
    [echo] No java source files to compile.

java:jar-resources:

test:prepare-filesystem:

test:test-resources:

test:compile:
    [echo] No test source files to compile.

test:test:
    [echo] NOTICE: Skipping tests; they seem to have passed already
    [echo] No tests to run.
Running post goal: test:test
08:33:34,717 INFO  [PostGoalTag] Running post goal: test:test

war:webapp:
    [echo] Assembling webapp geronimo-welcome
Running post goal: war:webapp
08:33:35,027 INFO  [PostGoalTag] Running post goal: war:webapp
    [echo] Use classes.jar ? true

war:war:
    [echo] Building WAR geronimo-welcome
    [jar] Building jar: /home/continuum/continuum-1.0.2/apps/continuum/work/68/applications/welcome/target/geronimo-welcome-1.1-SNAPSHOT.war

war:install:
    [echo] Installing...
Uploading to geronimo/wars/geronimo-welcome-1.1-SNAPSHOT.war: 
.................... (33K)
Uploading to geronimo/poms/geronimo-welcome-1.1-SNAPSHOT.pom: 
.................... (10K)


build:end:


Starting the reactor...
new4:
08:33:35,488 INFO  [ReactorTag] Starting the reactor...
Our processing order:
08:33:39,193 INFO  [ReactorTag] Our processing order:
Geronimo Configuration for performing service deployments
08:33:39,193 INFO  [ReactorTag] Geronimo Configuration for performing service deployments
System Configuration for the J2EE Server
08:33:39,193 INFO  [ReactorTag] System Configuration for the J2EE Server
RMI/Naming configuration
08:33:39,193 INFO  [ReactorTag] RMI/Naming configuration
Server Configuration for the J2EE Server
08:33:39,193 INFO  [ReactorTag] Server Configuration for the J2EE Server
System Configuration for the J2EE Client
08:33:39,194 INFO  [ReactorTag] System Configuration for the J2EE Client
Configuration for the J2EE Client
08:33:39,194 INFO  [ReactorTag] Configuration for the J2EE Client
Configuration for performing J2EE deployments
08:33:39,194 INFO  [ReactorTag] Configuration for performing J2EE deployments
System Database Configuration for the J2EE Server
08:33:39,194 INFO  [ReactorTag] System Database Configuration for the J2EE Server
ActiveMQ broker configuration
08:33:39,194 INFO  [ReactorTag] ActiveMQ broker configuration
Activemq configuration
08:33:39,194 INFO  [ReactorTag] Activemq configuration
Corba Configuration for the J2EE Client
08:33:39,194 INFO  [ReactorTag] Corba Configuration for the J2EE Client
Security Configuration for the J2EE Client
08:33:39,194 INFO  [ReactorTag] Security Configuration for the J2EE Client
Security Configuration for the J2EE Server
08:33:39,194 INFO  [ReactorTag] Security Configuration for the J2EE Server
Jetty Configuration for the J2EE Server
08:33:39,194 INFO  [ReactorTag] Jetty Configuration for the J2EE Server
Jetty Deployer Configuration for the J2EE Server
08:33:39,194 INFO  [ReactorTag] Jetty Deployer Configuration for the J2EE Server
Web console deployed on jetty
08:33:39,194 INFO  [ReactorTag] Web console deployed on jetty
Tomcat Configuration for the J2EE Server
08:33:39,194 INFO  [ReactorTag] Tomcat Configuration for the J2EE Server
Tomcat Deployer Configuration for the J2EE Server
08:33:39,194 INFO  [ReactorTag] Tomcat Deployer Configuration for the J2EE Server
Web console deployed on tomcat
08:33:39,195 INFO  [ReactorTag] Web console deployed on tomcat
Daytrader using derby deployed on jetty
08:33:39,195 INFO  [ReactorTag] Daytrader using derby deployed on jetty
Daytrader using derby deployed on tomcat
08:33:39,195 INFO  [ReactorTag] Daytrader using derby deployed on tomcat
Directory Configuration
08:33:39,195 INFO  [ReactorTag] Directory Configuration
Hot deployer
08:33:39,195 INFO  [ReactorTag] Hot deployer
Corba Configuration for the J2EE Server
08:33:39,195 INFO  [ReactorTag] Corba Configuration for the J2EE Server
JavaMail
08:33:39,195 INFO  [ReactorTag] JavaMail
JMX Debug app for Jetty
08:33:39,195 INFO  [ReactorTag] JMX Debug app for Jetty
JMX Debug app Tomcat
08:33:39,195 INFO  [ReactorTag] JMX Debug app Tomcat
JSP Examples for Jetty
08:33:39,195 INFO  [ReactorTag] JSP Examples for Jetty
JSP Examples Tomcat
08:33:39,195 INFO  [ReactorTag] JSP Examples Tomcat
LDAP security realm
08:33:39,195 INFO  [ReactorTag] LDAP security realm
LDAP Demo for Jetty
08:33:39,195 INFO  [ReactorTag] LDAP Demo for Jetty
LDAP Demo for Tomcat
08:33:39,195 INFO  [ReactorTag] LDAP Demo for Tomcat
Online Deployer
08:33:39,196 INFO  [ReactorTag] Online Deployer
Geronimo :: Remote Deploy Jetty Application
08:33:39,196 INFO  [ReactorTag] Geronimo :: Remote Deploy Jetty Application
Geronimo :: Remote Deploy Tomcat Application
08:33:39,196 INFO  [ReactorTag] Geronimo :: Remote Deploy Tomcat Application
Servlet Examples for Jetty
08:33:39,196 INFO  [ReactorTag] Servlet Examples for Jetty
Servlet Examples Tomcat
08:33:39,196 INFO  [ReactorTag] Servlet Examples Tomcat
Shared Library GBean
08:33:39,196 INFO  [ReactorTag] Shared Library GBean
Shutdown
08:33:39,196 INFO  [ReactorTag] Shutdown
UDDI server Configuration for the J2EE Jetty Server
08:33:39,196 INFO  [ReactorTag] UDDI server Configuration for the J2EE Jetty Server
UDDI server Configuration for the J2EE Tomcat Server
08:33:39,196 INFO  [ReactorTag] UDDI server Configuration for the J2EE Tomcat Server
Configuration for no j2ee app clients
08:33:39,196 INFO  [ReactorTag] Configuration for no j2ee app clients
Configuration for no EJBs
08:33:39,196 INFO  [ReactorTag] Configuration for no EJBs
Unavailable Web Services deployer
08:33:39,196 INFO  [ReactorTag] Unavailable Web Services deployer
Welcome app for Jetty
08:33:39,196 INFO  [ReactorTag] Welcome app for Jetty
Welcome app Tomcat
08:33:39,196 INFO  [ReactorTag] Welcome app Tomcat
+----------------------------------------
08:33:39,197 INFO  [ReactorTag] +----------------------------------------
| configurations Geronimo Configuration for performing service deployments
08:33:39,197 INFO  [ReactorTag] | configurations Geronimo Configuration for performing service deployments
| Memory: 38M/41M
08:33:39,197 INFO  [ReactorTag] | Memory: 38M/41M
+----------------------------------------
08:33:39,197 INFO  [ReactorTag] +----------------------------------------
DEPRECATED: the default goal should be specified in the <build> section of project.xml instead of maven.xml
08:33:39,210 WARN  [PluginScriptParser] DEPRECATED: the default goal should be specified in the <build> section of project.xml instead of maven.xml
DEPRECATED: the default goal should be specified in the <build> section of project.xml instead of maven.xml
08:33:39,212 WARN  [PluginScriptParser] DEPRECATED: the default goal should be specified in the <build> section of project.xml instead of maven.xml
build:start:

multiproject:install-callback:
    [echo] Running car:install for Geronimo Configuration for performing service deployments
car:prepare-plan:

car:package:

    Packaging configuration /home/continuum/continuum-1.0.2/apps/continuum/work/68/configs/geronimo-gbean-deployer/target/plan/plan.xml


car:install:
    [echo] Installing...
Uploading to geronimo/cars/geronimo-gbean-deployer-1.1-SNAPSHOT.car: 
.................... (3K)
Uploading to geronimo/poms/geronimo-gbean-deployer-1.1-SNAPSHOT.pom: 
.................... (13K)

+----------------------------------------

build:end:

08:33:40,671 INFO  [ReactorTag] +----------------------------------------
| configurations System Configuration for the J2EE Server
08:33:40,671 INFO  [ReactorTag] | configurations System Configuration for the J2EE Server
| Memory: 35M/57M
08:33:40,671 INFO  [ReactorTag] | Memory: 35M/57M
+----------------------------------------
08:33:40,671 INFO  [ReactorTag] +----------------------------------------
DEPRECATED: the default goal should be specified in the <build> section of project.xml instead of maven.xml
08:33:40,681 WARN  [PluginScriptParser] DEPRECATED: the default goal should be specified in the <build> section of project.xml instead of maven.xml
DEPRECATED: the default goal should be specified in the <build> section of project.xml instead of maven.xml
08:33:40,687 WARN  [PluginScriptParser] DEPRECATED: the default goal should be specified in the <build> section of project.xml instead of maven.xml
You are working offline so the build will continue, but geronimo-gbean-deployer-1.1-SNAPSHOT.car may be out of date!
08:33:40,977 WARN  [DependencyVerifier] You are working offline so the build will continue, but geronimo-gbean-deployer-1.1-SNAPSHOT.car may be out of date!
build:start:

multiproject:install-callback:
    [echo] Running car:install for System Configuration for the J2EE Server

    Packaging configuration /home/continuum/continuum-1.0.2/apps/continuum/work/68/configs/j2ee-system/target/plan/plan.xml

0 [main] DEBUG org.apache.geronimo.kernel.basic.BasicKernel  - Starting boot
246 [main] DEBUG org.apache.geronimo.gbean.runtime.GBeanInstanceState  - GBeanInstanceState for: geronimo/boot/none/car?role=kernel State changed from stopped to starting
247 [main] DEBUG org.apache.geronimo.gbean.runtime.GBeanInstanceState  - GBeanInstanceState for: geronimo/boot/none/car?role=kernel State changed from starting to running
247 [main] DEBUG org.apache.geronimo.kernel.basic.BasicKernel  - Booted
353 [main] DEBUG org.apache.geronimo.gbean.runtime.GBeanInstanceState  - GBeanInstanceState for: geronimo/packaging/fixed/car?configurationName=geronimo/packaging/fixed/car State changed from stopped to starting
354 [main] DEBUG org.apache.geronimo.kernel.config.Configuration  - ClassPath for geronimo/packaging/fixed/car resolved to []
356 [main] DEBUG org.apache.geronimo.kernel.config.Configuration  - Started configuration geronimo/packaging/fixed/car
356 [main] DEBUG org.apache.geronimo.gbean.runtime.GBeanInstanceState  - GBeanInstanceState for: geronimo/packaging/fixed/car?configurationName=geronimo/packaging/fixed/car State changed from starting to running
461 [main] DEBUG org.apache.geronimo.gbean.runtime.GBeanInstanceState  - GBeanInstanceState for: geronimo/packaging/fixed/car?j2eeType=ConfigurationStore,name=ConfigStore State changed from stopped to starting
461 [main] DEBUG org.apache.geronimo.gbean.runtime.GBeanSingleReference  - Waiting to start geronimo/packaging/fixed/car?j2eeType=ConfigurationStore,name=ConfigStore because no targets are running for reference Repository matching the patterns geronimo/packaging/fixed/car?j2eeType=Repository,name=Repository
461 [main] DEBUG org.apache.geronimo.gbean.runtime.GBeanInstanceState  - GBeanInstanceState for: geronimo/packaging/fixed/car?j2eeType=ArtifactResolver,name=ArtifactResolver State changed from stopped to starting
529 [main] DEBUG org.apache.geronimo.gbean.runtime.GBeanSingleReference  - Waiting to start geronimo/packaging/fixed/car?j2eeType=ArtifactResolver,name=ArtifactResolver because no targets are running for reference ArtifactManager matching the patterns geronimo/packaging/fixed/car?j2eeType=ArtifactManager,name=ArtifactManager
529 [main] DEBUG org.apache.geronimo.gbean.runtime.GBeanInstanceState  - GBeanInstanceState for: geronimo/packaging/fixed/car?j2eeType=ArtifactManager,name=ArtifactManager State changed from stopped to starting
530 [main] DEBUG org.apache.geronimo.gbean.runtime.GBeanInstanceState  - GBeanInstanceState for: geronimo/packaging/fixed/car?j2eeType=ArtifactManager,name=ArtifactManager State changed from starting to running
530 [main] DEBUG org.apache.geronimo.gbean.runtime.GBeanInstanceState  - GBeanInstanceState for: geronimo/packaging/fixed/car?j2eeType=ConfigurationManager,name=ConfigManager State changed from stopped to starting
530 [main] DEBUG org.apache.geronimo.gbean.runtime.GBeanSingleReference  - Waiting to start geronimo/packaging/fixed/car?j2eeType=ConfigurationManager,name=ConfigManager because no targets are running for reference ArtifactResolver matching the patterns geronimo/packaging/fixed/car?j2eeType=ArtifactResolver,name=ArtifactResolver
558 [main] DEBUG org.apache.geronimo.gbean.runtime.GBeanSingleReference  - Waiting to start geronimo/packaging/fixed/car?j2eeType=ConfigurationManager,name=ConfigManager because no targets are running for reference AttributeStore matching the patterns geronimo/packaging/fixed/car?j2eeType=GBean,name=AttributeStore
601 [main] DEBUG org.apache.geronimo.gbean.runtime.GBeanInstanceState  - Checking if parent is running: parent=geronimo/packaging/fixed/car?configurationName=geronimo/packaging/fixed/car
601 [main] DEBUG org.apache.geronimo.gbean.runtime.GBeanInstanceState  - Parent is running: parent=geronimo/packaging/fixed/car?configurationName=geronimo/packaging/fixed/car
602 [main] DEBUG org.apache.geronimo.gbean.runtime.GBeanInstanceState  - GBeanInstanceState for: geronimo/packaging/fixed/car?j2eeType=ArtifactResolver,name=ArtifactResolver State changed from starting to running
602 [main] DEBUG org.apache.geronimo.gbean.runtime.GBeanInstanceState  - Checking if parent is running: parent=geronimo/packaging/fixed/car?configurationName=geronimo/packaging/fixed/car
602 [main] DEBUG org.apache.geronimo.gbean.runtime.GBeanInstanceState  - Parent is running: parent=geronimo/packaging/fixed/car?configurationName=geronimo/packaging/fixed/car
602 [main] DEBUG org.apache.geronimo.gbean.runtime.GBeanInstanceState  - Checking if parent is running: parent=geronimo/packaging/fixed/car?j2eeType=ArtifactManager,name=ArtifactManager
602 [main] DEBUG org.apache.geronimo.gbean.runtime.GBeanInstanceState  - Parent is running: parent=geronimo/packaging/fixed/car?j2eeType=ArtifactManager,name=ArtifactManager
629 [main] DEBUG org.apache.geronimo.gbean.runtime.GBeanSingleReference  - Waiting to start geronimo/packaging/fixed/car?j2eeType=ConfigurationManager,name=ConfigManager because no targets are running for reference AttributeStore matching the patterns geronimo/packaging/fixed/car?j2eeType=GBean,name=AttributeStore
629 [main] DEBUG org.apache.geronimo.gbean.runtime.GBeanInstanceState  - GBeanInstanceState for: geronimo/packaging/fixed/car?j2eeType=GBean,name=AttributeStore State changed from stopped to starting
629 [main] DEBUG org.apache.geronimo.gbean.runtime.GBeanInstanceState  - GBeanInstanceState for: geronimo/packaging/fixed/car?j2eeType=GBean,name=AttributeStore State changed from starting to running
629 [main] DEBUG org.apache.geronimo.gbean.runtime.GBeanInstanceState  - Checking if parent is running: parent=geronimo/packaging/fixed/car?configurationName=geronimo/packaging/fixed/car
629 [main] DEBUG org.apache.geronimo.gbean.runtime.GBeanInstanceState  - Parent is running: parent=geronimo/packaging/fixed/car?configurationName=geronimo/packaging/fixed/car
629 [main] DEBUG org.apache.geronimo.gbean.runtime.GBeanInstanceState  - Checking if parent is running: parent=geronimo/packaging/fixed/car?j2eeType=ArtifactResolver,name=ArtifactResolver
629 [main] DEBUG org.apache.geronimo.gbean.runtime.GBeanInstanceState  - Parent is running: parent=geronimo/packaging/fixed/car?j2eeType=ArtifactResolver,name=ArtifactResolver
629 [main] DEBUG org.apache.geronimo.gbean.runtime.GBeanInstanceState  - Checking if parent is running: parent=geronimo/packaging/fixed/car?j2eeType=ArtifactManager,name=ArtifactManager
629 [main] DEBUG org.apache.geronimo.gbean.runtime.GBeanInstanceState  - Parent is running: parent=geronimo/packaging/fixed/car?j2eeType=ArtifactManager,name=ArtifactManager
664 [main] DEBUG org.apache.geronimo.gbean.runtime.GBeanInstanceState  - GBeanInstanceState for: geronimo/packaging/fixed/car?j2eeType=ConfigurationManager,name=ConfigManager State changed from starting to running
664 [main] DEBUG org.apache.geronimo.gbean.runtime.GBeanInstanceState  - GBeanInstanceState for: geronimo/packaging/fixed/car?j2eeType=Repository,name=Repository State changed from stopped to starting
665 [main] DEBUG org.apache.geronimo.system.repository.AbstractRepository  - Repository root is /home/continuum/.geronimo-1.1-maven/repository
666 [main] DEBUG org.apache.geronimo.gbean.runtime.GBeanInstanceState  - GBeanInstanceState for: geronimo/packaging/fixed/car?j2eeType=Repository,name=Repository State changed from starting to running
666 [main] DEBUG org.apache.geronimo.gbean.runtime.GBeanInstanceState  - Checking if parent is running: parent=geronimo/packaging/fixed/car?configurationName=geronimo/packaging/fixed/car
666 [main] DEBUG org.apache.geronimo.gbean.runtime.GBeanInstanceState  - Parent is running: parent=geronimo/packaging/fixed/car?configurationName=geronimo/packaging/fixed/car
693 [main] DEBUG org.apache.geronimo.gbean.runtime.GBeanInstanceState  - GBeanInstanceState for: geronimo/packaging/fixed/car?j2eeType=ConfigurationStore,name=ConfigStore State changed from starting to running
java.lang.reflect.InvocationTargetException: null
java.lang.reflect.InvocationTargetException
	at sun.reflect.NativeMethodAccessorImpl.invoke0(Native Method)
	at sun.reflect.NativeMethodAccessorImpl.invoke(NativeMethodAccessorImpl.java:39)
	at sun.reflect.DelegatingMethodAccessorImpl.invoke(DelegatingMethodAccessorImpl.java:25)
	at java.lang.reflect.Method.invoke(Method.java:324)
	at org.apache.geronimo.plugin.packaging.PackageBuilderShell.execute(PackageBuilderShell.java:220)
	at sun.reflect.NativeMethodAccessorImpl.invoke0(Native Method)
	at sun.reflect.NativeMethodAccessorImpl.invoke(NativeMethodAccessorImpl.java:39)
	at sun.reflect.DelegatingMethodAccessorImpl.invoke(DelegatingMethodAccessorImpl.java:25)
	at java.lang.reflect.Method.invoke(Method.java:324)
	at org.apache.commons.jelly.impl.DynamicBeanTag.doTag(DynamicBeanTag.java:180)
	at org.apache.commons.jelly.impl.StaticTagScript.run(StaticTagScript.java:102)
	at org.apache.commons.jelly.impl.ScriptBlock.run(ScriptBlock.java:95)
	at org.apache.maven.jelly.tags.werkz.MavenGoalTag.runBodyTag(MavenGoalTag.java:78)
	at org.apache.maven.jelly.tags.werkz.MavenGoalTag$MavenGoalAction.performAction(MavenGoalTag.java:109)
	at org.apache.maven.werkz.Goal.fire(Goal.java:656)
	at org.apache.maven.werkz.Goal.attain(Goal.java:592)
	at org.apache.maven.werkz.Goal.attainPrecursors(Goal.java:505)
	at org.apache.maven.werkz.Goal.attain(Goal.java:590)
	at org.apache.maven.werkz.WerkzProject.attainGoal(WerkzProject.java:210)
	at org.apache.maven.jelly.tags.werkz.MavenAttainGoalTag.doTag(MavenAttainGoalTag.java:114)
	at org.apache.commons.jelly.impl.TagScript.run(TagScript.java:247)
	at org.apache.commons.jelly.impl.ScriptBlock.run(ScriptBlock.java:95)
	at org.apache.maven.jelly.tags.werkz.MavenGoalTag.runBodyTag(MavenGoalTag.java:78)
	at org.apache.maven.jelly.tags.werkz.MavenGoalTag$MavenGoalAction.performAction(MavenGoalTag.java:109)
	at org.apache.maven.werkz.Goal.fire(Goal.java:656)
	at org.apache.maven.werkz.Goal.attain(Goal.java:592)
	at org.apache.maven.plugin.PluginManager.attainGoals(PluginManager.java:693)
	at org.apache.maven.MavenSession.attainGoals(MavenSession.java:263)
	at org.apache.maven.jelly.tags.maven.ReactorTag.doTag(ReactorTag.java:368)
	at org.apache.commons.jelly.impl.TagScript.run(TagScript.java:247)
	at org.apache.commons.jelly.impl.ScriptBlock.run(ScriptBlock.java:95)
	at org.apache.maven.jelly.tags.werkz.MavenGoalTag.runBodyTag(MavenGoalTag.java:78)
	at org.apache.maven.jelly.tags.werkz.MavenGoalTag$MavenGoalAction.performAction(MavenGoalTag.java:109)
	at org.apache.maven.werkz.Goal.fire(Goal.java:656)
	at org.apache.maven.werkz.Goal.attain(Goal.java:592)
	at org.apache.maven.werkz.WerkzProject.attainGoal(WerkzProject.java:210)
	at org.apache.maven.jelly.tags.werkz.MavenAttainGoalTag.doTag(MavenAttainGoalTag.java:114)
	at org.apache.commons.jelly.impl.TagScript.run(TagScript.java:247)
	at org.apache.commons.jelly.impl.ScriptBlock.run(ScriptBlock.java:95)
	at org.apache.maven.jelly.tags.werkz.MavenGoalTag.runBodyTag(MavenGoalTag.java:78)
	at org.apache.maven.jelly.tags.werkz.MavenGoalTag$MavenGoalAction.performAction(MavenGoalTag.java:109)
	at org.apache.maven.werkz.Goal.fire(Goal.java:656)
	at org.apache.maven.werkz.Goal.attain(Goal.java:592)
	at org.apache.maven.plugin.PluginManager.attainGoals(PluginManager.java:693)
	at org.apache.maven.MavenSession.attainGoals(MavenSession.java:263)
	at org.apache.maven.cli.App.doMain(App.java:511)
	at org.apache.maven.cli.App.main(App.java:1258)
	at sun.reflect.NativeMethodAccessorImpl.invoke0(Native Method)
	at sun.reflect.NativeMethodAccessorImpl.invoke(NativeMethodAccessorImpl.java:39)
	at sun.reflect.DelegatingMethodAccessorImpl.invoke(DelegatingMethodAccessorImpl.java:25)
	at java.lang.reflect.Method.invoke(Method.java:324)
	at com.werken.forehead.Forehead.run(Forehead.java:551)
	at com.werken.forehead.Forehead.main(Forehead.java:581)
Caused by: java.lang.NoSuchMethodError: org.apache.geronimo.kernel.config.ConfigurationManager.loadConfiguration(Lorg/apache/geronimo/kernel/repository/Artifact;)V
	at org.apache.geronimo.plugin.packaging.PackageBuilder.execute(PackageBuilder.java:240)
	... 53 more
car:prepare-plan:

car:package:
08:33:42,012 ERROR [PlanProcessor] java.lang.reflect.InvocationTargetException: null
java.lang.reflect.InvocationTargetException
	at sun.reflect.NativeMethodAccessorImpl.invoke0(Native Method)
	at sun.reflect.NativeMethodAccessorImpl.invoke(NativeMethodAccessorImpl.java:39)
	at sun.reflect.DelegatingMethodAccessorImpl.invoke(DelegatingMethodAccessorImpl.java:25)
	at java.lang.reflect.Method.invoke(Method.java:324)
	at org.apache.geronimo.plugin.packaging.PackageBuilderShell.execute(PackageBuilderShell.java:220)
	at sun.reflect.NativeMethodAccessorImpl.invoke0(Native Method)
	at sun.reflect.NativeMethodAccessorImpl.invoke(NativeMethodAccessorImpl.java:39)
	at sun.reflect.DelegatingMethodAccessorImpl.invoke(DelegatingMethodAccessorImpl.java:25)
	at java.lang.reflect.Method.invoke(Method.java:324)
	at org.apache.commons.jelly.impl.DynamicBeanTag.doTag(DynamicBeanTag.java:180)
	at org.apache.commons.jelly.impl.StaticTagScript.run(StaticTagScript.java:102)
	at org.apache.commons.jelly.impl.ScriptBlock.run(ScriptBlock.java:95)
	at org.apache.maven.jelly.tags.werkz.MavenGoalTag.runBodyTag(MavenGoalTag.java:78)
	at org.apache.maven.jelly.tags.werkz.MavenGoalTag$MavenGoalAction.performAction(MavenGoalTag.java:109)
	at org.apache.maven.werkz.Goal.fire(Goal.java:656)
	at org.apache.maven.werkz.Goal.attain(Goal.java:592)
	at org.apache.maven.werkz.Goal.attainPrecursors(Goal.java:505)
	at org.apache.maven.werkz.Goal.attain(Goal.java:590)
	at org.apache.maven.werkz.WerkzProject.attainGoal(WerkzProject.java:210)
	at org.apache.maven.jelly.tags.werkz.MavenAttainGoalTag.doTag(MavenAttainGoalTag.java:114)
	at org.apache.commons.jelly.impl.TagScript.run(TagScript.java:247)
	at org.apache.commons.jelly.impl.ScriptBlock.run(ScriptBlock.java:95)
	at org.apache.maven.jelly.tags.werkz.MavenGoalTag.runBodyTag(MavenGoalTag.java:78)
	at org.apache.maven.jelly.tags.werkz.MavenGoalTag$MavenGoalAction.performAction(MavenGoalTag.java:109)
	at org.apache.maven.werkz.Goal.fire(Goal.java:656)
	at org.apache.maven.werkz.Goal.attain(Goal.java:592)
	at org.apache.maven.plugin.PluginManager.attainGoals(PluginManager.java:693)
	at org.apache.maven.MavenSession.attainGoals(MavenSession.java:263)
	at org.apache.maven.jelly.tags.maven.ReactorTag.doTag(ReactorTag.java:368)
	at org.apache.commons.jelly.impl.TagScript.run(TagScript.java:247)
	at org.apache.commons.jelly.impl.ScriptBlock.run(ScriptBlock.java:95)
	at org.apache.maven.jelly.tags.werkz.MavenGoalTag.runBodyTag(MavenGoalTag.java:78)
	at org.apache.maven.jelly.tags.werkz.MavenGoalTag$MavenGoalAction.performAction(MavenGoalTag.java:109)
	at org.apache.maven.werkz.Goal.fire(Goal.java:656)
	at org.apache.maven.werkz.Goal.attain(Goal.java:592)
	at org.apache.maven.werkz.WerkzProject.attainGoal(WerkzProject.java:210)
	at org.apache.maven.jelly.tags.werkz.MavenAttainGoalTag.doTag(MavenAttainGoalTag.java:114)
	at org.apache.commons.jelly.impl.TagScript.run(TagScript.java:247)
	at org.apache.commons.jelly.impl.ScriptBlock.run(ScriptBlock.java:95)
	at org.apache.maven.jelly.tags.werkz.MavenGoalTag.runBodyTag(MavenGoalTag.java:78)
	at org.apache.maven.jelly.tags.werkz.MavenGoalTag$MavenGoalAction.performAction(MavenGoalTag.java:109)
	at org.apache.maven.werkz.Goal.fire(Goal.java:656)
	at org.apache.maven.werkz.Goal.attain(Goal.java:592)
	at org.apache.maven.plugin.PluginManager.attainGoals(PluginManager.java:693)
	at org.apache.maven.MavenSession.attainGoals(MavenSession.java:263)
	at org.apache.maven.cli.App.doMain(App.java:511)
	at org.apache.maven.cli.App.main(App.java:1258)
	at sun.reflect.NativeMethodAccessorImpl.invoke0(Native Method)
	at sun.reflect.NativeMethodAccessorImpl.invoke(NativeMethodAccessorImpl.java:39)
	at sun.reflect.DelegatingMethodAccessorImpl.invoke(DelegatingMethodAccessorImpl.java:25)
	at java.lang.reflect.Method.invoke(Method.java:324)
	at com.werken.forehead.Forehead.run(Forehead.java:551)
	at com.werken.forehead.Forehead.main(Forehead.java:581)
Caused by: java.lang.NoSuchMethodError: org.apache.geronimo.kernel.config.ConfigurationManager.loadConfiguration(Lorg/apache/geronimo/kernel/repository/Artifact;)V
	at org.apache.geronimo.plugin.packaging.PackageBuilder.execute(PackageBuilder.java:240)
	... 53 more

BUILD FAILED
File...... /home/continuum/continuum-1.0.2/apps/continuum/work/68/maven.xml
Element... maven:reactor
Line...... 58
Column.... -1
Unable to obtain goal [multiproject:install-callback] -- /home/continuum/.geronimo-1.1-maven/cache/geronimo-packaging-plugin-1.1.0-4/plugin.jelly:64:-1: <car:package> null
Total time   : 3 minutes 42 seconds 
08:33:42,277 INFO  [App] Total time   : 3 minutes 42 seconds 
Finished at  : Tuesday, April 18, 2006 8:33:42 AM PDT
08:33:42,278 INFO  [App] Finished at  : Tuesday, April 18, 2006 8:33:42 AM PDT

08:33:42,278 INFO  [App] 

****************************************************************************



Mime
View raw message