geronimo-scm mailing list archives

Site index · List index
Message view « Date » · « Thread »
Top « Date » · « Thread »
From continuum <contin...@stan.gbuild.org>
Subject [continuum] BUILD FAILURE: Java Mail
Date Mon, 27 Feb 2006 18:09:08 GMT
Online report : http://ci.gbuild.org/continuum/servlet/continuum/target/ProjectBuild.vm/view/ProjectBuild/id/57/buildId/776
Build statistics:
  State: Failed
  Previous State: Ok
  Started at: Mon, 27 Feb 2006 10:08:48 -0800
  Finished at: Mon, 27 Feb 2006 10:09:07 -0800
  Total time: 19s
  Build Trigger: Schedule
  Exit code: 1
  Building machine hostname: stan.gbuild.org
  Operating system : Linux(unknown)
  Java version : 1.4.2_08(Sun Microsystems Inc.)

Changes
                            src/test/java/javax/mail/internet/ContentDispositionTest.java
            src/test/java/javax/mail/internet/NewsAddressTest.java
            src/test/java/javax/mail/internet/HeaderTokenizerTest.java
            src/test/java/javax/mail/internet/ContentTypeTest.java
            src/test/java/javax/mail/internet/MimeMessageTest.java
            src/test/java/javax/mail/internet/ParameterListTest.java
            src/main/java/org/apache/geronimo/mail/util/Base64EncoderStream.java
            src/main/java/org/apache/geronimo/mail/util/QuotedPrintableEncoder.java
            src/main/java/org/apache/geronimo/mail/util/QuotedPrintable.java
            src/main/java/org/apache/geronimo/mail/util/QuotedPrintableDecoderStream.java
            src/main/java/org/apache/geronimo/mail/util/UUEncoderStream.java
            src/main/java/org/apache/geronimo/mail/util/UUEncode.java
            src/main/java/org/apache/geronimo/mail/util/XTextEncoder.java
            src/main/java/org/apache/geronimo/mail/util/QuotedPrintableEncoderStream.java
            src/main/java/org/apache/geronimo/mail/util/SessionUtil.java
            src/main/java/org/apache/geronimo/mail/util/RFC2231Encoder.java
            src/main/java/org/apache/geronimo/mail/util/Base64Encoder.java
            src/main/java/org/apache/geronimo/mail/util/Base64.java
            src/main/java/org/apache/geronimo/mail/util/Base64DecoderStream.java
            src/main/java/org/apache/geronimo/mail/util/ASCIIUtil.java
            src/main/java/org/apache/geronimo/mail/util/UUEncoder.java
            src/main/java/org/apache/geronimo/mail/util/UUDecoderStream.java
            src/main/java/org/apache/geronimo/mail/util/StringBufferOutputStream.java
            src/main/java/javax/mail/internet/ContentDisposition.java
            src/main/java/javax/mail/internet/MimeUtility.java
            src/main/java/javax/mail/internet/ParameterList.java
            src/main/java/javax/mail/internet/ContentType.java
            src/main/java/javax/mail/internet/NewsAddress.java
            src/main/java/javax/mail/internet/HeaderTokenizer.java
            src/main/java/javax/mail/internet/InternetHeaders.java
            src/main/java/javax/mail/internet/MimeMessage.java
            src/main/java/javax/mail/internet/MimeBodyPart.java
            src/main/java/javax/mail/internet/InternetAddress.java
            src/main/resources/META-INF/javamail.charset.map
        
****************************************************************************
Output:
****************************************************************************
[INFO] Scanning for projects...
[INFO] ----------------------------------------------------------------------------
[INFO] Building Java Mail
[INFO]    task-segment: [clean, install]
[INFO] ----------------------------------------------------------------------------
[INFO] artifact org.apache.maven.plugins:maven-clean-plugin: checking for updates from plugin-snapshots
[INFO] snapshot org.apache.maven.plugins:maven-clean-plugin:2.1-SNAPSHOT: checking for updates
from plugin-snapshots
[INFO] artifact org.apache.maven.plugins:maven-one-plugin: checking for updates from plugin-snapshots
[INFO] snapshot org.apache.maven.plugins:maven-one-plugin:1.0-SNAPSHOT: checking for updates
from plugin-snapshots
[INFO] artifact org.apache.maven.plugins:maven-compiler-plugin: checking for updates from
plugin-snapshots
[INFO] snapshot org.apache.maven.plugins:maven-compiler-plugin:2.0.1-SNAPSHOT: checking for
updates from plugin-snapshots
[INFO] snapshot org.apache.maven.shared:file-management:1.0-SNAPSHOT: checking for updates
from plugin-snapshots
[INFO] snapshot org.apache.maven.shared:file-management:1.0-SNAPSHOT: checking for updates
from snapshots
[INFO] snapshot org.apache.maven.shared:shared-components-parent:1.0-SNAPSHOT: checking for
updates from plugin-snapshots
[INFO] snapshot org.apache.maven.shared:shared-components-parent:1.0-SNAPSHOT: checking for
updates from snapshots
[INFO] [clean:clean]
[INFO] Deleting directory /home/continuum/continuum-1.0.2/apps/continuum/work/57/target
[INFO] Deleting directory /home/continuum/continuum-1.0.2/apps/continuum/work/57/target/classes
[INFO] Deleting directory /home/continuum/continuum-1.0.2/apps/continuum/work/57/target/test-classes
[INFO] artifact org.apache.maven.plugins:maven-resources-plugin: checking for updates from
plugin-snapshots
[INFO] artifact org.apache.maven.plugins:maven-surefire-plugin: checking for updates from
plugin-snapshots
[INFO] snapshot org.apache.maven.plugins:maven-surefire-plugin:2.1.3-SNAPSHOT: checking for
updates from plugin-snapshots
[INFO] artifact org.apache.maven.plugins:maven-jar-plugin: checking for updates from plugin-snapshots
[INFO] snapshot org.apache.maven.plugins:maven-jar-plugin:2.1-SNAPSHOT: checking for updates
from plugin-snapshots
[INFO] artifact org.apache.maven.plugins:maven-install-plugin: checking for updates from plugin-snapshots
[INFO] [resources:resources]
[INFO] Using default encoding to copy filtered resources.
[INFO] snapshot org.codehaus.plexus:plexus-compiler-javac:1.6-SNAPSHOT: checking for updates
from plugin-snapshots
[INFO] snapshot org.codehaus.plexus:plexus-compiler-javac:1.6-SNAPSHOT: checking for updates
from snapshots
[INFO] snapshot org.codehaus.plexus:plexus-compilers:1.6-SNAPSHOT: checking for updates from
plugin-snapshots
[INFO] snapshot org.codehaus.plexus:plexus-compilers:1.6-SNAPSHOT: checking for updates from
snapshots
[INFO] snapshot org.codehaus.plexus:plexus-compiler:1.6-SNAPSHOT: checking for updates from
plugin-snapshots
[INFO] snapshot org.codehaus.plexus:plexus-compiler:1.6-SNAPSHOT: checking for updates from
snapshots
[INFO] snapshot org.codehaus.plexus:plexus-compiler-api:1.6-SNAPSHOT: checking for updates
from plugin-snapshots
[INFO] snapshot org.codehaus.plexus:plexus-compiler-api:1.6-SNAPSHOT: checking for updates
from snapshots
[INFO] snapshot org.codehaus.plexus:plexus-compiler-manager:1.6-SNAPSHOT: checking for updates
from plugin-snapshots
[INFO] snapshot org.codehaus.plexus:plexus-compiler-manager:1.6-SNAPSHOT: checking for updates
from snapshots
[INFO] [compiler:compile]
Compiling 118 source files to /home/continuum/continuum-1.0.2/apps/continuum/work/57/target/classes
[INFO] [resources:testResources]
[INFO] Using default encoding to copy filtered resources.
[INFO] [compiler:testCompile]
Compiling 28 source files to /home/continuum/continuum-1.0.2/apps/continuum/work/57/target/test-classes
[INFO] snapshot org.apache.maven.surefire:surefire-booter:1.5.3-SNAPSHOT: checking for updates
from plugin-snapshots
[INFO] snapshot org.apache.maven.surefire:surefire-booter:1.5.3-SNAPSHOT: checking for updates
from snapshots
[INFO] snapshot org.apache.maven.surefire:surefire:1.5.3-SNAPSHOT: checking for updates from
plugin-snapshots
[INFO] snapshot org.apache.maven.surefire:surefire:1.5.3-SNAPSHOT: checking for updates from
snapshots
[INFO] [surefire:test]
[INFO] Setting reports dir: /home/continuum/continuum-1.0.2/apps/continuum/work/57/target/surefire-reports

-------------------------------------------------------
 T E S T S
-------------------------------------------------------
[surefire] Running javax.mail.FlagsTest
[surefire] Tests run: 8, Failures: 0, Errors: 0, Time elapsed: 0.034 sec
[surefire] Running javax.mail.MessagingExceptionTest
[surefire] Tests run: 5, Failures: 0, Errors: 0, Time elapsed: 0.006 sec
[surefire] Running javax.mail.PasswordAuthenticationTest
[surefire] Tests run: 2, Failures: 0, Errors: 0, Time elapsed: 0.005 sec
[surefire] Running javax.mail.MessageContextTest
[surefire] Tests run: 1, Failures: 0, Errors: 0, Time elapsed: 0.001 sec
Get header returned [Ljava.lang.String;@113981b
Get all recipients returns 3
Received address geronimo-dev of type news
[surefire] Running javax.mail.internet.MimeMessageTest
[surefire] Tests run: 8, Failures: 2, Errors: 0, Time elapsed: 0.122 sec <<<<<<<<
FAILURE !! 
[surefire] Running javax.mail.internet.InternetAddressTest
[surefire] Tests run: 17, Failures: 0, Errors: 0, Time elapsed: 0.04 sec
Doing error test with (Geronimo
Doing error test with ((Geronimo)
Doing error test with "Geronimo
Doing error test with "Geronimo\
[surefire] Running javax.mail.internet.HeaderTokenizerTest
[surefire] Tests run: 4, Failures: 0, Errors: 0, Time elapsed: 0.003 sec
[surefire] Running javax.mail.internet.NewsAddressTest
[surefire] Tests run: 1, Failures: 0, Errors: 0, Time elapsed: 0.003 sec
[surefire] Running javax.mail.internet.ParameterListTest
[surefire] Tests run: 2, Failures: 0, Errors: 0, Time elapsed: 0.001 sec
[surefire] Running javax.mail.internet.ContentDispositionTest
[surefire] Tests run: 1, Failures: 0, Errors: 0, Time elapsed: 0.002 sec
[surefire] Running javax.mail.internet.InternetHeadersTest
[surefire] Tests run: 1, Failures: 0, Errors: 0, Time elapsed: 0.001 sec
------=_Part_1.1141063747247
foo:bar

Hello World
------=_Part_1.1141063747247

Hello Again
------=_Part_1.1141063747247--
[surefire] Running javax.mail.internet.MimeMultipartTest
[surefire] Tests run: 1, Failures: 0, Errors: 0, Time elapsed: 0.003 sec
Type string value is text/plain
[surefire] Running javax.mail.internet.ContentTypeTest
[surefire] Tests run: 15, Failures: 0, Errors: 0, Time elapsed: 0.009 sec
[surefire] Running javax.mail.internet.MailDateFormatTest
[surefire] Tests run: 1, Failures: 0, Errors: 0, Time elapsed: 0.003 sec
[surefire] Running javax.mail.event.MessageCountEventTest
[surefire] Tests run: 1, Failures: 0, Errors: 0, Time elapsed: 0.011 sec
[surefire] Running javax.mail.event.FolderEventTest
[surefire] Tests run: 1, Failures: 0, Errors: 0, Time elapsed: 0.005 sec
[surefire] Running javax.mail.event.StoreEventTest
[surefire] Tests run: 1, Failures: 0, Errors: 0, Time elapsed: 0.003 sec
[surefire] Running javax.mail.event.TransportEventTest
[surefire] Tests run: 1, Failures: 0, Errors: 0, Time elapsed: 0.006 sec
[surefire] Running javax.mail.event.MessageChangedEventTest
[surefire] Tests run: 1, Failures: 0, Errors: 0, Time elapsed: 0.002 sec
[surefire] Running javax.mail.event.ConnectionEventTest
[surefire] Tests run: 1, Failures: 0, Errors: 0, Time elapsed: 0.003 sec
[surefire] Running javax.mail.URLNameTest
[surefire] Tests run: 7, Failures: 0, Errors: 0, Time elapsed: 0.19 sec
[surefire] Running javax.mail.HeaderTest
[surefire] Tests run: 1, Failures: 0, Errors: 0, Time elapsed: 0.001 sec

Results :
[surefire] Tests run: 81, Failures: 2, Errors: 0

[INFO] ----------------------------------------------------------------------------
[ERROR] BUILD ERROR
[INFO] ----------------------------------------------------------------------------
[INFO] There are some test failure.
[INFO] ----------------------------------------------------------------------------
[INFO] For more information, run Maven with the -e switch
[INFO] ----------------------------------------------------------------------------
[INFO] Total time: 17 seconds
[INFO] Finished at: Mon Feb 27 10:09:07 PST 2006
[INFO] Final Memory: 4M/18M
[INFO] ----------------------------------------------------------------------------

****************************************************************************



Mime
View raw message